<svg xmlns="http://www.w3.org/2000/svg" width="567" height="235" fill="none" viewBox="0 0 567 235">
  <g class="Text">
    <path fill="#F4F5F7" d="M0 0h567v235H0z"/>
    <g class="Group 4">
      <path fill="#C4C4C4" d="M60 30h197v24H60z" class="Rectangle 15"/>
      <g class="Group 1">
        <path fill="#C4C4C4" d="M60 85h236.133v9H60z" class="Rectangle 16"/>
        <path fill="#C4C4C4" d="M60 76h232v9H60z" class="Rectangle 22"/>
        <path fill="#C4C4C4" d="M60 67h250v9H60z" class="Rectangle 23"/>
        <path fill="#C4C4C4" d="M60 94h263.455v9H60z" class="Rectangle 17"/>
        <path fill="#C4C4C4" d="M60 103h310v9H60z" class="Rectangle 18"/>
        <path fill="#C4C4C4" d="M60 112h298.582v10H60z" class="Rectangle 19"/>
        <path fill="#C4C4C4" d="M60 122h307v9H60z" class="Rectangle 20"/>
        <path fill="#C4C4C4" d="M60 131h319v9H60z" class="Rectangle 21"/>
      </g>
      <g class="Group 2">
        <path fill="#C4C4C4" d="M60 147h121v9H60z" class="Rectangle 16_2"/>
        <path fill="#C4C4C4" d="M60 156h135v9H60z" class="Rectangle 17_2"/>
        <path fill="#C4C4C4" d="M60 165h165v9H60z" class="Rectangle 18_2"/>
        <path fill="#C4C4C4" d="M60 174h153v10H60z" class="Rectangle 19_2"/>
        <path fill="#C4C4C4" d="M60 184h132v9H60z" class="Rectangle 20_2"/>
        <path fill="#C4C4C4" d="M60 193h141v9H60z" class="Rectangle 21_2"/>
      </g>
    </g>
  </g>
</svg>
