<svg xmlns="http://www.w3.org/2000/svg" width="567" height="235" fill="none" viewBox="0 0 567 235">
  <g class="TextWImage_1">
    <path fill="#F4F5F7" d="M0 0h567v235H0z"/>
    <g class="Group 4">
      <path fill="#C4C4C4" d="M310 30h197v175H310z" class="Rectangle 13"/>
      <path fill="#C4C4C4" d="M60 30h107v13H60z" class="Rectangle 14"/>
      <path fill="#C4C4C4" d="M60 50h197v24H60z" class="Rectangle 15"/>
      <g class="Group 1">
        <path fill="#C4C4C4" d="M60 85h121v9H60z" class="Rectangle 16"/>
        <path fill="#C4C4C4" d="M60 94h135v9H60z" class="Rectangle 17"/>
        <path fill="#C4C4C4" d="M60 103h165v9H60z" class="Rectangle 18"/>
        <path fill="#C4C4C4" d="M60 112h153v10H60z" class="Rectangle 19"/>
        <path fill="#C4C4C4" d="M60 122h132v9H60z" class="Rectangle 20"/>
        <path fill="#C4C4C4" d="M60 131h141v9H60z" class="Rectangle 21"/>
      </g>
    </g>
    <g class="Component 1">
      <path fill="#949494" d="M394.5 108l19.5 32h-39l19.5-32z" class="Polygon 1"/>
      <path fill="#949494" d="M407 90l19.919 42h-39.838L407 90z" class="Polygon 2"/>
      <path fill="#949494" d="M423 100l24.249 39.75h-48.498L423 100z" class="Polygon 3"/>
    </g>
  </g>
</svg>
