<svg xmlns="http://www.w3.org/2000/svg" width="24" height="24" fill="currentColor" viewBox="0 0 24 24">
  <path fill-rule="evenodd" d="M11.99 2C6.47 2 2 6.48 2 12s4.47 10 9.99 10C17.52 22 22 17.52 22 12S17.52 2 11.99 2zm-.27 5h.06c.4 0 .72.32.72.72v4.54l3.87 2.3a.71.71 0 01.25.99c-.2.34-.64.44-.98.24l-4.15-2.49a.99.99 0 01-.49-.86V7.72c0-.4.32-.72.72-.72z" clip-rule="evenodd"/>
</svg>
