<svg xmlns="http://www.w3.org/2000/svg" width="24" height="24" fill="currentColor" viewBox="0 0 24 24">
  <path fill-rule="evenodd" d="M7.474 5.034a.8.8 0 000 1.13l3.96 3.96a.8.8 0 001.13 0l3.96-3.96a.8.8 0 000-1.13l-3.96-3.96a.8.8 0 00-1.13 0l-3.96 3.96zm6.398 6.4a.8.8 0 000 1.13l3.96 3.96a.8.8 0 001.131 0l3.96-3.96a.8.8 0 000-1.13l-3.96-3.96a.8.8 0 00-1.131 0l-3.959 3.96h-.001zm-6.4 7.53a.8.8 0 010-1.13l3.96-3.96a.8.8 0 011.131 0l3.96 3.96a.8.8 0 010 1.13l-3.96 3.96a.8.8 0 01-1.131 0l-3.96-3.958v-.001zm-6.397-7.53a.8.8 0 000 1.132l3.959 3.959a.8.8 0 001.13 0l3.96-3.959a.801.801 0 000-1.132l-3.96-3.959a.8.8 0 00-1.13 0l-3.96 3.959h.001z" clip-rule="evenodd"/>
</svg>
