<svg width="51" height="67" viewBox="0 0 51 67" fill="none" xmlns="http://www.w3.org/2000/svg">
<path fill-rule="evenodd" clip-rule="evenodd" d="M10 3C4.47715 3 0 7.47715 0 13V57C0 62.5228 4.47715 67 10 67H41C46.5228 67 51 62.5228 51 57V13C51 7.47715 46.5228 3 41 3V5C45.4183 5 49 8.58172 49 13V57C49 61.4183 45.4183 65 41 65H10C5.58172 65 2 61.4183 2 57V13C2 8.58172 5.58172 5 10 5V3Z" fill="#4540DB"/>
<rect x="11" y="1" width="29" height="6" rx="2" stroke="#4540DB" stroke-width="2"/>
<path d="M9 20.5L10.7453 22.2453C11.4612 22.9612 12.5991 23.0293 13.3952 22.4038L19 18" stroke="#4540DB" stroke-width="2"/>
<rect x="22" y="20.5" width="20" height="1" rx="0.5" stroke="#4540DB"/>
<path d="M9 31.5L10.7453 33.2453C11.4612 33.9612 12.5991 34.0293 13.3952 33.4038L19 29" stroke="#4540DB" stroke-width="2"/>
<rect x="22" y="31.5" width="20" height="1" rx="0.5" stroke="#4540DB"/>
<path d="M9 42.5L10.7453 44.2453C11.4612 44.9612 12.5991 45.0293 13.3952 44.4038L19 40" stroke="#4540DB" stroke-width="2"/>
<rect x="22" y="42.5" width="20" height="1" rx="0.5" stroke="#4540DB"/>
<path d="M9 53.5L10.7453 55.2453C11.4612 55.9612 12.5991 56.0293 13.3952 55.4038L19 51" stroke="#4540DB" stroke-width="2"/>
<rect x="22" y="53.5" width="20" height="1" rx="0.5" stroke="#4540DB"/>
</svg>
