<svg width="133" height="133" viewBox="0 0 133 133" fill="none" xmlns="http://www.w3.org/2000/svg">
<rect x="40" y="37" width="44.6667" height="44.6667" rx="22.3333" stroke="#4540DB" stroke-width="2"/>
<path d="M76.333 76.875L94.3843 96" stroke="#4540DB" stroke-width="2"/>
</svg>
