<svg width="133" height="133" viewBox="0 0 133 133" fill="none" xmlns="http://www.w3.org/2000/svg">
<rect x="38" y="45" width="58" height="50" rx="4" stroke="#4540DB" stroke-width="2"/>
<path d="M75.3996 45.4V40C75.3996 37.2386 73.161 35 70.3996 35H63.5996C60.8382 35 58.5996 37.2386 58.5996 40V45.4" stroke="#4540DB" stroke-width="2"/>
<path d="M38.1992 84H95.7992" stroke="#4540DB" stroke-width="2"/>
<rect x="60.4004" y="60.2" width="14.8" height="10.8" stroke="#4540DB" stroke-width="2"/>
</svg>
