{
  "project_info": {
    "project_number": "358189430219",
    "firebase_url": "https://threads-app-basic.firebaseio.com",
    "project_id": "threads-app-basic",
    "storage_bucket": "threads-app-basic.appspot.com"
  },
  "client": [
    {
      "client_info": {
        "mobilesdk_app_id": "1:358189430219:android:ddb99a92cbe65215",
        "android_client_info": {
          "package_name": "threads.app.basic"
        }
      },
      "oauth_client": [
        {
          "client_id": "358189430219-2tnd4c38ai40iviu15bve62ubn04jfvj.apps.googleusercontent.com",
          "client_type": 3
        }
      ],
      "api_key": [
        {
          "current_key": "AIzaSyD-I21k918JNqjTymunSUX6lYujWpDimF8"
        }
      ],
      "services": {
        "appinvite_service": {
          "other_platform_oauth_client": [
            {
              "client_id": "358189430219-2tnd4c38ai40iviu15bve62ubn04jfvj.apps.googleusercontent.com",
              "client_type": 3
            }
          ]
        }
      }
    }
  ],
  "configuration_version": "1"
}