{
  "swagger": "2.0",
  "info": {
    "version": "1.0",
    "title": "Notifications API server"
  },
  "paths": {
    "/getUserId": {
      "get": {
        "summary": "Get new userId",
        "produces": [
          "text/plain"
        ],
        "responses": {
          "200": {
            "description": "Successful operation",
            "schema": {
              "type": "string"
            }
          }
        }
      }
    },
    "/getNotifications": {
      "get": {
        "summary": "Get notifications for user",
        "produces": [
          "application/json"
        ],
        "parameters": [
          {
            "in": "header",
            "name": "X-User-Id",
            "description": "User id",
            "required": true,
            "type": "string"
          }
        ],
        "responses": {
          "200": {
            "description": "Successful operation"
          },
          "400": {
            "description": "User not found"
          }
        }
      }
    },
    "/sendFlag": {
      "post": {
        "summary": "Send flag to user (admin access only)",
        "parameters": [
          {
            "name": "body",
            "in": "body",
            "description": "User id",
            "required": true,
            "schema": {
              "type": "string"
            }
          }
        ],
        "responses": {
          "200": {
            "description": "Successful operation"
          },
          "400": {
            "description": "User not found"
          },
          "500": {
            "description": "Unexpected error"
          }
        }
      }
    }
  }
}