<?xml version="1.0" standalone="no"?>
<!DOCTYPE svg PUBLIC "-//W3C//DTD SVG 20010904//EN"
		"http://www.w3.org/TR/2001/REC-SVG-20010904/DTD/svg10.dtd">
<svg version="1.0" xmlns="http://www.w3.org/2000/svg"
	 width="970.000000pt" height="970.000000pt" viewBox="0 0 970.000000 970.000000"
	 preserveAspectRatio="xMidYMid meet">
	<metadata>
		Created by potrace 1.11, written by Peter Selinger 2001-2013
	</metadata>
	<g transform="translate(0.000000,970.000000) scale(0.100000,-0.100000)"
	   fill="#000000" stroke="none">
		<path d="M8918 8579 c-21 -11 -38 -16 -38 -12 0 5 -4 3 -8 -3 -4 -6 -74 -44
-157 -84 -310 -151 -490 -242 -499 -251 -6 -5 -18 -9 -28 -9 -10 0 -18 -4 -18
-10 0 -5 -6 -10 -12 -10 -7 -1 -289 -139 -627 -308 -451 -225 -620 -314 -635
-335 -42 -57 -40 -62 283 -712 166 -335 312 -620 323 -632 21 -23 69 -39 103
-34 11 1 113 49 228 106 114 57 207 101 207 97 0 -4 4 -2 8 3 8 13 475 245
491 245 6 0 11 5 11 10 0 6 4 10 9 10 16 0 1077 529 1098 547 28 25 43 57 43
91 0 17 -51 132 -126 283 -527 1062 -492 996 -528 1013 -45 21 -82 20 -128 -5z
m-16 -141 c-10 -18 -49 -89 -84 -158 -36 -69 -87 -165 -113 -215 -27 -49 -55
-103 -63 -120 -9 -16 -20 -33 -25 -36 -5 -3 -8 -8 -6 -10 2 -4 -24 -57 -76
-154 -18 -33 -56 -105 -85 -160 -88 -166 -101 -189 -123 -207 -38 -33 -77 -37
-193 -17 -60 10 -127 21 -149 24 -22 3 -51 8 -65 10 -62 13 -127 23 -180 30
-19 3 -45 7 -57 9 -11 3 -43 8 -70 12 -26 3 -57 8 -68 11 -11 2 -36 6 -55 9
-19 3 -75 12 -125 20 -49 8 -117 19 -150 25 -33 5 -73 12 -90 15 -16 3 -40 7
-53 9 -12 1 -25 4 -27 7 -4 4 595 308 615 313 16 4 186 91 191 98 3 5 10 9 15
9 15 1 57 21 87 41 15 10 27 17 27 14 0 -2 210 101 467 229 257 128 470 231
472 229 2 -2 -6 -19 -17 -37z m221 -173 c363 -729 447 -901 452 -916 6 -16 4
-17 -22 -5 -15 8 -91 41 -168 74 -77 33 -158 68 -180 78 -22 9 -42 18 -45 19
-3 1 -16 6 -30 12 -14 6 -28 10 -31 9 -3 0 -12 4 -20 10 -19 16 -254 114 -271
114 -8 0 -22 -8 -30 -17 -34 -42 -13 -60 157 -132 83 -36 178 -77 213 -93 34
-15 65 -28 67 -28 3 0 33 -13 67 -30 34 -16 65 -30 69 -30 5 0 39 -14 76 -31
37 -17 81 -37 97 -44 19 -8 24 -15 16 -20 -34 -21 -236 -118 -242 -117 -5 1
-8 -3 -8 -8 0 -6 -5 -10 -10 -10 -6 0 -221 -105 -478 -232 -257 -128 -469
-231 -471 -230 -2 2 -7 0 -10 -5 -8 -11 -304 -158 -313 -155 -5 1 -8 -2 -8 -8
0 -5 -9 -10 -19 -10 -11 0 -21 -3 -23 -7 -2 -7 -132 -74 -148 -78 -3 -1 -42
-20 -87 -43 l-83 -42 6 37 c3 21 10 45 14 53 4 8 8 18 8 23 1 7 22 110 28 132
2 6 5 19 7 30 3 11 15 58 27 105 21 81 25 97 34 138 2 9 9 37 16 62 7 25 14
56 17 70 2 14 12 54 22 90 22 77 22 80 9 103 -6 13 -18 17 -40 15 -26 -3 -33
-9 -45 -42 -7 -22 -15 -49 -17 -60 -2 -12 -30 -124 -61 -251 -31 -126 -58
-237 -60 -245 -2 -8 -13 -51 -25 -95 -28 -107 -28 -108 -30 -125 0 -8 -87 158
-192 370 -105 212 -231 465 -279 563 -49 98 -89 182 -89 187 0 4 28 2 63 -5
34 -7 81 -16 105 -19 37 -5 137 -21 252 -41 19 -3 46 -8 60 -10 14 -2 43 -6
65 -10 91 -15 332 -54 360 -59 17 -2 48 -7 70 -11 54 -8 142 -23 185 -31 97
-17 171 -7 217 29 56 44 71 67 190 297 15 30 31 57 36 58 4 2 7 12 7 22 0 10
3 20 8 22 4 2 23 35 42 73 19 39 37 72 40 75 3 3 22 39 43 80 21 41 57 111 81
155 23 44 75 143 116 220 72 137 90 168 96 163 1 -2 45 -89 97 -193z"/>
		<path d="M5530 7643 c-211 -43 -365 -214 -385 -429 -4 -38 -8 -69 -8 -70 -1 0
-126 -49 -277 -109 -151 -59 -288 -114 -304 -121 -16 -8 -33 -14 -38 -14 -4 0
-27 -9 -51 -19 -23 -10 -125 -51 -227 -91 -102 -39 -198 -77 -215 -84 -54 -23
-156 -64 -405 -162 -333 -131 -910 -359 -935 -369 -11 -5 -22 -9 -25 -10 -3
-1 -22 -9 -44 -18 -21 -9 -44 -17 -50 -17 -7 0 -16 -4 -22 -9 -5 -4 -23 -13
-40 -18 -28 -10 -31 -9 -44 21 -8 17 -15 33 -15 36 -1 7 -36 102 -46 125 -5
11 -25 67 -44 123 -45 131 -67 175 -103 200 -55 39 -120 38 -219 -5 -21 -9
-40 -17 -43 -18 -3 -1 -18 -7 -35 -14 -134 -56 -154 -58 -174 -15 -34 75 -175
230 -265 291 -23 15 -43 30 -46 33 -35 35 -261 128 -350 144 -19 3 -46 8 -60
11 -57 12 -110 17 -190 17 -101 1 -136 -14 -179 -72 -23 -32 -28 -48 -26 -88
5 -101 63 -152 178 -158 191 -10 276 -28 388 -84 70 -36 176 -122 220 -179 19
-25 40 -51 47 -58 15 -15 9 -18 -195 -99 -135 -53 -156 -67 -177 -114 -29 -65
-27 -89 14 -195 4 -11 17 -47 30 -80 12 -33 26 -69 31 -80 5 -11 11 -29 14
-40 2 -11 18 -56 35 -99 17 -44 27 -82 23 -86 -9 -7 -110 -51 -128 -55 -12 -2
-62 -22 -90 -35 -11 -5 -55 -23 -99 -41 -107 -44 -146 -92 -140 -172 7 -80 74
-151 142 -151 22 0 207 63 277 94 11 5 155 62 320 126 165 63 314 122 330 129
17 8 62 25 100 40 128 48 190 73 238 94 26 11 48 20 50 20 1 0 16 5 32 11 17
6 59 22 95 36 36 14 78 31 93 39 16 8 33 15 39 15 5 0 24 7 41 15 18 8 106 43
197 78 260 102 652 257 687 273 17 8 36 14 42 14 6 0 19 4 29 10 14 8 58 27
82 35 3 1 19 7 35 14 17 7 59 24 95 38 36 13 79 30 97 38 17 8 34 15 38 15 4
0 21 7 38 15 18 8 66 27 107 43 41 16 84 33 95 37 11 5 22 9 25 10 12 4 67 26
85 34 11 5 81 33 155 61 74 29 149 59 165 65 17 7 113 46 215 86 102 40 250
99 329 131 79 32 148 58 153 58 9 0 594 -1170 590 -1182 -1 -3 5 -12 13 -18 8
-7 15 -17 15 -22 0 -17 201 -413 228 -448 47 -63 106 -111 177 -145 139 -67
282 -66 423 3 58 28 192 148 192 172 0 8 6 21 14 29 38 43 70 236 53 311 -2 8
-7 29 -12 45 -4 17 -52 121 -106 231 -54 111 -99 206 -99 212 0 6 55 39 123
72 430 216 418 210 431 242 8 17 11 39 9 49 -5 16 -58 49 -80 49 -5 0 -129
-61 -275 -135 -147 -74 -271 -135 -276 -135 -5 0 -19 24 -33 53 -13 28 -28 55
-34 60 -14 10 15 31 95 70 36 17 68 36 71 40 3 5 8 7 10 6 4 -2 206 98 328
163 30 15 49 34 58 55 11 29 11 34 -11 60 -13 16 -35 29 -48 30 -19 2 -519
-240 -554 -268 -7 -6 -15 -4 -21 3 -21 27 -63 120 -58 129 3 4 83 47 178 95
395 198 387 193 387 240 0 33 -32 66 -66 67 -26 1 -144 -55 -519 -247 -27 -14
-50 -24 -51 -23 -9 9 -64 121 -64 131 1 6 118 70 261 141 143 72 272 140 285
152 18 17 24 30 20 50 -2 16 -5 32 -5 36 -1 4 -17 15 -36 23 -39 16 -6 30
-413 -175 -101 -51 -185 -91 -186 -89 -20 38 -126 258 -126 263 0 4 -8 19 -18
33 -10 15 -27 47 -37 72 -97 226 -319 349 -545 303z m157 -325 c15 -7 38 -24
51 -38 21 -23 212 -394 227 -440 5 -16 -7 -26 -72 -59 -81 -40 -102 -64 -95
-109 2 -13 17 -32 34 -42 29 -18 33 -18 72 -2 23 8 61 26 85 39 24 13 45 23
47 23 5 0 64 -128 64 -137 0 -4 -29 -21 -65 -37 -35 -15 -73 -37 -84 -47 -45
-42 -13 -119 48 -119 14 0 57 16 94 35 38 19 70 35 72 35 3 0 20 -31 39 -68
l34 -68 -78 -38 c-84 -42 -107 -68 -96 -112 16 -63 62 -68 163 -17 40 20 75
34 76 32 9 -12 67 -132 65 -134 -2 -1 -33 -17 -69 -35 -88 -44 -98 -52 -105
-86 -7 -37 27 -84 61 -84 14 0 57 16 96 35 40 19 76 35 80 35 12 0 204 -392
203 -415 -2 -60 -17 -95 -54 -129 -22 -20 -46 -37 -53 -37 -60 -7 -96 -3 -126
13 -37 21 -70 56 -71 75 0 6 -3 13 -7 15 -8 3 -79 143 -196 388 -107 225 -262
540 -470 955 -195 390 -208 427 -184 485 35 82 134 123 214 88z m-3616 -1058
c2 -13 4 -22 12 -40 18 -44 87 -234 87 -240 0 -5 -102 -49 -227 -98 -126 -50
-241 -96 -258 -103 -16 -7 -32 -13 -35 -14 -3 -1 -18 -7 -34 -14 -35 -14 -39
-10 -59 49 -9 25 -32 88 -51 140 -35 92 -35 109 -3 110 5 0 23 6 40 14 18 8
97 39 177 70 80 31 154 61 165 65 11 5 22 9 25 10 3 1 37 14 75 30 80 34 85
35 86 21z"/>
		<path d="M4038 5936 c-1 -2 -61 -6 -133 -10 -71 -3 -146 -8 -165 -11 -19 -3
-48 -8 -65 -11 -16 -2 -39 -6 -50 -8 -78 -12 -265 -57 -305 -73 -8 -3 -22 -7
-31 -9 -9 -2 -29 -9 -45 -15 -16 -7 -34 -13 -39 -14 -29 -7 -223 -94 -313
-141 -108 -57 -311 -189 -325 -211 -4 -7 -14 -13 -22 -13 -7 0 -15 -3 -17 -7
-1 -5 -30 -30 -63 -58 -67 -55 -242 -230 -292 -291 -17 -21 -43 -52 -56 -69
-45 -56 -157 -223 -157 -234 0 -6 -4 -11 -10 -11 -5 0 -10 -4 -10 -9 0 -4 -17
-39 -38 -77 -114 -208 -222 -528 -248 -734 -2 -19 -6 -44 -9 -56 -25 -110 -25
-528 0 -679 14 -81 18 -108 29 -161 11 -52 38 -161 47 -184 5 -14 11 -34 13
-45 5 -20 39 -114 71 -195 159 -393 491 -806 835 -1041 36 -24 67 -46 70 -49
5 -6 68 -44 145 -87 80 -46 289 -143 305 -143 6 0 18 -4 28 -9 23 -13 53 -23
77 -28 11 -1 29 -7 40 -13 20 -10 116 -37 165 -46 14 -3 41 -9 60 -14 33 -8
123 -23 220 -37 61 -9 505 -8 555 1 22 4 56 9 75 11 19 2 55 8 80 14 25 5 59
12 75 14 36 7 180 44 215 56 106 38 182 67 220 84 25 12 47 21 50 22 26 3 338
181 360 205 3 3 17 13 32 23 120 76 358 303 481 458 201 255 356 555 438 850
31 111 39 145 44 184 2 11 4 21 5 23 4 4 6 16 14 77 5 33 10 67 11 76 17 94
23 358 10 479 -3 36 -8 81 -10 100 -5 54 -16 119 -31 190 -8 36 -16 74 -18 85
-13 79 -97 319 -129 367 -66 99 -228 81 -274 -31 -16 -37 -13 -122 5 -145 24
-30 102 -310 118 -421 3 -27 8 -58 10 -67 7 -39 18 -208 17 -273 0 -88 -11
-211 -28 -330 -10 -69 -57 -259 -67 -272 -6 -7 -8 -13 -5 -13 5 0 -22 -79 -56
-165 -24 -59 -128 -261 -166 -321 -225 -358 -560 -644 -952 -813 -42 -18 -82
-34 -90 -35 -8 -2 -26 -8 -41 -14 -23 -9 -131 -44 -148 -47 -9 -2 -85 -18 -90
-20 -3 -1 -25 -5 -50 -9 -25 -5 -54 -10 -65 -12 -66 -14 -152 -18 -325 -18
-218 0 -307 10 -475 49 -11 3 -30 7 -43 9 -127 26 -554 212 -570 249 -2 4 -8
7 -13 7 -5 0 -48 28 -96 62 -494 350 -816 906 -870 1498 -13 136 -6 461 11
511 3 8 7 32 10 54 15 111 97 395 134 460 6 11 34 67 62 124 54 109 120 213
204 321 108 139 194 226 368 369 32 26 109 81 114 81 3 0 20 11 38 25 18 14
36 25 40 25 5 0 20 8 34 19 38 27 215 114 292 144 170 66 292 98 473 127 99
15 161 18 332 15 116 -2 221 -6 235 -8 14 -3 41 -8 60 -11 68 -11 96 -17 175
-37 75 -18 100 -26 150 -45 11 -4 26 -8 34 -10 21 -4 164 -66 176 -76 5 -4 17
-8 26 -8 10 0 19 -3 21 -7 2 -5 32 -23 68 -42 36 -19 84 -47 107 -62 23 -16
46 -29 51 -29 5 0 15 -7 22 -16 28 -33 86 -45 165 -35 14 2 78 62 91 86 18 32
11 121 -12 153 -28 38 -198 150 -329 216 -114 57 -275 127 -275 120 0 -3 -13
2 -30 11 -16 8 -33 16 -37 16 -5 1 -12 3 -18 4 -5 2 -46 13 -90 25 -44 11 -87
22 -95 24 -25 5 -94 18 -115 23 -11 2 -42 6 -70 9 -27 3 -57 7 -65 10 -8 3
-67 8 -130 10 -63 3 -120 7 -127 9 -6 2 -13 2 -15 1z"/>
		<path d="M3849 5286 c-2 -2 -33 -7 -69 -11 -36 -4 -68 -9 -71 -11 -3 -2 -19
-6 -35 -8 -52 -10 -75 -15 -94 -21 -10 -3 -27 -8 -37 -10 -110 -24 -404 -158
-464 -211 -8 -8 -19 -14 -23 -14 -8 0 -143 -103 -187 -142 -86 -77 -113 -103
-183 -183 -86 -99 -185 -244 -242 -356 -21 -41 -39 -78 -40 -84 -2 -5 -14 -37
-27 -70 -25 -61 -32 -82 -37 -100 -1 -5 -7 -21 -12 -35 -5 -14 -11 -32 -13
-40 -2 -8 -8 -35 -14 -60 -33 -148 -39 -215 -36 -405 2 -99 5 -189 8 -200 4
-18 11 -58 23 -135 3 -14 7 -38 11 -55 4 -16 7 -32 8 -35 4 -20 37 -129 44
-145 5 -11 19 -47 31 -80 30 -78 88 -195 108 -217 8 -10 12 -18 8 -18 -8 0 95
-150 148 -215 69 -85 178 -194 256 -257 66 -54 215 -158 225 -158 2 0 26 -13
52 -28 79 -47 295 -134 363 -147 13 -2 37 -9 54 -14 133 -43 490 -62 663 -35
428 68 801 271 1078 585 76 86 166 213 209 294 15 28 31 57 36 65 23 40 50
102 50 115 0 8 5 15 12 15 6 0 9 3 6 6 -3 3 5 33 19 67 14 34 27 71 30 82 8
37 11 50 13 50 1 0 3 7 5 15 2 8 11 47 19 85 37 163 48 481 20 617 -2 13 -6
37 -9 53 -3 17 -10 51 -16 76 -6 26 -12 53 -13 60 -2 8 -5 21 -8 29 -3 8 -13
38 -21 65 -34 113 -138 344 -159 353 -5 2 -8 8 -8 14 0 13 -100 157 -154 222
-96 114 -288 290 -358 327 -13 7 -25 15 -28 19 -8 12 -170 101 -245 135 -107
49 -268 101 -370 121 -22 4 -47 9 -55 10 -61 13 -118 17 -281 20 -103 2 -188
2 -190 0z m12 -352 c0 -13 0 -145 0 -294 0 -148 0 -283 0 -298 -1 -26 -6 -30
-53 -41 -29 -6 -93 -31 -141 -55 l-89 -44 -227 227 -227 227 25 19 c46 35 176
121 184 123 4 0 40 16 80 36 104 49 215 87 302 102 11 1 32 7 47 11 15 4 44 9
63 10 31 2 35 -1 36 -23z m484 0 c86 -21 182 -53 243 -80 29 -13 54 -24 57
-24 12 0 203 -117 215 -131 3 -3 15 -11 28 -18 12 -6 22 -17 22 -24 0 -7 -101
-113 -224 -236 l-224 -224 -30 22 c-17 11 -33 21 -36 21 -3 0 -29 11 -58 23
-63 28 -119 47 -140 47 -13 0 -15 41 -16 317 0 174 2 321 4 325 6 10 77 2 159
-18z m-1033 -1040 c-36 -70 -69 -165 -77 -213 -2 -14 -34 -16 -324 -16 l-322
-1 6 56 c9 82 52 244 91 341 19 48 34 92 34 98 0 6 4 11 8 11 4 0 18 21 30 46
21 43 76 130 119 188 l18 25 228 -228 228 -228 -39 -79z m1894 451 c55 -81 97
-153 114 -195 8 -19 17 -37 20 -40 4 -3 23 -54 42 -115 44 -131 74 -274 69
-320 -2 -17 -641 -15 -642 2 -2 17 -2 19 -23 88 -10 33 -35 93 -57 134 l-38
75 226 227 c168 168 229 224 238 215 6 -6 29 -38 51 -71z m-1068 -350 c29 -9
55 -16 59 -16 28 -2 133 -78 184 -132 62 -67 106 -168 114 -265 2 -24 6 -46 8
-48 8 -8 -22 -147 -40 -189 -76 -177 -227 -281 -423 -291 -218 -12 -413 131
-481 351 -18 57 -19 167 -3 235 16 71 66 163 116 219 21 23 40 41 43 41 3 0
15 8 25 18 22 20 102 62 128 67 9 2 17 4 17 5 0 1 13 4 30 6 16 3 32 7 34 10
11 10 142 3 189 -11z m-895 -656 c1 -2 11 -31 22 -64 19 -57 45 -113 76 -163
13 -21 4 -32 -214 -250 l-227 -227 -35 40 c-19 22 -39 52 -46 68 -6 15 -15 27
-20 27 -5 0 -9 4 -9 10 0 5 -13 31 -28 57 -26 46 -92 187 -96 208 -2 6 -10 35
-20 65 -9 30 -25 94 -35 142 -16 77 -17 87 -3 90 23 4 632 2 635 -3z m2195 2
c8 -1 11 -8 8 -18 -3 -10 -8 -37 -11 -59 -3 -23 -15 -73 -26 -110 -10 -38 -21
-76 -23 -84 -8 -33 -70 -176 -83 -191 -7 -8 -13 -21 -13 -27 0 -15 -132 -212
-143 -212 -5 0 -110 101 -233 224 l-224 225 35 64 c19 35 44 89 54 120 11 32
22 61 25 65 3 5 554 8 634 3z m-1785 -517 c102 -52 97 -50 155 -64 48 -13 52
-16 53 -44 4 -179 0 -596 -5 -605 -5 -7 -21 -9 -39 -6 -18 3 -43 7 -57 9 -14
2 -45 9 -70 16 -25 6 -56 14 -70 16 -14 3 -34 9 -45 14 -11 4 -36 14 -55 21
-55 19 -162 71 -192 91 -16 11 -28 17 -28 14 0 -8 -102 60 -149 100 l-24 21
224 226 c123 124 225 226 227 227 1 0 35 -16 75 -36z m1034 -186 c123 -123
223 -227 223 -233 -1 -20 -147 -114 -270 -174 -87 -42 -256 -101 -305 -106 -5
-1 -25 -5 -43 -9 -18 -4 -50 -9 -71 -11 l-39 -3 1 319 c0 176 4 322 9 325 4 3
20 8 35 10 37 7 161 60 198 84 17 11 32 20 35 20 3 0 105 -100 227 -222z"/>
		<path d="M355 5119 c-52 -33 -96 -113 -88 -162 25 -158 212 -196 302 -60 27
40 30 53 27 100 -9 128 -133 190 -241 122z"/>
		<path d="M5705 5084 c-70 -36 -101 -85 -96 -154 5 -84 81 -164 159 -168 91 -6
173 73 167 160 -8 126 -132 213 -230 162z"/>
		<path d="M95 4526 c-77 -47 -90 -98 -89 -346 0 -143 7 -250 20 -291 2 -10 7
-30 9 -45 4 -32 39 -157 60 -219 120 -351 367 -673 665 -869 142 -93 202 -121
410 -194 65 -22 144 -21 177 4 64 48 88 113 67 183 -7 23 -21 52 -30 63 -20
22 -75 49 -113 55 -43 7 -183 65 -246 101 -85 49 -165 104 -165 114 0 4 -5 8
-10 8 -27 0 -229 212 -262 274 -6 12 -14 23 -18 26 -20 15 -137 235 -153 286
-3 10 -15 43 -26 73 -11 30 -19 57 -16 59 2 3 0 13 -6 24 -26 49 -46 230 -42
382 2 83 4 167 4 187 2 115 -135 188 -236 125z"/>
		<path d="M853 2269 c-54 -28 -105 -57 -114 -65 -8 -8 -19 -14 -23 -14 -4 0
-45 -22 -92 -50 -47 -27 -86 -50 -88 -50 -3 0 -39 -20 -80 -45 -42 -25 -79
-45 -81 -45 -3 0 -22 -10 -43 -23 -20 -13 -68 -41 -107 -62 -110 -60 -161 -96
-179 -127 -23 -38 -28 -107 -11 -144 26 -56 57 -129 59 -139 2 -5 8 -21 13
-35 6 -14 25 -63 42 -110 48 -127 82 -197 106 -218 32 -28 91 -45 131 -38 34
7 197 69 284 108 68 31 93 41 114 45 11 2 26 9 34 15 8 7 19 13 26 14 6 1 72
28 146 59 74 31 284 115 465 187 182 72 342 139 356 150 91 62 80 212 -21 266
-62 34 -110 24 -335 -73 -16 -7 -122 -50 -235 -94 -113 -45 -218 -88 -235 -95
-16 -8 -52 -22 -80 -32 -27 -10 -53 -23 -57 -28 -4 -6 -8 -8 -8 -5 0 4 -86
-29 -192 -71 -209 -85 -204 -84 -223 -20 -4 14 -14 40 -22 57 -8 18 -13 39
-10 46 3 7 37 31 77 53 39 21 88 48 108 60 20 11 111 63 202 114 91 51 179
101 195 110 17 10 45 26 64 36 68 38 101 88 101 154 0 50 -12 75 -56 116 -31
29 -70 44 -115 44 -9 0 -62 -23 -116 -51z"/>
	</g>
</svg>
