module gitlab.com/mcsolutions/tools/gek

go 1.19

require (
	github.com/asaskevich/govalidator v0.0.0-20210307081110-f21760c49a8d
	github.com/timurkash/back v0.0.0-20211119133938-324012ec1213
	golang.org/x/text v0.3.7
	gopkg.in/yaml.v3 v3.0.0-20210107192922-496545a6307b
)

require (
	github.com/kr/pretty v0.2.0 // indirect
	gopkg.in/check.v1 v1.0.0-20190902080502-41f04d3bba15 // indirect
)
