episode,average_reward
4251,6.903681360316549
4252,7.965059511010324
4253,8.598253134467098
4254,5.45649693529399
4255,7.647582579546036
4256,8.125802178865442
4257,6.939334073067044
4258,7.9799574505714315
4259,7.417517919444618
4260,5.9382236741530185
4261,8.451004797681264
4262,8.785638120239422
4263,9.685275041622088
4264,7.664437582728801
4265,7.935713754166974
4266,6.287320180352584
4267,7.2611073185809385
4268,9.110981812445434
4269,7.338877870243204
4270,5.722220665215648
4271,5.669268187400157
4272,9.694041095458232
4273,6.447159074030893
4274,9.289971773911237
4275,5.711114875883433
4276,9.903678221772164
4277,6.014790018259128
4278,8.125866640329987
4279,8.209036274148502
4280,8.87437838172378
4281,8.791518605412687
4282,6.672737542080437
4283,5.682576255961117
4284,5.2785208780677815
4285,6.134826043847183
4286,5.467244893201507
4287,7.066109486060737
4288,8.112319136418282
4289,8.837782824320248
4290,8.963014062178024
4291,9.471081778635936
4292,5.184356639954651
4293,5.725254587009674
4294,6.270665224597472
4295,5.056946820007292
4296,6.866433278711259
4297,7.853458474317645
4298,9.637962465538894
4299,7.662938995228684
4300,5.427187539347351
4301,8.159975099487873
4302,5.655936751261676
4303,9.066759694441245
4304,9.84489492249931
4305,7.836680559542641
4306,5.48492367509413
4307,9.966884696455681
4308,9.36782050038105
4309,9.477237873464746
4310,6.304042421214442
4311,6.1581559892889395
4312,6.0003393273182155
4313,6.6582843154917315
4314,7.9917336452006005
4315,8.26708840106102
4316,9.08219184452771
4317,9.421065275931081
4318,5.937886359412528
4319,5.469763220137708
4320,5.8119916569328565
4321,8.883045896054663
4322,9.377746668869797
4323,9.652614216453891
4324,8.513921867532588
4325,8.72643331736429
4326,8.35966116054357
4327,5.956272457387887
4328,8.289640753820688
4329,5.666121962316172
4330,7.616417169519948
4331,9.97541456317115
4332,9.433935780983425
4333,6.178258642554823
4334,6.216109388447762
4335,7.620445779683904
4336,5.054664286404709
4337,5.265071651865905
4338,6.312008050416052
4339,5.916204436387487
4340,9.37295672708263
4341,7.982654866836466
4342,9.771272547422484
4343,7.376333061513153
4344,9.516496532608738
4345,8.916458261648826
4346,8.716031441569985
4347,6.350676005897407
4348,8.374765220480855
4349,7.587541673876605
4350,8.028903353144665
4351,9.206526272975356
4352,6.06415271073916
4353,9.163962949332282
4354,6.988905849428489
4355,7.346406867867196
4356,6.345797625672012
4357,6.823706981454271
4358,8.974226295859976
4359,9.289801101332039
4360,6.207563973655916
4361,7.8861346331137625
4362,7.40010868321603
4363,5.71809462589825
4364,5.69449318186437
4365,7.866798234242683
4366,5.058305635017392
4367,9.909883587922723
4368,6.986404031044598
4369,9.207410934801896
4370,8.78075929182312
4371,5.9179641250616895
4372,6.351929498821022
4373,7.939926788010228
4374,8.754544327367835
4375,8.868691942158007
4376,5.888898170171676
4377,5.15744099022768
4378,8.371569074398295
4379,5.177686537218809
4380,6.231756559784163
4381,7.161568334354143
4382,7.974762875681268
4383,7.061416863743428
4384,9.713681848326459
4385,8.616874967365174
4386,7.445086173339014
4387,8.010500302694663
4388,6.923397430161149
4389,8.557859470739068
4390,8.859818151694364
4391,5.471936469231777
4392,6.393990950783353
4393,6.1381826597937295
4394,6.885475607365289
4395,5.887858300171357
4396,8.489436983581008
4397,6.941580011150034
4398,8.57368695489068
4399,9.380576119612718
4400,6.196271069764444
4401,6.650804072877179
4402,6.120251404938395
4403,9.594820336757671
4404,5.806231141439413
4405,7.317198492877299
4406,9.647239257319413
4407,8.784265145373634
4408,8.262747646564144
4409,8.826357511325435
4410,7.847318915903071
4411,6.16015724902273
4412,5.859472755974576
4413,5.73012207993724
4414,6.521728550913221
4415,6.464176637760557
4416,8.335703830760272
4417,9.919423738438649
4418,9.404138299833805
4419,8.985353266265314
4420,6.0261350089316315
4421,9.834856035982405
4422,5.358825785538997
4423,6.0868970974081975
4424,8.519748184691771
4425,9.650125394719561
4426,7.822041892572286
4427,9.92194876931896
4428,8.045662801507053
4429,8.345024692828458
4430,9.658291841283752
4431,9.110711773710042
4432,6.33464880800971
4433,7.54923544149084
4434,8.687746888160412
4435,5.848660197845726
4436,9.88295568993156
4437,9.856991694885512
4438,6.630571606313717
4439,6.08015189374669
4440,8.379275323289704
4441,5.385705326215105
4442,5.056887908285291
4443,9.957149659973972
4444,7.437807413037898
4445,5.389244334740385
4446,7.139843803853046
4447,6.8161130282925075
4448,7.232661781447634
4449,7.5995801758679455
4450,6.4848930248508125
4451,7.630954887043703
4452,8.015800392266884
4453,5.447642653683801
4454,9.549435457869045
4455,8.321549922360514
4456,5.238660715905667
4457,5.1185763386334395
4458,9.715846629721927
4459,9.686799735214256
4460,5.199069823131561
4461,5.53910413365963
4462,9.031053987297465
4463,6.8018527705188685
4464,9.942966231854832
4465,5.043161033022848
4466,8.239998866682061
4467,7.310010515371817
4468,9.319594735856285
4469,5.069770017539768
4470,5.463604068032984
4471,7.555143266135269
4472,7.040490391557919
4473,9.750122563342607
4474,8.408587491355325
4475,9.073366883529674
4476,6.145307512832847
4477,5.082312603282085
4478,7.6329800386182125
4479,9.270441627725393
4480,9.484277342728522
4481,8.452139248775095
4482,7.430776592043433
4483,7.196920176268845
4484,6.116212065747054
4485,9.982229888755606
4486,6.641626998352004
4487,7.197926491496334
4488,6.368090651264255
4489,8.974594596317909
4490,9.329215646021655
4491,6.022682423981803
4492,9.96067859800968
4493,5.158634182760924
4494,6.32802874973612
4495,6.681872938636403
4496,8.877166730319791
4497,5.352008563492526
4498,8.308900065415543
4499,9.092995472928887
4500,6.7827285574516125
