episode,average_passenger_comfort_index
1001,0.06871821780028807
1002,0.07314981843677865
1003,0.06575147161548714
1004,0.07901527385458691
1005,0.09447414704417578
1006,0.060640390006009945
1007,0.07632760965965323
1008,0.07172501091043926
1009,0.09003727078034367
1010,0.08299237819592375
1011,0.09623724391470348
1012,0.08585661457183058
1013,0.06968653078831588
1014,0.07729352020585235
1015,0.09763834338598935
1016,0.07858342251889452
1017,0.09596405371280534
1018,0.06426476213114381
1019,0.09760345819076052
1020,0.06189646251634683
1021,0.06176339387986916
1022,0.09272256597237402
1023,0.07610430961594128
1024,0.0901421807418115
1025,0.08603972868935729
1026,0.09954126864525295
1027,0.060087166270352245
1028,0.08772311000444113
1029,0.08393176118475087
1030,0.09795551942495781
1031,0.07980066105274607
1032,0.0632742605443489
1033,0.07676932485226358
1034,0.06643713669590735
1035,0.06050951742886379
1036,0.07185053477878542
1037,0.06286025279186781
1038,0.08473985465809133
1039,0.0797473373710959
1040,0.0862363603145216
1041,0.09783864256642823
1042,0.06428526360771539
1043,0.09202386574215299
1044,0.09679219771648845
1045,0.06937081955791252
1046,0.0709142407247581
1047,0.06186544642605747
1048,0.0613290174752769
1049,0.08071040968451496
1050,0.07581333655975389
1051,0.0711320686095949
1052,0.08741030567647229
1053,0.0993815827840692
1054,0.08499708135810168
1055,0.06583612618585132
1056,0.06597312913635936
1057,0.07649245734551702
1058,0.08917099390082003
1059,0.06405330345737748
1060,0.08281956318013449
1061,0.08665617278193155
1062,0.06041410639699128
1063,0.06611392765162379
1064,0.07440322282144345
1065,0.0732834862107495
1066,0.07960261753304854
1067,0.07875578570866476
1068,0.0976189622364135
1069,0.07664165902463353
1070,0.06592585528718245
1071,0.09867672562675668
1072,0.060592492323466175
1073,0.08639008834805104
1074,0.07032830006720367
1075,0.0967196637381375
1076,0.08123102940190127
1077,0.06267679497273172
1078,0.0931173470691484
1079,0.0738821683322772
1080,0.08824620788688745
1081,0.0872454512193376
1082,0.07960345250011444
1083,0.06738189650296963
1084,0.061773964520427035
1085,0.07300124842091482
1086,0.09215307327229902
1087,0.07834094946668078
1088,0.08006705647391484
1089,0.09000965067052684
1090,0.06429483435102591
1091,0.09319207032182601
1092,0.07222092352265579
1093,0.08545995103644989
1094,0.06886906256189398
1095,0.09225351193828893
1096,0.09848361751046111
1097,0.09792734706898357
1098,0.09301665710871804
1099,0.07519705923164335
1100,0.06458210729127883
1101,0.09126915163938404
1102,0.07086029805723011
1103,0.09810194231350058
1104,0.08649219594245217
1105,0.0658363196904571
1106,0.09955903804708041
1107,0.07745508057396586
1108,0.09612642996282647
1109,0.06650733518357975
1110,0.06075021179766721
1111,0.09573740178948861
1112,0.06477597723342758
1113,0.06938720900406158
1114,0.0676892909669419
1115,0.07449372733865293
1116,0.07075982821612989
1117,0.06719113228951162
1118,0.09827303993585029
1119,0.07642592670328796
1120,0.06396143067685447
1121,0.09562964164339002
1122,0.0936863414151407
1123,0.06515050891445937
1124,0.07340801097062817
1125,0.08716506980156621
1126,0.0803448981368501
1127,0.06753868621622738
1128,0.09128437465695588
1129,0.06166871100329959
1130,0.06074530799764074
1131,0.07793563231992616
1132,0.09294057343446233
1133,0.08017971129213464
1134,0.07926382080126104
1135,0.08001828671274525
1136,0.09079573197307547
1137,0.06560347832589111
1138,0.0876500721839861
1139,0.06928519172617977
1140,0.08496010564587457
1141,0.08654755031291628
1142,0.07787392371229854
1143,0.09537764511922994
1144,0.06015910605296941
1145,0.07465507397766
1146,0.06751081001562592
1147,0.08649140239187254
1148,0.06934411382408825
1149,0.09884348940831353
1150,0.09017956303959782
1151,0.08184114721870803
1152,0.09785468988274815
1153,0.09540495995414609
1154,0.06066832263384518
1155,0.07574678243407078
1156,0.09388844627944591
1157,0.0700227245628944
1158,0.07063018858494025
1159,0.08189265044871606
1160,0.06474578617935663
1161,0.09348348851114362
1162,0.07322769223035594
1163,0.06570888832381881
1164,0.07876892867724372
1165,0.061136039856788414
1166,0.09473161620730156
1167,0.07558480297633656
1168,0.06519551037786363
1169,0.06494858511798686
1170,0.08916760792249208
1171,0.06320312254179015
1172,0.08931629752571515
1173,0.08354419802199106
1174,0.09138982783204846
1175,0.09168243093435055
1176,0.07577631025326281
1177,0.07805826110882942
1178,0.0983012589424832
1179,0.08368378433584833
1180,0.09728957130943529
1181,0.07028338803923137
1182,0.08947136035815334
1183,0.07515328514041394
1184,0.0668841888500366
1185,0.07379866370294327
1186,0.08636219206054366
1187,0.07066190211379121
1188,0.09806033340807926
1189,0.08590551155587345
1190,0.07467094437256765
1191,0.07120928716234284
1192,0.08486354396514696
1193,0.09539717657890258
1194,0.0854395688706956
1195,0.09116000775204
1196,0.09353250567428632
1197,0.07269796217459736
1198,0.09165238813284238
1199,0.06763107816517812
1200,0.06526225124615223
1201,0.06348218850816809
1202,0.07519639636230857
1203,0.08274410788009302
1204,0.06454005935564334
1205,0.06489650783986177
1206,0.06625792218106213
1207,0.08322835054853799
1208,0.0647629424051369
1209,0.08282043638815959
1210,0.07541527742921592
1211,0.07109841339152773
1212,0.07549805631707653
1213,0.06341126909505813
1214,0.06606867718490785
1215,0.06116062240020137
1216,0.06976426609199189
1217,0.09701885046644097
1218,0.06254676503933691
1219,0.0611594224954714
1220,0.08356081355099694
1221,0.08529155668398786
1222,0.0949082808463863
1223,0.0728329678515901
1224,0.07252011677317018
1225,0.06512315731615059
1226,0.06849827360955972
1227,0.06144664006626677
1228,0.09116945561321058
1229,0.06543561110711779
1230,0.06837721537791679
1231,0.0776252845808286
1232,0.09242598068059213
1233,0.06138898431859503
1234,0.06066825852792169
1235,0.09060849226154886
1236,0.09041076716452004
1237,0.09509065129316063
1238,0.07649665746147542
1239,0.07584971591475266
1240,0.09988873588368263
1241,0.06543298367993379
1242,0.09578283507645176
1243,0.08085843198308598
1244,0.06304611781409858
1245,0.06586329302521925
1246,0.0900036434996998
1247,0.08161664894177936
1248,0.09268254320595765
1249,0.07512018088374015
1250,0.07003608519794996
1251,0.09784893519156496
1252,0.0924864891679493
1253,0.08691781255016871
1254,0.06406589209264914
1255,0.07001564297753432
1256,0.09427955044285696
1257,0.08922883117137048
1258,0.09507866411810233
1259,0.09847784025208378
1260,0.0626002217081433
1261,0.09254635273072712
1262,0.0967297641174649
1263,0.08368869204351848
1264,0.07358152272502015
1265,0.06029744396846756
1266,0.08285214703576102
1267,0.0754773426144576
1268,0.09767534484021771
1269,0.06400363648809744
1270,0.08812915281160767
1271,0.06586102600253846
1272,0.08897804969799603
1273,0.06702757288797656
1274,0.0916425747599255
1275,0.09382263530474086
1276,0.06690130794111748
1277,0.0815570780266213
1278,0.06504013855518789
1279,0.07552253379723207
1280,0.09867532870656814
1281,0.07221584145286791
1282,0.09796452215528503
1283,0.06935404307417944
1284,0.08985675581065426
1285,0.09404902022551173
1286,0.06110470851112234
1287,0.09477480833717045
1288,0.07164623599755537
1289,0.09293629768670111
1290,0.09585398398094239
1291,0.09801222706099044
1292,0.0799802265651608
1293,0.06803151983464961
1294,0.07001009078143956
1295,0.0750770649703143
1296,0.07842197329931565
1297,0.08668229098090997
1298,0.06756130432409987
1299,0.08513529779831391
1300,0.0997767698280767
1301,0.08024440058698783
1302,0.09599356300898292
1303,0.07214670787933236
1304,0.09258633324012601
1305,0.07464581720433718
1306,0.06652911169905883
1307,0.09484206382075382
1308,0.06639885955465058
1309,0.08367002281508187
1310,0.09630501600996394
1311,0.09877432547707941
1312,0.09771936017008931
1313,0.06183845984271098
1314,0.0783968064248714
1315,0.0806952275816773
1316,0.07068674470856497
1317,0.0956488458253802
1318,0.07443243733143565
1319,0.06950572520027896
1320,0.07665918269449376
1321,0.06478223383563475
1322,0.09435044250005684
1323,0.08798749867690583
1324,0.0637582740711076
1325,0.08564081953921887
1326,0.07877626868818081
1327,0.06134513331958783
1328,0.09920026357999497
1329,0.07533608965350362
1330,0.08621856918432984
1331,0.07436762958593734
1332,0.06260817464523943
1333,0.06770016953276964
1334,0.0705694821769622
1335,0.09829020050018653
1336,0.08124353666693855
1337,0.07638992910651447
1338,0.08671908116344493
1339,0.07397860933695437
1340,0.08757015672682955
1341,0.07244001864056464
1342,0.08972003946863966
1343,0.09754566893043387
1344,0.09933305816115595
1345,0.07892733847732071
1346,0.06445630045039465
1347,0.061187375669673756
1348,0.07649136814523792
1349,0.062047715906560406
1350,0.06856125035929618
1351,0.07367910987395056
1352,0.08197675234085866
1353,0.07677668328455878
1354,0.09251405961053455
1355,0.0691071160970056
1356,0.06649764171226254
1357,0.09504979472106817
1358,0.07883953991655161
1359,0.08162068610379528
1360,0.09465820143546044
1361,0.08182092712937081
1362,0.08867172290969966
1363,0.06412463481853369
1364,0.07493561851504099
1365,0.09934693636551543
1366,0.0936112207795918
1367,0.07452195567462383
1368,0.08478246434268176
1369,0.07514371729930741
1370,0.08239543046040149
1371,0.07292458881174825
1372,0.09422943286245344
1373,0.07862942054052771
1374,0.0875628554401709
1375,0.07067934718821925
1376,0.07675778295269362
1377,0.09182201876782409
1378,0.09232315904178398
1379,0.08024399753113942
1380,0.09433810986053556
1381,0.08607507773578074
1382,0.07211452071142928
1383,0.09338921357252813
1384,0.09933029874501637
1385,0.06659300902496323
1386,0.06707037499552893
1387,0.07579791049377219
1388,0.09279490934578596
1389,0.07458889712432829
1390,0.08210049148910423
1391,0.07631891599653534
1392,0.09610871644754834
1393,0.06721013565467861
1394,0.08337019681659302
1395,0.07660965906381524
1396,0.07508644912722459
1397,0.09737584252502468
1398,0.0968401155723539
1399,0.09726253121680857
1400,0.086529840188207
1401,0.06889544777625058
1402,0.06618437944542634
1403,0.07638249754738383
1404,0.0732026799028502
1405,0.07216141528477275
1406,0.0986028043496526
1407,0.09091698595484346
1408,0.06659054086080424
1409,0.08282411938745955
1410,0.08960805109720207
1411,0.08552671110875018
1412,0.09224880659304764
1413,0.07953216585237727
1414,0.06293291305847278
1415,0.075659883711725
1416,0.07684142204107523
1417,0.09190082219679248
1418,0.09563403043669183
1419,0.07964951581115592
1420,0.06670882522687008
1421,0.07297228697121085
1422,0.08123628343106559
1423,0.07036702895220115
1424,0.09913085442713734
1425,0.08856111454850506
1426,0.07236595320509656
1427,0.07365773562509681
1428,0.08713234926513391
1429,0.09957233926999283
1430,0.06649231887416765
1431,0.06332304675788197
1432,0.08147864856387181
1433,0.08633283005793398
1434,0.08167812553097335
1435,0.06409484741612273
1436,0.07124360255944466
1437,0.07104328948436044
1438,0.06498897407961213
1439,0.07688282147346698
1440,0.09485521797283207
1441,0.076742205896201
1442,0.08530508817041627
1443,0.09454065074886342
1444,0.07389186860148524
1445,0.09061180359226409
1446,0.06318625051293461
1447,0.0956710070198207
1448,0.08369208484590876
1449,0.06578308217006644
1450,0.0885092197751355
1451,0.0943982034954436
1452,0.08219588567766181
1453,0.06652655031202209
1454,0.06609383664861186
1455,0.09176746465460982
1456,0.09623032300814136
1457,0.09965320934633215
1458,0.08073085900214685
1459,0.08076323181604586
1460,0.07729453334162412
1461,0.07515445180652662
1462,0.06087854085135773
1463,0.09812245378208818
1464,0.08586647318049791
1465,0.08238378264689049
1466,0.09858389027106498
1467,0.09103262576787798
1468,0.07314053223411127
1469,0.09620959129643139
1470,0.08662840397441902
1471,0.08488649485589363
1472,0.09550539359762177
1473,0.08734734863220935
1474,0.09185994887216106
1475,0.08428761590933503
1476,0.09180230555249966
1477,0.07033326275674609
1478,0.06265577693290107
1479,0.07966340464685973
1480,0.08098780673489622
1481,0.060254724033280756
1482,0.08924538645665864
1483,0.08695509870399537
1484,0.08137319923349166
1485,0.0983935205183061
1486,0.08915018347998513
1487,0.09243713495640116
1488,0.06484765489542921
1489,0.0922840291015378
1490,0.07975032133798857
1491,0.0725926080986978
1492,0.07298601399882283
1493,0.06555738656971735
1494,0.09165982395885201
1495,0.060690185800801245
1496,0.0640405682427388
1497,0.0860408270599227
1498,0.09364759548401808
1499,0.07510778824829273
1500,0.06250544275258708
