episode,avg_pci
1001,0.14812211442364406
1002,0.05188904942499393
1003,0.07128946041829287
1004,0.12455186579947601
1005,0.07773747508163563
1006,0.05801124661676448
1007,0.0652360161186949
1008,0.05684970122401356
1009,0.05238030225310001
1010,0.06881075301906298
1011,0.08965638413317606
1012,0.07552036117136271
1013,0.08636115528625314
1014,0.09796957872390388
1015,0.06597375783452504
1016,0.14480028573503956
1017,0.13274847762539782
1018,0.1178312256317058
1019,0.06956679591858718
1020,0.08002227133762292
1021,0.12191729960944786
1022,0.08849071930331912
1023,0.08068800147107155
1024,0.1255678966628307
1025,0.0737692688692889
1026,0.08685114662893971
1027,0.12540474895586456
1028,0.12179062491016626
1029,0.10072301693207988
1030,0.14612915061867493
1031,0.13853643791813325
1032,0.08101838731101213
1033,0.11381756079004125
1034,0.08562444090646405
1035,0.13533281818253334
1036,0.1160471830262675
1037,0.12786644578147777
1038,0.07736159502103061
1039,0.05282616559619368
1040,0.10666004668001014
1041,0.06649319041624804
1042,0.10232233253405906
1043,0.0915742042793401
1044,0.06383710745172769
1045,0.08870854542532139
1046,0.07387241015672343
1047,0.12316653442287114
1048,0.13882349813413536
1049,0.07822158151652175
1050,0.1104567252812654
1051,0.08995878781522575
1052,0.05198650397586144
1053,0.10109996073473225
1054,0.06068557952045128
1055,0.12383749272495727
1056,0.06845585252818515
1057,0.062181732116660976
1058,0.12282283012824881
1059,0.11970391446275765
1060,0.14236522057864998
1061,0.12354061514127543
1062,0.07228849603960213
1063,0.10306849732772083
1064,0.07268176603078697
1065,0.1138902745197875
1066,0.05387019720151251
1067,0.05376563309259169
1068,0.07294209866767873
1069,0.09678126290609596
1070,0.08631760893726927
1071,0.1292185459634931
1072,0.07971501885210575
1073,0.14461049214180755
1074,0.07804112735056892
1075,0.11552483613198211
1076,0.09984258636297637
1077,0.12293874229926495
1078,0.10881000210931405
1079,0.11091016710174265
1080,0.10690916114307006
1081,0.07104026931797189
1082,0.1399884169405457
1083,0.10430747790427074
1084,0.10237487041920315
1085,0.08907714151636233
1086,0.10489776915198584
1087,0.13479409282899918
1088,0.1347631178120437
1089,0.09916197485687155
1090,0.09872705835069623
1091,0.13212605764811158
1092,0.054261695680834256
1093,0.08196130951415105
1094,0.07047664899312686
1095,0.14157061665953746
1096,0.116684125038728
1097,0.11887579254670438
1098,0.05306652784070971
1099,0.13135226025876232
1100,0.10575358179414215
1101,0.06467685756645525
1102,0.1384170568933123
1103,0.10411552122772832
1104,0.08301332394858715
1105,0.06901593034118139
1106,0.11804569101004266
1107,0.144511419873661
1108,0.08511608552771349
1109,0.1006783483662641
1110,0.05803422851556919
1111,0.0980722293167984
1112,0.13710050476419167
1113,0.11192982855462708
1114,0.10743811796288957
1115,0.1091090989437916
1116,0.08766116952738331
1117,0.12417808103330644
1118,0.08067622636275182
1119,0.13522502813708898
1120,0.13751506901866498
1121,0.1070698727632867
1122,0.0822545326572941
1123,0.11180648912958449
1124,0.1252047730229831
1125,0.1020319410191591
1126,0.10181935196584813
1127,0.07344159387202186
1128,0.06649753631024015
1129,0.09017016158264932
1130,0.07044938690347331
1131,0.0900560698276759
1132,0.0957641025194505
1133,0.0619567046537231
1134,0.13700652255858997
1135,0.061817755444011115
1136,0.13329339529745268
1137,0.10827232440567751
1138,0.06934112167561522
1139,0.14055614064845523
1140,0.09495814639730937
1141,0.05316364392812975
1142,0.083626862400403
1143,0.12279342945402628
1144,0.09811590039009463
1145,0.06572045260164727
1146,0.06453830017455817
1147,0.11586536412367886
1148,0.07631997370698976
1149,0.14522137061887208
1150,0.10367704409663972
1151,0.1460740873975818
1152,0.09350935349985545
1153,0.14536073080381412
1154,0.06581356101749085
1155,0.11302743484102208
1156,0.10829307338266977
1157,0.061377876067978177
1158,0.06411235956276659
1159,0.0979028053420852
1160,0.13288874449295296
1161,0.06776210188512202
1162,0.05429457535580371
1163,0.05412638827068281
1164,0.11439984448544334
1165,0.14131030199832806
1166,0.06931473869081642
1167,0.09667017332822123
1168,0.09369321611466734
1169,0.05190521038220574
1170,0.08759993376866876
1171,0.05924785158511843
1172,0.09453937608081828
1173,0.07074964510291203
1174,0.11327944357473098
1175,0.12212859495683559
1176,0.05970894078139394
1177,0.055322786432634434
1178,0.060399190603427945
1179,0.13194905508414903
1180,0.14756207254722026
1181,0.08007742792153161
1182,0.08466092646017669
1183,0.08126889140866275
1184,0.1445333502557673
1185,0.09815103639867476
1186,0.13056319751093015
1187,0.05102341262015275
1188,0.13916958677739683
1189,0.09579967097461281
1190,0.10017253619638848
1191,0.07613217264928715
1192,0.09795851353056692
1193,0.09097901750361492
1194,0.13605498312694453
1195,0.10445070117774279
1196,0.09226707190215436
1197,0.10522340263805016
1198,0.08645766407216698
1199,0.11003139420671662
1200,0.099544638419418
1201,0.14003063895630358
1202,0.09312990112959882
1203,0.09838839946492337
1204,0.062483226313763976
1205,0.071326541433086
1206,0.12120283509014797
1207,0.06403742810015432
1208,0.1377492706287864
1209,0.050687592040884424
1210,0.10174475272468296
1211,0.13783819768685626
1212,0.1453340562263712
1213,0.06796542622269164
1214,0.06751716182778073
1215,0.10835891516680504
1216,0.0874399688525831
1217,0.13474492425234985
1218,0.07431364495559431
1219,0.11461474531368089
1220,0.1141320529197149
1221,0.14333862630413907
1222,0.0904849688572705
1223,0.11896579875349153
1224,0.05922608182191383
1225,0.11524445752802338
1226,0.055417192783046125
1227,0.0880227196882262
1228,0.0956321519853745
1229,0.09491589134297723
1230,0.08469180966075185
1231,0.10508816459449072
1232,0.13749172559552325
1233,0.1456388581650926
1234,0.07632092274657612
1235,0.09193885050052591
1236,0.10597647480885458
1237,0.10334853027067159
1238,0.0982766286504364
1239,0.09709408080365865
1240,0.05120139601698598
1241,0.09922703216517373
1242,0.054703120248440644
1243,0.07007031281627817
1244,0.13649413210368494
1245,0.11348319317030267
1246,0.12399213163797473
1247,0.13971863278779184
1248,0.09099990982409573
1249,0.05740644773878839
1250,0.10604458445125775
1251,0.14462887157057971
1252,0.1307010452121713
1253,0.052072210892825134
1254,0.1364546338112913
1255,0.05809100778827089
1256,0.13310383172155296
1257,0.1173988713898758
1258,0.1339669111530708
1259,0.07127542145231389
1260,0.11986002017867013
1261,0.12800842323627426
1262,0.08299121982360318
1263,0.05292015619941335
1264,0.12488030324231754
1265,0.09606755029450068
1266,0.09946954334824941
1267,0.08976730563332246
1268,0.05173962690476263
1269,0.09721192255578065
1270,0.07374248008016385
1271,0.13997373472831906
1272,0.08833653435761721
1273,0.14132897563415514
1274,0.10165399546953767
1275,0.1296208261852024
1276,0.0814231489971687
1277,0.06735225298916675
1278,0.08532349436271836
1279,0.05571731584486213
1280,0.10914106494593138
1281,0.12499974858355167
1282,0.14555353497071574
1283,0.060588810467872505
1284,0.11536553769714626
1285,0.08955660367139441
1286,0.07386531553502465
1287,0.05906596566403467
1288,0.14916336607179975
1289,0.11815119430270501
1290,0.11022039936003122
1291,0.11533903946142997
1292,0.07192537460969992
1293,0.14545165919758218
1294,0.07880286861911802
1295,0.1391406724956864
1296,0.13382168461619617
1297,0.056983613585053994
1298,0.11469061253574993
1299,0.12949439339711
1300,0.14814550078713118
1301,0.09997796442469957
1302,0.05170046970130929
1303,0.13711495760129316
1304,0.07348715440155089
1305,0.10312972422213035
1306,0.09487215102120748
1307,0.12673240534342223
1308,0.13555552512368158
1309,0.0763427080978263
1310,0.1150505060575821
1311,0.06097014335485837
1312,0.12867808248121512
1313,0.09515629668689649
1314,0.14853853733572003
1315,0.05496910567396406
1316,0.08297598726823649
1317,0.07689487124562684
1318,0.08643972636165156
1319,0.11386752879701041
1320,0.14732301421886526
1321,0.06438496597384581
1322,0.07609340812433535
1323,0.1454872287818389
1324,0.12046086051953286
1325,0.12688067843465836
1326,0.13189311133205628
1327,0.0619669765517992
1328,0.13845544541335514
1329,0.0899568260420817
1330,0.09194975099863527
1331,0.14338265481951995
1332,0.14248010714923304
1333,0.1176658330886964
1334,0.09722918329056329
1335,0.06272003223084063
1336,0.10926009754483694
1337,0.09622332321586727
1338,0.07032766481120914
1339,0.1487568052323826
1340,0.11010255489548385
1341,0.07659580865699578
1342,0.1109564893079571
1343,0.10932373246299124
1344,0.07285867613101252
1345,0.12439007995772573
1346,0.13917994594366495
1347,0.1359670564129502
1348,0.12405109318884205
1349,0.13496936135973883
1350,0.0583261692890997
1351,0.07153746192322064
1352,0.0974061441768733
1353,0.07895791940285182
1354,0.08975296241505638
1355,0.05508287442592807
1356,0.0849862642100508
1357,0.10288869948654367
1358,0.14782876570644676
1359,0.11975163026068232
1360,0.10766962198205308
1361,0.14237889136206136
1362,0.10172170187190555
1363,0.1260393403530098
1364,0.07737671357219364
1365,0.11877513551098996
1366,0.09981095546969435
1367,0.13186315669778567
1368,0.09159632420899108
1369,0.1345687873591033
1370,0.06485778224015201
1371,0.08276442295077664
1372,0.12900615143540606
1373,0.08585636552132377
1374,0.07862855608775955
1375,0.12727839390677598
1376,0.10790627814204831
1377,0.10220809550468057
1378,0.08150543822807907
1379,0.1352237473928818
1380,0.11015710085130667
1381,0.12096142167395847
1382,0.09348638583489433
1383,0.10090604078431237
1384,0.1031382227577737
1385,0.13869467171548389
1386,0.09560918394389872
1387,0.10624908142196846
1388,0.11779183804964034
1389,0.11922940309712286
1390,0.09346195079972386
1391,0.14975499300039397
1392,0.10762978263365244
1393,0.05862425305242735
1394,0.12571349734144716
1395,0.06311599217483246
1396,0.12083834259165292
1397,0.14916616396366297
1398,0.09735581298364934
1399,0.10717136360608337
1400,0.0686906945610335
1401,0.10507263035771805
1402,0.11151965489699148
1403,0.11307118646057282
1404,0.14047077810409797
1405,0.14037304790209754
1406,0.12994037607853398
1407,0.1114715382912155
1408,0.08349201664767576
1409,0.10471522904725336
1410,0.11363340119094696
1411,0.05834015649293844
1412,0.10473658052939819
1413,0.13442900137721286
1414,0.13109470182882121
1415,0.08242564658296732
1416,0.13198798532460884
1417,0.14440574897417874
1418,0.14702128638525563
1419,0.06666677948351443
1420,0.058206035550839176
1421,0.12841081722850628
1422,0.0862907576099465
1423,0.07445821657157017
1424,0.057622341342860796
1425,0.10891744455782702
1426,0.05963475123410711
1427,0.12023978598344358
1428,0.08983228343900666
1429,0.08773437160430467
1430,0.11918562681582875
1431,0.14929991884399452
1432,0.09995636037789507
1433,0.11047976949767739
1434,0.09211139554044875
1435,0.1437841027844689
1436,0.14087584985917792
1437,0.12744360259533388
1438,0.11625184279507413
1439,0.08581021142076518
1440,0.10626699499745454
1441,0.11385631243789414
1442,0.11265808008885757
1443,0.13509036315686795
1444,0.0894225045721333
1445,0.08121786249827254
1446,0.054250959064933685
1447,0.12961796254257896
1448,0.11840955385451382
1449,0.06730429465132218
1450,0.07852847231111726
1451,0.12768504222050697
1452,0.10488035844844543
1453,0.12755132699200955
1454,0.06104148166203956
1455,0.09036451960517815
1456,0.10408111554330857
1457,0.057404378753562274
1458,0.05798380479978515
1459,0.06327728771862573
1460,0.06501800666377561
1461,0.08899190478830693
1462,0.08142844964284993
1463,0.13406390521502276
1464,0.13455998720496762
1465,0.07116226988018351
1466,0.06177215026064025
1467,0.05701349652679732
1468,0.10193941458637978
1469,0.1411457715392545
1470,0.09749807122329529
1471,0.05661875984074921
1472,0.05097298387056984
1473,0.052876387013058246
1474,0.05478869021988839
1475,0.0972674617785394
1476,0.13090567760431626
1477,0.13171487474448934
1478,0.08211195577488663
1479,0.08575544064785123
1480,0.08956907580595228
1481,0.06049118512402218
1482,0.08663257446299982
1483,0.12902972868740836
1484,0.08185765996129293
1485,0.10946571213177128
1486,0.061603157609474615
1487,0.05379250608738167
1488,0.12448582364549787
1489,0.08000285183879653
1490,0.10787077077103
1491,0.05288470714149255
1492,0.10990617933623573
1493,0.14794014048542153
1494,0.13001017314446522
1495,0.149404482248026
1496,0.11899759746174071
1497,0.13145303258900476
1498,0.07018987891804429
1499,0.1077185016437711
1500,0.06331046429701347
1501,0.08781423443960429
1502,0.10394576681957704
1503,0.12681321091238745
1504,0.09875490510511946
1505,0.11537649179256947
1506,0.11086970509968261
1507,0.07739853273073469
1508,0.07826590319763181
1509,0.06468611762135293
1510,0.09480624938357482
1511,0.13831067235473474
1512,0.050421119817261745
1513,0.12478310731274112
1514,0.11354069474912674
1515,0.11661147772499333
1516,0.073600548176523
1517,0.05986708372606214
1518,0.13250118732626928
1519,0.13009662240377787
1520,0.08053168215405576
1521,0.11060602994525123
1522,0.1054496448002609
1523,0.12317852149462495
1524,0.13508235894950751
1525,0.05454474644603227
1526,0.05199056327131157
1527,0.05171496120163789
1528,0.09825859211502379
1529,0.11547008036112623
1530,0.09258575763668475
1531,0.09076184433645232
1532,0.057963242785662096
1533,0.14819333200828988
1534,0.08571897753975541
1535,0.08663000203952814
1536,0.06475099022198463
1537,0.07788572467533153
1538,0.09027481319862989
1539,0.11342382757106868
1540,0.1266812596717656
1541,0.09409388611694514
1542,0.14505070985610916
1543,0.10128173641167865
1544,0.08661186184489231
1545,0.1314029620228131
1546,0.12075017397913682
1547,0.07626089063241101
1548,0.14321794521124942
1549,0.10512274338093452
1550,0.07999831154337587
1551,0.059804157555023954
1552,0.133140770361863
1553,0.09438051108941584
1554,0.05829731846049642
1555,0.12913300058613847
1556,0.06137392721249268
1557,0.0899060440328331
1558,0.11033247021782286
1559,0.10922107377330913
1560,0.14758550232303635
1561,0.10397256987876072
1562,0.1390269468241342
1563,0.12737759367333734
1564,0.12483211004720633
1565,0.11277389721073318
1566,0.07896544517095158
1567,0.11958310262116843
1568,0.09558251991965419
1569,0.08747193568794345
1570,0.08973382002643428
1571,0.09638314067534387
1572,0.05201041104399495
1573,0.13829156963795458
1574,0.0566874347692665
1575,0.14338095188840716
1576,0.08211917209984053
1577,0.10016833598734493
1578,0.08527144083153113
1579,0.06513846308850488
1580,0.0633114498725464
1581,0.09714149841885175
1582,0.12290697431276547
1583,0.09174568693093507
1584,0.14734718228345905
1585,0.08083424551327686
1586,0.11888718750309009
1587,0.14197016515333472
1588,0.12532114264601818
1589,0.07513075808165459
1590,0.10723255086038141
1591,0.1211995672124302
1592,0.06798816468224805
1593,0.10736078821653752
1594,0.07832496047155146
1595,0.08148412809166095
1596,0.11996922160731589
1597,0.07214282806378142
1598,0.13166298242032637
1599,0.05376957907056182
1600,0.11651807273314482
1601,0.08959860343825034
1602,0.09474371297912026
1603,0.10530299927964828
1604,0.13065113492921498
1605,0.11798638806897832
1606,0.05051370334077161
1607,0.13706471685262772
1608,0.10575163812769131
1609,0.1493422735036984
1610,0.06025648509661777
1611,0.050304238929321045
1612,0.12727642048527565
1613,0.13360515897273648
1614,0.07702425969238975
1615,0.05705629150117798
1616,0.08472886709305195
1617,0.066254849663528
1618,0.10240396669394497
1619,0.09107443406770666
1620,0.11215553158928508
1621,0.11679037881846387
1622,0.13502175268335392
1623,0.09568934731255874
1624,0.13865754949663253
1625,0.12953713246751136
1626,0.05002090366396605
1627,0.10173876724492102
1628,0.0853984983707188
1629,0.08872984634056491
1630,0.06025229560526884
1631,0.14890097651670214
1632,0.05706322274736706
1633,0.12205817291718658
1634,0.0666535770239895
1635,0.06674815583086997
1636,0.08681203354587982
1637,0.06645653763578178
1638,0.08094234573809332
1639,0.05236217318550976
1640,0.09633717421091703
1641,0.07719672246475988
1642,0.06603731235321393
1643,0.06377608127656666
1644,0.10209118044147786
1645,0.1325520364590051
1646,0.1495707438960647
1647,0.05060218945154983
1648,0.0705340165566343
1649,0.05750870925884774
1650,0.13414279932464918
1651,0.06662527100641764
1652,0.06352065859141663
1653,0.08146017769972848
1654,0.08608082359512295
1655,0.12300378896125733
1656,0.08308080429596527
1657,0.055376006328001375
1658,0.14375704931445876
1659,0.06684424017585068
1660,0.11712257637508529
1661,0.10639117175797708
1662,0.055127544575815694
1663,0.08478653750621457
1664,0.09525358150534319
1665,0.1119998390410504
1666,0.11427871938036681
1667,0.1036154727153481
1668,0.13340548906299862
1669,0.0754297465176923
1670,0.0834353265903981
1671,0.07261692599287324
1672,0.14727100971630339
1673,0.09757479347691397
1674,0.13610836692409867
1675,0.144967283682444
1676,0.10135935335213705
1677,0.0790096568274165
1678,0.11450295611835734
1679,0.08510988604211638
1680,0.09979386759735404
1681,0.06944538030453223
1682,0.07180110299055222
1683,0.11487579605612458
1684,0.10898525564107928
1685,0.12711946455303513
1686,0.13256028918526094
1687,0.08699112401990212
1688,0.11491020334621112
1689,0.12320726753520836
1690,0.1171518454162462
1691,0.07585911313648161
1692,0.06511399303622024
1693,0.0731105166099253
1694,0.09417795550781821
1695,0.06792978455085974
1696,0.09003619366178642
1697,0.11276077648172245
1698,0.05255385465023674
1699,0.07391252209508875
1700,0.10713418029819809
1701,0.11235713176368917
1702,0.09176711396049322
1703,0.07632153479634791
1704,0.11774944095136229
1705,0.09044700525813891
1706,0.13383626680844146
1707,0.14600237743937078
1708,0.09692796910357782
1709,0.10227411901954334
1710,0.14174501210234408
1711,0.11639214130265711
1712,0.05562737180465525
1713,0.10765212772111735
1714,0.07027243947288715
1715,0.06081317304194413
1716,0.07514487734351774
1717,0.10319678467555603
1718,0.06976774999991174
1719,0.13112340817531198
1720,0.14756126980498474
1721,0.13995793005540713
1722,0.13650696173356613
1723,0.08572549368926709
1724,0.14331694318940852
1725,0.13816453072703538
1726,0.09547481268832883
1727,0.0943689304430426
1728,0.08575423791010575
1729,0.070193257695929
1730,0.06612652061269247
1731,0.09818071328787628
1732,0.05957090934946496
1733,0.09931635085799217
1734,0.0894784466437379
1735,0.09831700938285287
1736,0.05058394854507338
1737,0.06047250313042571
1738,0.05612183449555629
1739,0.11145207167853775
1740,0.0793616535647541
1741,0.08923162825595247
1742,0.11021074999860658
1743,0.10625805769941764
1744,0.14204370065805044
1745,0.09408455260833454
1746,0.12659486436436262
1747,0.10168801304058234
1748,0.10902204665225346
1749,0.14826844913238213
1750,0.11551398463798813
1751,0.13489783654360135
1752,0.13390569134571492
1753,0.12431303139125228
1754,0.06434659739859444
1755,0.052652964099839716
1756,0.11429105852716577
1757,0.09966259825478861
1758,0.10811943645791144
1759,0.08823970085817744
1760,0.13267010115145345
1761,0.11064930210083695
1762,0.09696227349435188
1763,0.1342166815159816
1764,0.059181076087763754
1765,0.05892024042887137
1766,0.10545176959761215
1767,0.100668496723757
1768,0.08427448320939608
1769,0.09861241596772208
1770,0.10834239275982505
1771,0.08980046781320589
1772,0.090869606394393
1773,0.1075984895809037
1774,0.1390791801040794
1775,0.050148607027180984
1776,0.1291614818465187
1777,0.0717019992321726
1778,0.1260663356176494
1779,0.14766887473609946
1780,0.08776856241969162
1781,0.14223321417967316
1782,0.057512430391014106
1783,0.1054459077017483
1784,0.1276624581903063
1785,0.10666231083168992
1786,0.127322522933003
1787,0.080773546415897
1788,0.07509968750006393
1789,0.09155556104448913
1790,0.06271016542155947
1791,0.063768250772867
1792,0.10313977894469105
1793,0.062231479078453514
1794,0.08103169951566318
1795,0.12934001864147454
1796,0.09242064423074967
1797,0.05599146716821443
1798,0.06743158106041343
1799,0.09571681654225395
1800,0.0819543983299671
1801,0.08673461622963648
1802,0.12311237874711663
1803,0.1407695289192723
1804,0.05128608512716352
1805,0.112469550734241
1806,0.12774293029042633
1807,0.130457593271887
1808,0.08044922084648784
1809,0.13929847396095027
1810,0.07726483365848417
1811,0.065118107839141
1812,0.134655663561968
1813,0.06563348236292255
1814,0.14207030761461076
1815,0.1357878766259164
1816,0.10283335178220858
1817,0.05860968409955654
1818,0.12780252343818205
1819,0.14984400216301805
1820,0.09504863176805117
1821,0.060225184611964445
1822,0.09608715544800273
1823,0.12032270992412104
1824,0.1108229099388721
1825,0.10095679178750197
1826,0.11849513804449194
1827,0.1450180505776131
1828,0.056844169134934536
1829,0.0856486966165109
1830,0.13900899243446896
1831,0.06937093373180798
1832,0.0687218415872586
1833,0.0966180978233963
1834,0.11620751899591863
1835,0.1315691135951924
1836,0.06680741913945182
1837,0.06281152209365087
1838,0.07159760845274936
1839,0.1127867799155746
1840,0.08413514110377292
1841,0.12610876703975862
1842,0.12347449060193778
1843,0.07731910159133623
1844,0.12379482951868045
1845,0.09771997028259594
1846,0.11421729500679678
1847,0.09099289582949285
1848,0.08250225163348876
1849,0.08129756955355147
1850,0.08140544645495089
1851,0.08864504968528661
1852,0.0876886274382802
1853,0.1239035150473983
1854,0.12615224138422174
1855,0.13985614339412106
1856,0.14007896832505767
1857,0.11248724996590591
1858,0.12788258710130218
1859,0.09402166519329212
1860,0.0837062104391393
1861,0.13549390267624717
1862,0.1087548405038348
1863,0.06141623468404574
1864,0.11834644626953626
1865,0.054045741537045736
1866,0.1428770811781246
1867,0.09022705130837998
1868,0.056369343056783774
1869,0.11170936738408976
1870,0.053831633686973294
1871,0.13578076781826656
1872,0.11603080541430853
1873,0.12253033347618993
1874,0.13481629710424436
1875,0.13817597728572673
1876,0.08940045627229114
1877,0.0637758012157873
1878,0.1370309545573326
1879,0.12098191953744629
1880,0.09553533683333854
1881,0.13525118954758514
1882,0.08054343066633685
1883,0.07040910187851813
1884,0.06202368603383923
1885,0.0647131573746413
1886,0.13808828767013148
1887,0.09777483045154317
1888,0.06925372273937594
1889,0.1481911942147504
1890,0.1309862217768278
1891,0.07330380754799573
1892,0.131430613370745
1893,0.11105899128637914
1894,0.13518661299542395
1895,0.058039458147488246
1896,0.07729978278942827
1897,0.07994510484518509
1898,0.07668896872053686
1899,0.06282346863138398
1900,0.14620020241047094
1901,0.07848082211538182
1902,0.06788224398301859
1903,0.08832779830631907
1904,0.14439559722117673
1905,0.07591306853200067
1906,0.055140060999966094
1907,0.06276980401465553
1908,0.10765756299944779
1909,0.10543808420728243
1910,0.0943179250266839
1911,0.05324608828226868
1912,0.12398706305308849
1913,0.11560886809134548
1914,0.054112819305443385
1915,0.14870277536542853
1916,0.09523885019255471
1917,0.11230925082135289
1918,0.11550132121919228
1919,0.1338165095091832
1920,0.053971933930414655
1921,0.13011653954209995
1922,0.061153629267515
1923,0.1271069672031046
1924,0.05081007505316283
1925,0.05525084149368303
1926,0.1169240465478988
1927,0.09215506738458518
1928,0.07103573423221418
1929,0.1219140479095482
1930,0.07470175325603452
1931,0.0589028615175533
1932,0.13232926291307284
1933,0.10855545004637479
1934,0.07130300085766464
1935,0.08821596455661443
1936,0.1387377447924668
1937,0.11347482442974216
1938,0.06281662625647474
1939,0.1060300373062967
1940,0.10576572285968447
1941,0.09964022419496504
1942,0.09774834679841286
1943,0.12898555035579512
1944,0.09853314599659241
1945,0.05352367350679346
1946,0.0562383243327148
1947,0.07667681830946793
1948,0.12632162632329968
1949,0.05132944106265224
1950,0.08659782387840863
1951,0.13563265556945303
1952,0.12205404697290939
1953,0.09378905618250294
1954,0.11929192306481211
1955,0.08635261884712472
1956,0.10235326041499665
1957,0.14358675761291068
1958,0.05789256474425219
1959,0.12107948169544326
1960,0.14676230333249846
1961,0.09615696953125846
1962,0.12402449596554085
1963,0.14907487739596348
1964,0.07177194302846826
1965,0.08802617533445233
1966,0.14616608718519036
1967,0.09691207325506493
1968,0.10129910956434279
1969,0.09406687078176731
1970,0.13454716430843605
1971,0.06271310447064997
1972,0.10381792508140458
1973,0.09830767733808753
1974,0.05723091634094533
1975,0.0571999625243545
1976,0.08650350513095113
1977,0.050846770651385875
1978,0.11490729155778347
1979,0.08041265271308833
1980,0.1378483853832974
1981,0.05350595635963509
1982,0.1339737733635048
1983,0.10480440565135804
1984,0.1265672165766628
1985,0.12052297782918965
1986,0.05875899545175503
1987,0.09252200425513404
1988,0.08532993324326112
1989,0.12172051022472999
1990,0.12117205242065807
1991,0.0691369337955898
1992,0.1311252710167199
1993,0.06361154635945493
1994,0.06453543472469993
1995,0.07847699874568542
1996,0.1198732424609804
1997,0.08869817852386884
1998,0.08199424585940601
1999,0.11645879937823002
2000,0.14957916044299413
