episode,average_reward
4001,8.056641271948013
4002,6.8539866985388755
4003,9.885461828180476
4004,4.062568348656348
4005,7.174152660994638
4006,7.503776397909409
4007,8.12660586103533
4008,8.584543563407642
4009,0.3373744768539966
4010,0.812210521229747
4011,6.049884602859494
4012,6.928894477936808
4013,1.4920677090601686
4014,2.6164261122490498
4015,4.518383719746448
4016,3.525941415916182
4017,3.305953732274393
4018,7.028446384042949
4019,9.691001026480418
4020,7.642510864443121
4021,8.156513896940417
4022,6.970077169732142
4023,8.901233576754036
4024,5.033346727615061
4025,7.297111096016113
4026,8.394060415755321
4027,4.124161582556367
4028,2.465520546388571
4029,6.662294932447876
4030,9.274030905045867
4031,2.980012789224186
4032,4.456467452151674
4033,1.946853862578135
4034,3.8497573651575543
4035,2.822483441349417
4036,2.256308008840807
4037,5.824573606543354
4038,5.721728898950223
4039,3.5121627512833387
4040,0.8389578695477895
4041,9.986428363515396
4042,8.11758005528499
4043,7.726533799811312
4044,9.566782454828228
4045,9.621264144556722
4046,1.5373079984939186
4047,5.430352009372551
4048,0.5187155005393684
4049,3.2228677246697144
4050,0.5930335307229795
4051,0.9949737747680099
4052,8.600971085643994
4053,7.0671772817910945
4054,9.618275298063235
4055,7.929162837232685
4056,6.26205811497218
4057,9.730363436565423
4058,2.1798877825249727
4059,1.666538766945479
4060,4.0172889250434345
4061,8.091388649965282
4062,5.703638855239987
4063,0.6971893215663671
4064,7.8066448728079365
4065,1.9035769582563367
4066,6.921887199008216
4067,2.3974398423993937
4068,8.390141596747856
4069,4.315209669311083
4070,5.067460536487298
4071,5.2274006051110895
4072,8.325725726331004
4073,3.574481702957537
4074,1.0584672063209488
4075,0.04169604152936324
4076,2.796724567124209
4077,1.1981426998877165
4078,7.503844408610813
4079,4.912187235186204
4080,4.431835090055795
4081,6.148532422055851
4082,1.5224148513816704
4083,6.448724536776323
4084,8.84115525619622
4085,5.486131900140339
4086,4.99675967388315
4087,3.70706603823118
4088,3.224047215872022
4089,1.0426082520588054
4090,6.202159643715045
4091,8.28756275227202
4092,6.483240929465782
4093,6.018440436163154
4094,6.219733274187837
4095,2.534075032108883
4096,3.7237525197841927
4097,9.702148669511178
4098,9.11689403536012
4099,6.088894180122627
4100,2.3378328919350313
4101,1.8346324078482579
4102,2.6878234251664592
4103,4.685031260914001
4104,6.619161290463036
4105,8.060604955441118
4106,2.621735290088163
4107,5.560516365774384
4108,5.328170501179975
4109,5.365843433952447
4110,4.144276033486269
4111,7.684738645402418
4112,1.0172244861024693
4113,5.474549123335407
4114,3.3100674622671944
4115,3.534828143563492
4116,1.705010567453269
4117,2.6802059444192174
4118,5.342361342026943
4119,8.17303069825172
4120,4.57416000833846
4121,5.718814467352021
4122,5.852458679717005
4123,8.108801639243715
4124,3.2171908920857453
4125,3.053434892076383
4126,2.40287905782003
4127,1.6070633363502218
4128,8.006435751089514
4129,6.327111910544754
4130,3.2555670450609475
4131,2.41004193741904
4132,6.906309944353205
4133,1.0128949585431424
4134,4.8622392820879226
4135,7.608117818249317
4136,7.702688343874532
4137,6.744700148493067
4138,5.527809337262188
4139,7.840212597776933
4140,2.548541461682834
4141,4.533528165432072
4142,7.0586257958653
4143,2.9331007698038936
4144,1.2324761814456575
4145,5.2561410307575755
4146,6.208426529092128
4147,9.377111824257216
4148,9.285502396977009
4149,1.1056172920568608
4150,4.990863290141011
4151,8.01578648442104
4152,2.406941845525913
4153,0.5361810949649937
4154,2.569454568771018
4155,5.233297610427022
4156,2.537706876699648
4157,7.66236182530589
4158,8.46607011099037
4159,3.959040808018944
4160,2.36598980645058
4161,5.142093341984932
4162,6.250946435340765
4163,3.3950756073891575
4164,8.529245161946577
4165,4.097564660939411
4166,6.036990914506993
4167,5.056605220192427
4168,7.487933663380413
4169,5.365724082236987
4170,0.23610886148992427
4171,4.357755071737133
4172,1.0445678750421084
4173,0.874269531877242
4174,3.679532257187276
4175,3.8982747563890063
4176,0.1699556032093097
4177,1.4568752267657425
4178,1.3661882727099417
4179,9.276816579848685
4180,0.5820586554206175
4181,6.305603260708469
4182,9.120502939543693
4183,8.782590769445012
4184,5.26807774925936
4185,2.0233763085685563
4186,4.599162185077052
4187,1.0608616346815736
4188,0.8787323931460966
4189,2.0876651410924953
4190,8.95342834573055
4191,9.927043501059828
4192,0.780880014532821
4193,7.555362478003373
4194,4.115554367593415
4195,9.200510260806805
4196,8.137904237398203
4197,9.316369018495422
4198,1.4725006542974572
4199,1.5421647011472772
4200,7.923336564763247
4201,1.0002064503038743
4202,4.256834204523353
4203,6.033699463255717
4204,6.170381398723915
4205,0.5885486977859766
4206,9.350735909191801
4207,9.469698956234296
4208,2.826919044760323
4209,2.6828903490277267
4210,1.5671293139940012
4211,1.8140218368949756
4212,9.519671118789821
4213,2.0207307254456843
4214,5.404251075473411
4215,7.615846689773614
4216,1.7639297082052041
4217,6.424631256653781
4218,7.312735085578591
4219,0.21222942574658954
4220,0.4372654451277269
4221,7.708189748101079
4222,8.965718894622594
4223,8.229435282960301
4224,0.7422929638258202
4225,7.2386991801893155
4226,4.6648127503045975
4227,6.064202071621762
4228,2.131515194643505
4229,7.942257199496615
4230,9.329698735985993
4231,4.302006992948856
4232,3.0660703608442743
4233,9.86921020918143
4234,9.818341423494374
4235,1.323242683464494
4236,0.23610547054075393
4237,7.589031431909044
4238,2.6253118161234426
4239,0.20075530867575075
4240,3.384468848775113
4241,4.1734975548571
4242,7.663442720999947
4243,0.41176324242309215
4244,3.8871149542859804
4245,0.8256230849818236
4246,0.0719683478723776
4247,2.8167465635385094
4248,2.165455603316989
4249,8.05229008156101
4250,2.1166195690439515
