episode,average_passenger_comfort_index
1,0.6205643640587808
2,0.5394764319108506
3,0.5941830898736135
4,0.5220858604768427
5,0.6560919951075683
6,0.5566843454420082
7,0.5854292722955313
8,0.7535096281736815
9,0.6384802222895053
10,0.616316939121947
11,0.6688391180957722
12,0.7864681931764594
13,0.516950945799878
14,0.7861818036926858
15,0.5550179383115004
16,0.7165469238624409
17,0.53719482378174
18,0.5142332603632817
19,0.5836113885653715
20,0.6288388191692424
21,0.7283137912608925
22,0.6149900348271672
23,0.7778202380538457
24,0.7931411790558625
25,0.548921026165683
26,0.7532637063962613
27,0.6229812702682813
28,0.6862025027069554
29,0.5791602752432603
30,0.7513089886165878
31,0.5244166502257283
32,0.5146488741929698
33,0.5712700035320335
34,0.7997749948332373
35,0.5746593120290069
36,0.5648426844162922
37,0.6534349186902758
38,0.5160682325642448
39,0.5664853896217796
40,0.6006164739641893
41,0.7429894011183479
42,0.723051658018496
43,0.6692323132398055
44,0.6695509164272256
45,0.5959542494870511
46,0.6531665757744202
47,0.5813456610801352
48,0.7696629410822786
49,0.6900123192201533
50,0.7115745525153672
51,0.6996405746503953
52,0.7908120670890884
53,0.5125042657103787
54,0.5775839803079497
55,0.6348923267358029
56,0.6392118089001683
57,0.6003212311575803
58,0.7901714788272072
59,0.6278195046992664
60,0.734559858978633
61,0.718358380036139
62,0.7411344507774813
63,0.543226216249554
64,0.5242930731571478
65,0.7416943076721927
66,0.648889591605395
67,0.5075943803684693
68,0.7275967515405332
69,0.758632038214625
70,0.6347373973926336
71,0.5851744835136712
72,0.5057669818866011
73,0.6600775489469493
74,0.5353959915700561
75,0.7737512670842872
76,0.5547690036324122
77,0.563956887413374
78,0.5203128576577069
79,0.6741078922830126
80,0.695824867753398
81,0.5373856200308056
82,0.6017979260731006
83,0.5282400585478676
84,0.698248466832671
85,0.795743720135938
86,0.7285425024263912
87,0.7915400284110385
88,0.54360115711387
89,0.5172342026211936
90,0.6679421999350681
91,0.6532240057596923
92,0.6599331126699772
93,0.6461389985911069
94,0.6474962918325957
95,0.6655645035256529
96,0.5822844207571621
97,0.7844584878411768
98,0.6624596931567055
99,0.6596954390498829
100,0.7771991572107305
101,0.686771571290142
102,0.7558598224647484
103,0.6374740649513051
104,0.5719335740188526
105,0.6242453087865754
106,0.5793612100715987
107,0.6550057439577974
108,0.7635502241042349
109,0.6526306186953207
110,0.5918816498917728
111,0.6994581626897469
112,0.6849336144502498
113,0.6943880299778658
114,0.6625317838509315
115,0.5599641054586072
116,0.5491665336589531
117,0.7760429900948156
118,0.6980540187068691
119,0.6211826287561508
120,0.5655736038723298
121,0.6157994369725611
122,0.5711548860506713
123,0.7061631005980006
124,0.7294410481010425
125,0.6938839230506508
126,0.516507212650626
127,0.6552753177785267
128,0.5332232614001551
129,0.7465369341964117
130,0.7433273930271597
131,0.5196771201456174
132,0.5220001790070523
133,0.5643780561617011
134,0.5388219454162201
135,0.5088562773179779
136,0.7606828319351563
137,0.7553959492642349
138,0.5662313349385066
139,0.5341681756584008
140,0.5520515596182235
141,0.6029517005084355
142,0.6699620091284793
143,0.566695927749335
144,0.6940242809206912
145,0.6211780817101926
146,0.5927627094686316
147,0.5696228766836695
148,0.5953007499747827
149,0.6687430908675905
150,0.6855606565784894
151,0.630213028963807
152,0.6778694323994878
153,0.5754643780138048
154,0.6379812662929016
155,0.5661735611097676
156,0.7173193457251043
157,0.5170967599005462
158,0.5738367418733571
159,0.6477258016935137
160,0.5418584469968847
161,0.722834840954906
162,0.7788370235376152
163,0.6495379317266228
164,0.6911732590474979
165,0.7314582747523157
166,0.6917392388471792
167,0.6327986465620347
168,0.5768954261962158
169,0.509823008913359
170,0.5457119482194306
171,0.6591917657134316
172,0.6469049358082639
173,0.5946811697691338
174,0.7107473697576823
175,0.7917500898656681
176,0.565897204740013
177,0.7424827559575896
178,0.5041667096719363
179,0.7278403586889843
180,0.6209267957528144
181,0.5848481698833995
182,0.7426779926830995
183,0.7320384463370618
184,0.6865580490953911
185,0.763657878134059
186,0.6927987337432283
187,0.6033135259717057
188,0.6055056992333341
189,0.5531175452887003
190,0.6380953410808804
191,0.6285137313402706
192,0.5607608785794552
193,0.6566704248761
194,0.7597201389224476
195,0.6622852274609183
196,0.6251423568893566
197,0.7173197999211474
198,0.7967647705530387
199,0.7834723632993259
200,0.7571754311285313
201,0.6371553273861716
202,0.6639289950767141
203,0.5062196593114465
204,0.719460560927049
205,0.7826892354128436
206,0.7795149279856648
207,0.6734552745088115
208,0.6258410578891425
209,0.5391976933503557
210,0.7477262297191254
211,0.7336277480897114
212,0.7601513174804414
213,0.6853971078327159
214,0.7841663117453371
215,0.5266936642647119
216,0.5106502299599989
217,0.7014598681635257
218,0.5947353622192476
219,0.6326207730160915
220,0.7997438523453418
221,0.6181807955692694
222,0.5404720644027271
223,0.7803992207188527
224,0.6117745868537748
225,0.6326374907265013
226,0.7025989425857891
227,0.5795306615293515
228,0.7318974239244281
229,0.732739741495066
230,0.5918774302092699
231,0.7435453221236743
232,0.7823577586482073
233,0.6070631525036376
234,0.5108387361043101
235,0.5647890912495194
236,0.7655608614121338
237,0.5867471931846853
238,0.7718848336275002
239,0.7485219982241671
240,0.7372100881393356
241,0.6084279132656215
242,0.5670387926738774
243,0.7948498692823897
244,0.5826544538182181
245,0.6327511362478733
246,0.65936605996465
247,0.796434992231345
248,0.5333194820316831
249,0.5756762509243251
250,0.6920131218611223
251,0.5551982413149441
252,0.7839112300211257
253,0.5388815879442399
254,0.6469867669425091
255,0.5043897877843898
256,0.6613126952361068
257,0.5242748659065656
258,0.6818832448744307
259,0.5138878745335517
260,0.5443781892344242
261,0.6831664287706037
262,0.6206606851663423
263,0.7109397867066771
264,0.6577715807782899
265,0.7315687138784109
266,0.5597760213761095
267,0.6409785768920004
268,0.5035529323383553
269,0.5248963845426606
270,0.7215368887509441
271,0.7877391382025885
272,0.5458777807803841
273,0.5561045207590625
274,0.5879517252415926
275,0.7670149887628847
276,0.5650305567214694
277,0.6589873296188873
278,0.711503257172473
279,0.5127964856986911
280,0.6252701377098352
281,0.6418828160545491
282,0.528711906767293
283,0.5885026947516079
284,0.6428563831506743
285,0.6495988470240739
286,0.7928002343581009
287,0.5653230270584622
288,0.5288999870950454
289,0.6061802789398845
290,0.7425086102408243
291,0.5033781440538159
292,0.7323729138274351
293,0.6751508786850005
294,0.6286306803230843
295,0.6972878984004222
296,0.7932347025845174
297,0.5557882327597519
298,0.7200830183716637
299,0.5420159126124419
300,0.6008188628951066
301,0.5888065741611055
302,0.6705259313772405
303,0.748837476402242
304,0.5265725428806114
305,0.5163790651498483
306,0.5685226611553842
307,0.5604813495833084
308,0.5038976439832338
309,0.6200972620575882
310,0.6506861178970497
311,0.7648901116137806
312,0.7139161234424205
313,0.648379332058215
314,0.5963333935557389
315,0.5840451774986313
316,0.5818204263298026
317,0.5665023559107916
318,0.7651706491204403
319,0.7807998266594639
320,0.7124606506823414
321,0.5987704273361315
322,0.5508871627799915
323,0.5200461498183361
324,0.745517828737438
325,0.6972873048628981
326,0.5691967233714486
327,0.6740999931118091
328,0.5496712116172797
329,0.7660553104118503
330,0.5049027172497184
331,0.7904169682234485
332,0.7526337493086825
333,0.6048046090236951
334,0.7037066570447542
335,0.5403087163763793
336,0.7833178432730485
337,0.5780009475173029
338,0.6460847577488495
339,0.6505370629015734
340,0.6906645764125076
341,0.6818523189196095
342,0.7006217131805308
343,0.6062320611984544
344,0.5904479504126761
345,0.7898996751256219
346,0.6525557343323133
347,0.76599781073633
348,0.6386282619081134
349,0.7731903310827085
350,0.6727373305640649
351,0.7673651787167329
352,0.6697863412334104
353,0.696835460363341
354,0.5633829789306434
355,0.7525527248591524
356,0.56163965289937
357,0.7304574020341671
358,0.6712232291324055
359,0.7038680129505986
360,0.5064396927209645
361,0.7151443605519325
362,0.7075557106955208
363,0.5727153548426722
364,0.553460981267042
365,0.5996759193887415
366,0.796773081808043
367,0.6937879877836939
368,0.6247698780431931
369,0.5210043613899756
370,0.7953417697541312
371,0.548050947340603
372,0.7284100737595789
373,0.6265010583334449
374,0.6682232917702087
375,0.6741219702451793
376,0.7478283901881275
377,0.6920779307626044
378,0.550417862928105
379,0.7133032703621855
380,0.765939506184725
381,0.579636051877292
382,0.580147759925224
383,0.605454716411801
384,0.6254481277766806
385,0.5678524686657812
386,0.6023749570555563
387,0.614739582835802
388,0.6407777808417071
389,0.6718368949683239
390,0.6383302822125837
391,0.7232837665133965
392,0.6052410382269662
393,0.5286258886468506
394,0.7805608900160451
395,0.5088204673584816
396,0.736656851751627
397,0.6666846950982703
398,0.7987719751890181
399,0.7068242139431994
400,0.5638554681578799
401,0.7278714180014235
402,0.7599704088550967
403,0.510841615036973
404,0.6733026178431794
405,0.6291449214534267
406,0.6716384192662104
407,0.6689129187742582
408,0.7458597974307184
409,0.6267891989552683
410,0.6310692777453718
411,0.5463489798875153
412,0.5832882343816121
413,0.5641112793698435
414,0.5979205291088865
415,0.7681699442480009
416,0.6020370486399491
417,0.5769090325718002
418,0.7728548782410336
419,0.7556992314950526
420,0.6600653229889681
421,0.7782425829423634
422,0.5300925665009609
423,0.6885923223168791
424,0.6711020092521824
425,0.5667650999234721
426,0.5765698060439627
427,0.5042294595050383
428,0.658385249164518
429,0.5747389135157404
430,0.7546945327444909
431,0.5639241845728687
432,0.5544064899183523
433,0.6084206255556794
434,0.529122562401688
435,0.6534669136867025
436,0.7321289127282825
437,0.6518267282936723
438,0.7947367023837246
439,0.6734383227755243
440,0.67852601099318
441,0.7660133723733589
442,0.7373223726325739
443,0.6616098588421792
444,0.7671773074863888
445,0.758381593697609
446,0.7742891103786822
447,0.5318328818711998
448,0.6238365850329458
449,0.7764852246778436
450,0.590885683988573
451,0.6093269315250881
452,0.6736605541575551
453,0.6757227254199438
454,0.6339262033377824
455,0.5070584877057518
456,0.6093371439288835
457,0.5145986096911143
458,0.7614644608087013
459,0.6385784602519696
460,0.5665190599676486
461,0.5036599323705216
462,0.5384456512740687
463,0.7687217061728965
464,0.5322862449265781
465,0.7201863516314679
466,0.717561193424542
467,0.7458695784753598
468,0.6668606412593392
469,0.7738175645978099
470,0.7203496369538622
471,0.5763403453767784
472,0.6067721002216149
473,0.5837732826515338
474,0.7759080389983296
475,0.6029669929821004
476,0.7517640679049423
477,0.7416466229071763
478,0.7979204670498237
479,0.5530132038465523
480,0.5387937888437684
481,0.6732383734678837
482,0.5724595947828973
483,0.7867576882354885
484,0.7115014838100471
485,0.6400648902101571
486,0.6277153985638773
487,0.6489514427440676
488,0.6998247196782456
489,0.6618749413766217
490,0.7934215462867145
491,0.706986938340636
492,0.622956455176419
493,0.5352067090962985
494,0.5326612370122811
495,0.7477746396073621
496,0.7153514298548742
497,0.618893730773163
498,0.7656694652987308
499,0.6733936612054965
500,0.6257717947044176
501,0.664082304257571
502,0.6393119837833592
503,0.746538333259224
504,0.737162563467438
505,0.6179889451821623
506,0.5170505896322569
507,0.5177707551983459
508,0.7470193015817984
509,0.6849924242536767
510,0.6287133702250056
511,0.5032397847796083
512,0.7839703111242371
513,0.7856229045505931
514,0.5508247268585497
515,0.728022670967663
516,0.6507177404889937
517,0.579521214880823
518,0.5715993799112384
519,0.7236855483987847
520,0.5977854783803079
521,0.6875664804501176
522,0.7143160684389259
523,0.6749890956954685
524,0.547075180275365
525,0.6531424687380508
526,0.5679332849481785
527,0.7736082733995788
528,0.6002269547949253
529,0.6468540234387428
530,0.7876540725122576
531,0.7585760420003504
532,0.7330192727231531
533,0.6407771994127861
534,0.654530195354319
535,0.7338920852458125
536,0.6930043311670533
537,0.6674102261916549
538,0.6413199413696344
539,0.5687168923477203
540,0.6220349954497224
541,0.7161281418071199
542,0.7310466393440891
543,0.7829424675872099
544,0.7538953680481497
545,0.671182753627378
546,0.685537512322733
547,0.6335632851668536
548,0.5524059470599795
549,0.5887581336137196
550,0.7368907236126426
551,0.532063028674742
552,0.6998535058197937
553,0.5535579495152245
554,0.5292333103725936
555,0.640922821124791
556,0.510991948527592
557,0.7720443898562086
558,0.5903253792852767
559,0.6065631017670048
560,0.5997905238878778
561,0.5492878026224811
562,0.6921516917197246
563,0.5908202380835286
564,0.7309843778147143
565,0.6646927925899739
566,0.5819485473774395
567,0.51268715288144
568,0.7296897951337842
569,0.7507095662110747
570,0.6246180843878885
571,0.6228456250406688
572,0.7982618508025361
573,0.712908589895551
574,0.6133618036718421
575,0.5102377306286991
576,0.5854276584050309
577,0.5432423493770865
578,0.5395863288277702
579,0.6485111870327204
580,0.6830418387859885
581,0.5378538941222022
582,0.7652028713161209
583,0.5668056697151813
584,0.6467784120926088
585,0.6967725143264045
586,0.6402860116608163
587,0.7063949479779709
588,0.5415799903867585
589,0.6754167710016346
590,0.6334700465505768
591,0.7375131493778362
592,0.7867264271773828
593,0.698568980051645
594,0.5066441290894723
595,0.6727677741830302
596,0.7478721922536611
597,0.6735765514857057
598,0.5311519134074277
599,0.7590434942691396
600,0.7633848916393274
601,0.6560767451515253
602,0.5030164946428299
603,0.7685414933802928
604,0.6282406442067222
605,0.7288919899467862
606,0.6467657985213515
607,0.6752627747491261
608,0.6055504440499261
609,0.5729436761631923
610,0.7194493773721298
611,0.7307432261326858
612,0.7372823956300869
613,0.5063290003346584
614,0.7557776962302911
615,0.7814892444893371
616,0.6139915834049781
617,0.7172166445249967
618,0.5432594734698435
619,0.6733006382660834
620,0.7179906124872856
621,0.7638836403540281
622,0.6205892807078854
623,0.6898155625928124
624,0.689533076196426
625,0.6761945881315271
626,0.6893692614528105
627,0.6410796945787446
628,0.6367893690844028
629,0.7798186719860716
630,0.547181313269134
631,0.5913398429176011
632,0.7193149394984117
633,0.5163588802867848
634,0.5868545863689709
635,0.5507462006176076
636,0.636249470780677
637,0.5738767441838784
638,0.767605318274535
639,0.6391637256822964
640,0.6309709174132856
641,0.7532278801447787
642,0.6941665559197472
643,0.6243186733780958
644,0.648652670277613
645,0.6168754373206483
646,0.6853380099702251
647,0.6149343704288288
648,0.6547579254585236
649,0.5658200881020546
650,0.7636477470002186
651,0.5648141081586049
652,0.6625313879297008
653,0.5474776227548794
654,0.5074685134764993
655,0.6810117178963828
656,0.5612918464993999
657,0.6825250734658415
658,0.6979449813760805
659,0.7766503655086996
660,0.6941740892749408
661,0.6692368334021567
662,0.591778442655669
663,0.7741059261527325
664,0.5556208769260274
665,0.6321531275330529
666,0.5931243033918937
667,0.5086717462813568
668,0.7772086754295426
669,0.764936398139203
670,0.7880693934016385
671,0.604375092492162
672,0.6090475989095073
673,0.6290225116118182
674,0.5096138841540425
675,0.6510737200456074
676,0.6296528213354717
677,0.7270310936829988
678,0.5776698655112378
679,0.50076363545487
680,0.780116291458681
681,0.6812719887163274
682,0.7466608921905025
683,0.6708872238517148
684,0.6091664577328754
685,0.7391425815264729
686,0.5982807988950256
687,0.7572990708432765
688,0.5499872619655501
689,0.5150000154151235
690,0.6941534838361322
691,0.7892854951467219
692,0.789409316419149
693,0.5896025069123939
694,0.7975048480475486
695,0.620403547858678
696,0.6978069896727505
697,0.7862179201367516
698,0.7670335603884353
699,0.6239349115667872
700,0.7384354576540766
701,0.5577420935545402
702,0.5387950685788776
703,0.5621768638579409
704,0.5332104286714976
705,0.6111798691831438
706,0.5689927552705468
707,0.7857018464838805
708,0.7496632695001673
709,0.610838287255717
710,0.73237369041658
711,0.6736382754897199
712,0.5243375519941758
713,0.5452757171974499
714,0.6182673180202757
715,0.7388417778224339
716,0.752890042939093
717,0.551098356713607
718,0.549329013662677
719,0.5300722433563199
720,0.5984850019745394
721,0.6196033893231867
722,0.5415137787248406
723,0.6658838704127705
724,0.6345600854892158
725,0.7896930561116664
726,0.5174213263916267
727,0.5533448769352507
728,0.7267927789390805
729,0.6055734548603627
730,0.5539819753842243
731,0.7927679867809914
732,0.7153439161148545
733,0.7167203261594456
734,0.6213488367819564
735,0.585245096086499
736,0.7228706401851421
737,0.6807182434973562
738,0.6940464256542307
739,0.6293022622573134
740,0.5097644622122267
741,0.5962331884188783
742,0.6216327069511608
743,0.6157757754438418
744,0.6869055039262462
745,0.6974935631313104
746,0.588406210799541
747,0.5781806065861663
748,0.6750450164030032
749,0.5984758862046333
750,0.6444488584535365
751,0.6258599876635786
752,0.588270194588864
753,0.6014243562664311
754,0.5383832302814638
755,0.7793082388705224
756,0.5331374458732333
757,0.5431093772618917
758,0.6385232077624665
759,0.6677798692862155
760,0.7714047307671099
761,0.701367875888273
762,0.5453581786553491
763,0.7975983868264707
764,0.6792259443072374
765,0.7465712882104907
766,0.6372696070699779
767,0.6476202020050514
768,0.7652047831743527
769,0.7650516356293998
770,0.6994417941104059
771,0.5108834181301554
772,0.5198740969650598
773,0.5175240579162058
774,0.6625961374909326
775,0.738126213118197
776,0.5561859841065778
777,0.5481725279172807
778,0.6718161787233715
779,0.6537100614347358
780,0.7445322229670984
781,0.5789090239952492
782,0.6035587742485973
783,0.6556364099180287
784,0.5403319050867732
785,0.6111867886344707
786,0.5693651605651538
787,0.7769135125412275
788,0.733476896501202
789,0.5813393509880035
790,0.6276471194498455
791,0.7935570772970024
792,0.5633622515127515
793,0.7761514233910175
794,0.6291417877347067
795,0.7680640346389688
796,0.5874842388388637
797,0.6514387138073945
798,0.6432983261691887
799,0.6070384179507732
800,0.5887647443779133
801,0.7361419303371263
802,0.6079322431005834
803,0.5606816258712448
804,0.7701656459985424
805,0.5518141279872039
806,0.6458846623198162
807,0.6107095893543442
808,0.7220991612033424
809,0.6608801697340435
810,0.7230962706952742
811,0.7960556024206833
812,0.7289342052451602
813,0.7456967540180415
814,0.5453140885551343
815,0.7076162392030597
816,0.5030286785644627
817,0.68946486397919
818,0.6457546128645013
819,0.6613468097056381
820,0.5228432700668159
821,0.5312075167008101
822,0.5556986438432366
823,0.6862855053118168
824,0.7233667968254257
825,0.614144615540151
826,0.6097277479808608
827,0.7187397194326374
828,0.5329590390912073
829,0.6850073816427057
830,0.5697247182307356
831,0.521415378102956
832,0.713494282791907
833,0.7368032138930533
834,0.7506715190343545
835,0.639809702081032
836,0.7794433293284861
837,0.6842357193375351
838,0.5708963170838717
839,0.7300458925716852
840,0.5931821528767101
841,0.6879219949867834
842,0.6845108255079939
843,0.5247022474822891
844,0.7082944775125056
845,0.5231272971827206
846,0.6739983649521577
847,0.51728515922948
848,0.7968003079815358
849,0.6435969184661597
850,0.6809147883375662
851,0.7751198995446837
852,0.6934675681095589
853,0.7856133538645013
854,0.786598721527809
855,0.7167877201291121
856,0.7039488333924147
857,0.6409790445571806
858,0.6906759317625089
859,0.7081563184680468
860,0.7681000804459508
861,0.5227813858739633
862,0.695501906392501
863,0.7983274102018376
864,0.6722513333631649
865,0.7356493578161329
866,0.7687553666865132
867,0.7354673496721047
868,0.5360472076603944
869,0.7698990118684977
870,0.688787050457953
871,0.7074273301929399
872,0.6171722443421341
873,0.6686003509900801
874,0.5666001563663997
875,0.5128004337428227
876,0.6412940357904893
877,0.5138663824108429
878,0.7388866276535662
879,0.5753235782119317
880,0.772344813114332
881,0.5879536660517702
882,0.6445081310383409
883,0.6200966145131572
884,0.7112116337919964
885,0.5953819180040077
886,0.5963856692894505
887,0.7166561735405572
888,0.6906196390718796
889,0.5738709409819727
890,0.563156256197688
891,0.6573856223655269
892,0.5728826987552751
893,0.7324039440611471
894,0.7209650891763075
895,0.7037515107888415
896,0.7891905336444707
897,0.6092010398015028
898,0.514279048108017
899,0.6847166962816265
900,0.7602927458721072
901,0.6113433605684572
902,0.7696918600941018
903,0.5221439098944387
904,0.7518162126962316
905,0.7496622979715004
906,0.5580210322631233
907,0.7812481455856248
908,0.7427024718553641
909,0.7485905043071381
910,0.7023779042100264
911,0.6703186093062992
912,0.5826575141787395
913,0.5160075193194197
914,0.5838924324347001
915,0.6706469415211384
916,0.7287799312576102
917,0.5151242695276361
918,0.6852935138812395
919,0.5606506388535113
920,0.7362828231084118
921,0.7516452943846936
922,0.6403331479161907
923,0.6683681516698229
924,0.5930653319043302
925,0.5145169719319836
926,0.5660893988112565
927,0.702827718202354
928,0.6882854509929751
929,0.7625389178682842
930,0.6031375537138284
931,0.5681974965907712
932,0.6409311578721368
933,0.6033951239222801
934,0.7069218570847076
935,0.7838370762137394
936,0.795359313824543
937,0.5323668463198039
938,0.6011181246432133
939,0.5086859695268734
940,0.7612523000006841
941,0.756126010929258
942,0.6996509999376597
943,0.6825882059102747
944,0.6932576561554762
945,0.5816732452475332
946,0.7215303721270011
947,0.662547363114604
948,0.730683863659187
949,0.7798064011466175
950,0.7054046953585735
951,0.6800192498960036
952,0.792631205016844
953,0.6918125088504254
954,0.7921885880163421
955,0.6922312944106632
956,0.6794082092071818
957,0.6731134747644224
958,0.6594140125162871
959,0.544957514666744
960,0.5873381359690972
961,0.5179143182085778
962,0.555448144857707
963,0.5189147780945765
964,0.5287956236393792
965,0.7442094371760477
966,0.5322058780356813
967,0.5046953353002354
968,0.6904338314933188
969,0.7575950223713974
970,0.5885123133552088
971,0.7700773288552725
972,0.6169289876402799
973,0.7408105613165132
974,0.7779772298288933
975,0.5651128550319815
976,0.7148748371357123
977,0.6904948207419497
978,0.6960982871892474
979,0.5167139108484253
980,0.7669337294323915
981,0.7593689644290159
982,0.6427330721658395
983,0.674271234989341
984,0.7507183339616741
985,0.6371705566807755
986,0.5836622924518836
987,0.5593926271523717
988,0.5503706955666177
989,0.6722702559922639
990,0.5405626134816202
991,0.7862183885762565
992,0.5397494279371418
993,0.5635713432918492
994,0.652276960876333
995,0.7664720401753529
996,0.6209773859071438
997,0.5629112256850545
998,0.5430558598890467
999,0.6597299562344839
1000,0.6235110785654685
