episode,average_reward
1501,-14.164351205047236
1502,-14.340802481965195
1503,-11.699880904777647
1504,-24.957110564219345
1505,-14.030008744174069
1506,-19.00507400758047
1507,-12.427332699839944
1508,-29.93119323520697
1509,-12.465000250248568
1510,-12.497434237223025
1511,-20.036037185442115
1512,-17.751322838285468
1513,-10.725055244072497
1514,-11.69969171189232
1515,-21.204378483973514
1516,-20.916079140660983
1517,-24.052577417976735
1518,-15.545339699226599
1519,-22.839171184511066
1520,-25.03948642648033
1521,-19.384780960340365
1522,-10.906867728759657
1523,-17.694241437216544
1524,-19.78900197133326
1525,-14.719124908410379
1526,-16.131444212531573
1527,-10.649535311207853
1528,-16.916620796335017
1529,-10.183835887492734
1530,-25.209644017768465
1531,-15.959429236548509
1532,-12.526916955430359
1533,-18.4829170185114
1534,-19.34715748604278
1535,-11.871018105134475
1536,-28.973901777501
1537,-15.893479741693554
1538,-25.74346935076167
1539,-14.712748296667598
1540,-11.613177710233035
1541,-12.046603886807212
1542,-17.98954512255673
1543,-16.282829916568012
1544,-14.514125559981913
1545,-23.404932461020604
1546,-10.391757230502726
1547,-29.81138464036161
1548,-14.374448850328365
1549,-15.900198740077911
1550,-18.577004551870488
1551,-19.249323360786242
1552,-13.488630740111365
1553,-15.891663839203265
1554,-18.87176253517174
1555,-13.016679898663813
1556,-25.210134704585577
1557,-18.216018212803533
1558,-26.68191263013164
1559,-12.360665694626409
1560,-23.053707769152613
1561,-24.445633490007214
1562,-26.951568446972914
1563,-24.152228585848423
1564,-16.000278987591948
1565,-14.386495475766994
1566,-19.709060164259952
1567,-14.144164313262607
1568,-22.9936680168501
1569,-25.573709317622715
1570,-12.625436176111325
1571,-19.548190353522124
1572,-21.216753560485333
1573,-26.535987953937894
1574,-27.454058773337728
1575,-24.1595457239509
1576,-20.56866234807922
1577,-15.874273696817404
1578,-26.346528937130444
1579,-28.351983548569905
1580,-23.051719288157503
1581,-24.251573873684116
1582,-14.39289717844006
1583,-21.602262685274994
1584,-25.411113366754336
1585,-10.093391590865124
1586,-27.56761263440009
1587,-15.195274495890754
1588,-14.991880970107538
1589,-20.13340315000152
1590,-23.334201450118275
1591,-17.397240975393174
1592,-22.36709082593742
1593,-14.361773652064517
1594,-17.67718902555128
1595,-26.04159606732828
1596,-16.647494277038646
1597,-27.863404979387106
1598,-11.209854678757523
1599,-29.745280380906735
1600,-14.951587703912647
1601,-16.867901895199225
1602,-11.679777836192418
1603,-15.83120064114919
1604,-21.73975502745256
1605,-18.783791241322383
1606,-14.192776980261977
1607,-29.613390771717153
1608,-26.641575731681332
1609,-10.58895041382096
1610,-20.371794848725994
1611,-27.196541040853763
1612,-18.44998979512883
1613,-23.138066034222838
1614,-25.623843115610946
1615,-23.99631384328062
1616,-10.175549193913273
1617,-22.623008905737425
1618,-22.354614696944548
1619,-28.824919155951743
1620,-15.329229347861217
1621,-29.46061237397014
1622,-17.174555166723238
1623,-18.899165380754006
1624,-14.888424423668372
1625,-24.996412118075106
1626,-22.554564337434226
1627,-27.726218601212175
1628,-24.915943500232515
1629,-17.82099932308976
1630,-29.642073627344242
1631,-19.67227897586804
1632,-29.866298225786558
1633,-26.860330793128313
1634,-18.80210594605856
1635,-15.553380273976407
1636,-25.23653701653025
1637,-24.7672459736106
1638,-23.60083924039248
1639,-25.660747277044244
1640,-15.695444847366854
1641,-24.782643506741184
1642,-29.756140621972623
1643,-16.59935442949603
1644,-13.790795754790377
1645,-24.87847696008074
1646,-23.264963298587624
1647,-14.435391497788135
1648,-28.43435909928283
1649,-14.974845607152416
1650,-20.9283318059751
1651,-16.05608908883474
1652,-25.82775724411651
1653,-25.50459991120663
1654,-20.25470602932108
1655,-21.989771728799674
1656,-26.09368316226984
1657,-27.415389012494312
1658,-22.81440825770712
1659,-28.08133003979715
1660,-17.178032293066558
1661,-21.81874257845707
1662,-16.19277378589346
1663,-27.806671962577386
1664,-14.627705556627209
1665,-16.82638273396829
1666,-11.33800862602866
1667,-14.153731651626115
1668,-12.86751574680785
1669,-19.80440277585056
1670,-27.508281752292984
1671,-24.00836812166071
1672,-20.59784498845112
1673,-17.977588636843052
1674,-17.780304912553405
1675,-21.315482330014024
1676,-27.250850886823347
1677,-29.80777040473701
1678,-17.218426320651737
1679,-20.864091925826138
1680,-16.965594586217044
1681,-16.22879644411544
1682,-17.7718900275027
1683,-13.77710906021628
1684,-22.88009749411195
1685,-18.75606085212847
1686,-22.136380458588793
1687,-18.99590139538228
1688,-20.80545523491164
1689,-27.840516563746803
1690,-20.107342136953587
1691,-16.194837195721778
1692,-12.843703250205479
1693,-16.874831045436252
1694,-10.944839461373082
1695,-26.68992349276084
1696,-25.577340833524605
1697,-16.435155383121057
1698,-25.951234407301726
1699,-14.629139198468346
1700,-12.76222045220516
1701,-18.0441058374878
1702,-13.514910094684858
1703,-25.893062260288573
1704,-26.69335440306241
1705,-20.163278144258676
1706,-14.33749154755205
1707,-11.849572912323364
1708,-23.31566855145789
1709,-23.270175510675905
1710,-10.598218639969666
1711,-23.913914904189433
1712,-25.321410575460305
1713,-24.894087592537854
1714,-21.60890643635055
1715,-22.54873224827226
1716,-22.897210864026285
1717,-16.961818868551674
1718,-11.656855980030763
1719,-29.67390082566475
1720,-24.375304974209786
1721,-28.6588069069641
1722,-16.437744463609825
1723,-26.959411623714672
1724,-27.620583459888103
1725,-19.334892275065087
1726,-27.675897527330555
1727,-16.2803485632287
1728,-18.132374618496335
1729,-21.35909567159306
1730,-22.2992659344947
1731,-10.687816601877913
1732,-16.42600152422675
1733,-12.400150437730382
1734,-19.519339403899075
1735,-17.96131139529532
1736,-28.669598196943415
1737,-18.82180671090963
1738,-22.12842000198676
1739,-15.409799846351822
1740,-21.17480084685159
1741,-29.113582730526574
1742,-18.53592520730052
1743,-11.186849593852422
1744,-15.425870768382008
1745,-26.454339016861052
1746,-12.939043120316946
1747,-22.558993804812552
1748,-12.13834378821928
1749,-10.160123411601333
1750,-14.122449500414813
1751,-14.73944586730324
1752,-21.802380197174063
1753,-27.82120331240078
1754,-12.092454406103993
1755,-24.330127367105657
1756,-10.654085953296274
1757,-15.869521487602524
1758,-20.027924786061856
1759,-10.984921051315773
1760,-13.120425899721429
1761,-10.020146742945723
1762,-18.10033216352835
1763,-15.48777895224298
1764,-20.63745389807377
1765,-16.10075230409937
1766,-26.383953037178788
1767,-19.23062243005681
1768,-16.307585021817992
1769,-19.847859005678597
1770,-29.367843921135133
1771,-19.32850975044562
1772,-24.5850897239389
1773,-27.885294284536283
1774,-27.023715688682213
1775,-16.249931748858124
1776,-12.38152587029472
1777,-10.398802028029316
1778,-25.70648798501358
1779,-27.9742847971188
1780,-10.044061258994283
1781,-28.90414498234128
1782,-10.1050422526199
1783,-20.12638148576243
1784,-13.182752591346045
1785,-25.720142497960335
1786,-12.906934623408098
1787,-28.49772445307574
1788,-12.947786069144612
1789,-29.097304322954674
1790,-18.08091297311293
1791,-25.51617770244023
1792,-22.85477570923716
1793,-17.531677621378513
1794,-21.285394261567905
1795,-21.56590880206108
1796,-16.736983173526745
1797,-10.16641111262831
1798,-10.125915788873659
1799,-17.762722071042475
1800,-15.59329794314607
1801,-10.267511170975723
1802,-19.78161095872032
1803,-19.3236053094552
1804,-20.41568495838904
1805,-19.752043364179645
1806,-17.679632159925525
1807,-22.71985302138617
1808,-13.928335167061796
1809,-14.972028351303582
1810,-22.315277111666852
1811,-14.261026330572147
1812,-16.725373782468587
1813,-23.31867657355104
1814,-15.921407111602113
1815,-16.235157884979706
1816,-19.87754825703803
1817,-12.95434605033195
1818,-19.64333126007766
1819,-14.599158553141871
1820,-25.111676595730238
1821,-28.27847399074244
1822,-11.559612532963236
1823,-29.16259941281404
1824,-26.208102559526353
1825,-26.497835906876517
1826,-24.53619180665706
1827,-15.339669184601817
1828,-12.263820146190398
1829,-28.262873553834336
1830,-14.069835620152286
1831,-15.48313821453833
1832,-26.757407317914684
1833,-14.718274194994443
1834,-13.610245367155244
1835,-27.949942485817974
1836,-18.422280423831378
1837,-29.373753650431155
1838,-17.258065966966786
1839,-22.550363180217797
1840,-10.169416160259594
1841,-27.391597992858678
1842,-25.89328897698195
1843,-15.422034799975396
1844,-26.874562332127134
1845,-29.964054557818752
1846,-21.745946792772283
1847,-26.10659609955738
1848,-22.693845335615865
1849,-14.59398490678052
1850,-26.66186743605263
1851,-13.20178415759844
1852,-14.215593939266737
1853,-28.69383851536904
1854,-16.870192886172404
1855,-24.831775301659768
1856,-21.003038385452456
1857,-26.256402265068385
1858,-16.489742372658792
1859,-12.16416108273636
1860,-20.083462650220824
1861,-25.285545218667128
1862,-24.993971816720187
1863,-26.329145388769295
1864,-15.963072669381425
1865,-26.76667779225664
1866,-12.92000907359747
1867,-10.11348122898979
1868,-11.57011677061585
1869,-18.372088670367827
1870,-15.5078807574536
1871,-29.829546950225602
1872,-19.50370991501679
1873,-17.678575101569045
1874,-24.692693059184883
1875,-27.93886923802005
1876,-29.685069553304963
1877,-16.739846812339422
1878,-14.564883321741686
1879,-19.365179956029476
1880,-14.117483479090765
1881,-27.873643284254644
1882,-11.88953921401821
1883,-28.627431073217135
1884,-10.35280242477225
1885,-19.66343658342128
1886,-16.886856633035997
1887,-26.460740896476608
1888,-22.64719640852751
1889,-24.97506028521226
1890,-28.46740009163866
1891,-23.782164646922745
1892,-23.034897487995128
1893,-14.788926312256622
1894,-23.537609824359613
1895,-11.619515265379409
1896,-24.814331434015923
1897,-29.95911051144803
1898,-28.040680467011224
1899,-18.419265426714908
1900,-18.037914827821595
1901,-14.624362186753942
1902,-28.035478915879256
1903,-10.650721836146623
1904,-19.241877887899246
1905,-21.874503077420087
1906,-29.732211238353617
1907,-25.506257843260702
1908,-28.707164548511575
1909,-24.58718697343618
1910,-16.791157246487213
1911,-14.027232229103353
1912,-12.910120880454414
1913,-22.506031982734356
1914,-12.356746784409644
1915,-16.452637834173984
1916,-15.680156112965022
1917,-25.44056446945183
1918,-17.978735929387238
1919,-16.9177729042237
1920,-20.56463332615816
1921,-14.404420978469686
1922,-28.63027408097838
1923,-16.13777137367787
1924,-25.690454146413266
1925,-11.494656253435771
1926,-16.85085292633327
1927,-23.459325019481447
1928,-27.81667550080422
1929,-10.383050508728658
1930,-28.416682216251388
1931,-28.48776018025117
1932,-24.684417639658108
1933,-12.631227563266211
1934,-21.15837089753433
1935,-22.500081932450005
1936,-12.442061671503147
1937,-21.62901475583493
1938,-24.920346438519186
1939,-17.118774058726927
1940,-28.464907826626252
1941,-17.043016604768383
1942,-23.443650776254664
1943,-12.289599907141376
1944,-27.210162582286316
1945,-17.23502429999885
1946,-24.223387328682954
1947,-18.858282854591298
1948,-11.208301901022292
1949,-10.571502287709972
1950,-12.367636245859575
1951,-29.689812091055366
1952,-26.710169234746672
1953,-21.1959330212321
1954,-12.032612954637084
1955,-23.534492089358128
1956,-24.427081200135724
1957,-29.99356595131591
1958,-10.853567919548691
1959,-24.819297781619596
1960,-12.450766371984201
1961,-12.673405990700523
1962,-27.537285198532473
1963,-28.17524493900685
1964,-20.344797431557513
1965,-20.080889958581196
1966,-25.528359671344035
1967,-26.9120414663216
1968,-29.040734270366244
1969,-29.96851131024337
1970,-10.225284432381503
1971,-22.688430523284513
1972,-26.337821040327395
1973,-11.456882179244335
1974,-12.782836883764926
1975,-12.024677863073578
1976,-23.666330906902633
1977,-16.200622996782258
1978,-21.90315180681376
1979,-16.63394982883773
1980,-14.242049366501819
1981,-15.086471514282543
1982,-26.446509151219605
1983,-18.444165610280464
1984,-26.933345113078346
1985,-13.939357392824288
1986,-24.96184742333612
1987,-16.925179178789236
1988,-28.635145238955516
1989,-24.194090674846354
1990,-28.52503389455403
1991,-24.913120597229106
1992,-24.311819492348995
1993,-26.714697730167632
1994,-11.322635921047034
1995,-26.453514271757086
1996,-26.199938471699074
1997,-14.853204091852321
1998,-10.069067018904818
1999,-28.8251260137589
2000,-13.431668290290258
