episode,local_experience,global_experience
1,0.561618,0.612103
2,0.533101,0.679947
3,0.527177,0.6123
4,0.579184,0.636254
5,0.58616,0.683249
6,0.566488,0.62582
7,0.571052,0.696353
8,0.599985,0.631524
9,0.52964,0.616491
10,0.599466,0.674806
11,0.5386,0.690261
12,0.524539,0.658032
13,0.507683,0.69679
14,0.529431,0.678373
15,0.580945,0.686843
16,0.534292,0.658399
17,0.599619,0.638401
18,0.511321,0.655373
19,0.563054,0.639634
20,0.563288,0.611969
21,0.532706,0.668646
22,0.588415,0.651665
23,0.508603,0.642619
24,0.557626,0.652393
25,0.593661,0.629469
26,0.562592,0.655499
27,0.585092,0.662512
28,0.542506,0.6713
29,0.579399,0.629877
30,0.550944,0.661248
31,0.539124,0.685793
32,0.505096,0.648082
33,0.516221,0.680756
34,0.511436,0.685689
35,0.518114,0.636728
36,0.591381,0.6576
37,0.565894,0.675587
38,0.548626,0.627295
39,0.58665,0.636453
40,0.553222,0.622682
41,0.584994,0.685788
42,0.551882,0.697205
43,0.521971,0.666002
44,0.562546,0.69306
45,0.529229,0.629826
46,0.585168,0.61857
47,0.504057,0.673328
48,0.551303,0.630363
49,0.543387,0.679908
50,0.582277,0.61639
51,0.572395,0.615019
52,0.541036,0.672953
53,0.598845,0.671689
54,0.516,0.628754
55,0.51989,0.662566
56,0.579733,0.648114
57,0.524026,0.685288
58,0.557402,0.661671
59,0.597368,0.623467
60,0.502192,0.693264
61,0.516755,0.694005
62,0.567991,0.669424
63,0.586228,0.616519
64,0.556175,0.643663
65,0.524579,0.658402
66,0.545958,0.637089
67,0.521381,0.651275
68,0.529124,0.678006
69,0.527266,0.615752
70,0.553217,0.692353
71,0.506935,0.700927
72,0.505835,0.679533
73,0.586917,0.619671
74,0.567758,0.610148
75,0.587562,0.641971
76,0.591593,0.620382
77,0.554236,0.615381
78,0.538036,0.651503
79,0.509778,0.669677
80,0.575813,0.63969
81,0.600818,0.660524
82,0.533385,0.693188
83,0.595791,0.63143
84,0.568398,0.635283
85,0.565057,0.654607
86,0.564937,0.662719
87,0.518335,0.633398
88,0.591751,0.672923
89,0.516475,0.648622
90,0.525327,0.682757
91,0.505589,0.655735
92,0.529595,0.687464
93,0.526032,0.69602
94,0.581777,0.67934
95,0.591278,0.696307
96,0.595731,0.6227
97,0.60072,0.699506
98,0.514306,0.628341
99,0.56867,0.611581
100,0.522624,0.654298
101,0.529241,0.65299
102,0.540176,0.61897
103,0.521632,0.644127
104,0.506895,0.659912
105,0.506126,0.625789
106,0.533683,0.647574
107,0.543788,0.634805
108,0.514158,0.684005
109,0.596478,0.683313
110,0.596962,0.663863
111,0.528513,0.617965
112,0.57898,0.652207
113,0.548137,0.666115
114,0.520211,0.665625
115,0.596433,0.684314
116,0.519866,0.636397
117,0.510925,0.611085
118,0.558986,0.636349
119,0.534165,0.641588
120,0.578018,0.687479
121,0.594491,0.642996
122,0.557191,0.694565
123,0.553719,0.629612
124,0.514286,0.648679
125,0.5303,0.681036
126,0.553837,0.680936
127,0.562654,0.687484
128,0.528932,0.636279
129,0.524029,0.687687
130,0.572437,0.679531
131,0.575292,0.64484
132,0.511355,0.625325
133,0.533932,0.631001
134,0.50921,0.640062
135,0.55435,0.647366
136,0.523424,0.667261
137,0.532247,0.69694
138,0.556306,0.644864
139,0.551514,0.663635
140,0.550078,0.614512
141,0.586381,0.627437
142,0.51437,0.679628
143,0.564009,0.68255
144,0.544631,0.659381
145,0.559304,0.637806
146,0.56914,0.682154
147,0.571022,0.658496
148,0.587472,0.631148
149,0.562908,0.651936
150,0.589745,0.678584
151,0.600806,0.675225
152,0.524585,0.65308
153,0.560386,0.61882
154,0.573727,0.689736
155,0.589676,0.610985
156,0.586732,0.639484
157,0.543615,0.629664
158,0.601177,0.621254
159,0.56591,0.696592
160,0.581999,0.698012
161,0.521383,0.654647
162,0.51047,0.698124
163,0.592076,0.618051
164,0.508393,0.666727
165,0.590303,0.660371
166,0.597006,0.690842
167,0.55324,0.664043
168,0.52161,0.657861
169,0.568602,0.61141
170,0.504972,0.629441
171,0.578308,0.681977
172,0.538908,0.618835
173,0.571107,0.655746
174,0.521698,0.622776
175,0.582069,0.61896
176,0.515817,0.699977
177,0.590167,0.647666
178,0.590733,0.673451
179,0.514771,0.630429
180,0.505389,0.640418
181,0.578892,0.654458
182,0.53565,0.673624
183,0.585257,0.622261
184,0.539568,0.654597
185,0.555574,0.686501
186,0.590598,0.633056
187,0.57432,0.647094
188,0.525389,0.690756
189,0.522975,0.619173
190,0.566792,0.637621
191,0.585645,0.613549
192,0.548951,0.624989
193,0.539969,0.670943
194,0.509768,0.652889
195,0.576636,0.625235
196,0.577179,0.640624
197,0.550905,0.636227
198,0.548618,0.700596
199,0.576644,0.680029
200,0.554253,0.651941
201,0.583172,0.65654
202,0.520056,0.654947
203,0.513007,0.680885
204,0.578049,0.694736
205,0.588891,0.644283
206,0.558424,0.628036
207,0.585152,0.658227
208,0.569041,0.683722
209,0.562569,0.620538
210,0.552622,0.680411
211,0.593629,0.627054
212,0.523514,0.649034
213,0.532247,0.690568
214,0.516472,0.663822
215,0.506524,0.675696
216,0.504618,0.614335
217,0.505033,0.612213
218,0.540596,0.654429
219,0.558229,0.691167
220,0.568903,0.660309
221,0.548498,0.697472
222,0.534541,0.697242
223,0.54445,0.672143
224,0.596149,0.629222
225,0.505189,0.631811
226,0.558818,0.62796
227,0.502021,0.662604
228,0.525838,0.618013
229,0.576361,0.695794
230,0.526898,0.634348
231,0.519664,0.633813
232,0.545346,0.628993
233,0.523643,0.635955
234,0.523776,0.684021
235,0.527043,0.686395
236,0.545082,0.701101
237,0.570793,0.64727
238,0.566105,0.657224
239,0.583633,0.655134
240,0.52542,0.669324
241,0.519083,0.691096
242,0.592662,0.622824
243,0.52101,0.700857
244,0.513686,0.660089
245,0.534422,0.645378
246,0.597891,0.676051
247,0.58773,0.630868
248,0.55467,0.626036
249,0.580418,0.623065
250,0.508774,0.613447
251,0.562455,0.642438
252,0.569854,0.626906
253,0.561605,0.61322
254,0.547328,0.656099
255,0.596,0.679486
256,0.589554,0.661894
257,0.569049,0.701166
258,0.597137,0.666757
259,0.527354,0.668753
260,0.576663,0.652673
261,0.575308,0.700983
262,0.520412,0.639626
263,0.551006,0.613913
264,0.578247,0.692837
265,0.584543,0.668397
266,0.50669,0.618853
267,0.558919,0.612116
268,0.50661,0.688182
269,0.505534,0.69443
270,0.591087,0.618987
271,0.56669,0.635639
272,0.531467,0.625357
273,0.546947,0.673791
274,0.515502,0.639511
275,0.56684,0.647175
276,0.557545,0.695419
277,0.572051,0.65686
278,0.599972,0.689549
279,0.525589,0.666279
280,0.55889,0.653323
281,0.540378,0.614516
282,0.552047,0.637632
283,0.504912,0.613215
284,0.560427,0.657779
285,0.524322,0.633069
286,0.593459,0.651099
287,0.582389,0.674639
288,0.525607,0.653782
289,0.526673,0.653375
290,0.514261,0.686799
291,0.571161,0.670515
292,0.593858,0.664889
293,0.562191,0.669066
294,0.598585,0.672531
295,0.596218,0.642089
296,0.600303,0.667997
297,0.557117,0.630568
298,0.536926,0.666625
299,0.520826,0.612214
300,0.525325,0.663748
301,0.512281,0.633512
302,0.547973,0.679514
303,0.541112,0.659698
304,0.51008,0.665361
305,0.568171,0.661098
306,0.589251,0.700838
307,0.59378,0.632532
308,0.560095,0.624395
309,0.575466,0.638183
310,0.548292,0.686642
311,0.543615,0.640727
312,0.570014,0.613379
313,0.557026,0.661502
314,0.505567,0.69996
315,0.535899,0.624904
316,0.534993,0.667474
317,0.509448,0.652756
318,0.505903,0.692362
319,0.523835,0.617018
320,0.596391,0.648765
321,0.503549,0.620594
322,0.524997,0.69386
323,0.554743,0.622949
324,0.520819,0.664907
325,0.526584,0.678842
326,0.516476,0.625573
327,0.597894,0.615924
328,0.532504,0.670188
329,0.57871,0.634586
330,0.586203,0.66472
331,0.559393,0.665209
332,0.599066,0.69135
333,0.596228,0.632939
334,0.548186,0.673629
335,0.596779,0.613253
336,0.569668,0.67411
337,0.585059,0.653319
338,0.538797,0.690033
339,0.54976,0.619764
340,0.552362,0.659865
341,0.56727,0.637016
342,0.536263,0.675594
343,0.578618,0.685628
344,0.588859,0.673761
345,0.571215,0.66887
346,0.509563,0.693241
347,0.509941,0.636051
348,0.506194,0.642325
349,0.594854,0.682366
350,0.548664,0.654142
351,0.513453,0.639696
352,0.549693,0.662829
353,0.501031,0.657225
354,0.540657,0.698714
355,0.564997,0.613532
356,0.574373,0.646101
357,0.546586,0.617993
358,0.572092,0.617345
359,0.584257,0.615798
360,0.546482,0.642101
361,0.502289,0.645508
362,0.514929,0.616512
363,0.595221,0.681769
364,0.528129,0.65153
365,0.557874,0.610357
366,0.551724,0.660587
367,0.556768,0.676686
368,0.59561,0.627991
369,0.507453,0.619537
370,0.508096,0.632049
371,0.545069,0.692686
372,0.599962,0.63165
373,0.535916,0.65777
374,0.517162,0.687739
375,0.552816,0.686868
376,0.528305,0.667437
377,0.529107,0.641424
378,0.512504,0.665358
379,0.561236,0.66639
380,0.583383,0.672002
381,0.552372,0.637257
382,0.553279,0.639426
383,0.5841,0.654697
384,0.519135,0.63893
385,0.586544,0.640277
386,0.591302,0.641144
387,0.525568,0.610257
388,0.510169,0.610329
389,0.591171,0.698819
390,0.597738,0.657157
391,0.555397,0.651047
392,0.568024,0.649276
393,0.533966,0.664196
394,0.584603,0.690938
395,0.571554,0.628695
396,0.571885,0.620957
397,0.514023,0.685374
398,0.598474,0.611959
399,0.549512,0.685166
400,0.567712,0.645077
401,0.566456,0.700028
402,0.589492,0.688304
403,0.502461,0.663735
404,0.601324,0.686878
405,0.524154,0.691555
406,0.594046,0.656432
407,0.590725,0.643324
408,0.543076,0.658658
409,0.574799,0.677677
410,0.51041,0.677269
411,0.511242,0.629079
412,0.561156,0.646271
413,0.596599,0.66296
414,0.506121,0.629186
415,0.556759,0.623
416,0.534173,0.69303
417,0.553439,0.6311
418,0.518481,0.654025
419,0.600046,0.663491
420,0.591219,0.631289
421,0.511793,0.698454
422,0.563574,0.679424
423,0.506627,0.657048
424,0.554853,0.691613
425,0.543104,0.642252
426,0.562053,0.694433
427,0.584295,0.622747
428,0.548508,0.680288
429,0.507544,0.683246
430,0.501296,0.672351
431,0.59712,0.660469
432,0.512793,0.654675
433,0.567295,0.644993
434,0.589688,0.672598
435,0.517823,0.640959
436,0.570003,0.639112
437,0.56938,0.612994
438,0.59286,0.649487
439,0.538289,0.633428
440,0.589055,0.626464
441,0.516034,0.68872
442,0.579105,0.661552
443,0.58207,0.642794
444,0.583261,0.635162
445,0.572844,0.619579
446,0.535769,0.670147
447,0.571897,0.652127
448,0.548804,0.627275
449,0.517726,0.672374
450,0.519885,0.653682
451,0.596712,0.687743
452,0.552352,0.700385
453,0.510449,0.695991
454,0.566951,0.631742
455,0.556186,0.646639
456,0.567975,0.616221
457,0.504799,0.667894
458,0.589189,0.676625
459,0.58168,0.6894
460,0.518686,0.633519
461,0.526417,0.621963
462,0.503571,0.675716
463,0.58098,0.647931
464,0.532216,0.659392
465,0.56298,0.673456
466,0.520907,0.624947
467,0.562238,0.657715
468,0.583136,0.628195
469,0.550709,0.685332
470,0.601019,0.656978
471,0.559114,0.696317
472,0.564046,0.620542
473,0.523951,0.62852
474,0.560578,0.645316
475,0.527162,0.668131
476,0.557229,0.643068
477,0.598864,0.637385
478,0.52214,0.670208
479,0.502674,0.645292
480,0.581033,0.686791
481,0.558756,0.626989
482,0.537137,0.681679
483,0.506654,0.683361
484,0.532012,0.653968
485,0.571214,0.692178
486,0.569298,0.666659
487,0.563602,0.632831
488,0.594183,0.642821
489,0.52404,0.663085
490,0.589466,0.630963
491,0.518997,0.678595
492,0.524927,0.612441
493,0.515175,0.619812
494,0.532082,0.638886
495,0.534465,0.677314
496,0.541004,0.64052
497,0.563333,0.656976
498,0.55058,0.63676
499,0.512909,0.670248
500,0.600488,0.647555
501,0.594802,0.643651
502,0.50899,0.700987
503,0.53027,0.669602
504,0.531554,0.663032
505,0.550653,0.677119
506,0.540971,0.679842
507,0.524546,0.641896
508,0.600637,0.664184
509,0.561524,0.657931
510,0.535353,0.682685
511,0.542379,0.619581
512,0.554651,0.665946
513,0.536907,0.675243
514,0.506391,0.692798
515,0.526682,0.622259
516,0.524904,0.669357
517,0.584531,0.678119
518,0.581217,0.645654
519,0.54911,0.642153
520,0.55462,0.685654
521,0.501338,0.698072
522,0.515305,0.625472
523,0.58949,0.633632
524,0.598492,0.655752
525,0.551232,0.669062
526,0.593539,0.635671
527,0.595958,0.672699
528,0.551058,0.698335
529,0.581274,0.653496
530,0.557806,0.673016
531,0.559131,0.613328
532,0.582212,0.633608
533,0.556379,0.648772
534,0.523602,0.700619
535,0.575775,0.620133
536,0.541027,0.69607
537,0.52774,0.633138
538,0.534023,0.650295
539,0.526602,0.677928
540,0.530899,0.695667
541,0.524131,0.657699
542,0.502746,0.683773
543,0.501279,0.701326
544,0.579008,0.670301
545,0.559004,0.676888
546,0.524985,0.64952
547,0.600076,0.685545
548,0.544667,0.66919
549,0.555966,0.641118
550,0.544005,0.691375
551,0.587058,0.670737
552,0.587672,0.650246
553,0.52324,0.66499
554,0.58845,0.669414
555,0.589988,0.620617
556,0.529937,0.696153
557,0.572814,0.615001
558,0.559593,0.652056
559,0.549673,0.630785
560,0.596506,0.63767
561,0.578648,0.697785
562,0.575833,0.64211
563,0.592378,0.667602
564,0.581928,0.615201
565,0.59435,0.675927
566,0.531454,0.631485
567,0.564074,0.651796
568,0.546135,0.619836
569,0.554767,0.65312
570,0.526365,0.623265
571,0.50362,0.629817
572,0.576702,0.610709
573,0.509841,0.679584
574,0.542799,0.671336
575,0.579154,0.629302
576,0.506293,0.627089
577,0.522236,0.63704
578,0.516217,0.652083
579,0.52678,0.666397
580,0.507537,0.66554
581,0.515031,0.641888
582,0.501715,0.614482
583,0.600309,0.696462
584,0.523124,0.61935
585,0.513722,0.638868
586,0.503266,0.656623
587,0.587246,0.681788
588,0.588772,0.650483
589,0.544914,0.694351
590,0.576611,0.696786
591,0.600452,0.664578
592,0.537226,0.637534
593,0.588681,0.631443
594,0.558938,0.671904
595,0.504662,0.653877
596,0.589669,0.653149
597,0.514313,0.665806
598,0.502831,0.675249
599,0.504527,0.656272
600,0.565997,0.614263
601,0.535903,0.646906
602,0.57475,0.70014
603,0.509362,0.652059
604,0.516728,0.656291
605,0.581797,0.65487
606,0.574378,0.654356
607,0.508191,0.701046
608,0.534417,0.684018
609,0.579636,0.623546
610,0.593535,0.627558
611,0.560885,0.635899
612,0.506297,0.658511
613,0.57705,0.686365
614,0.531572,0.622847
615,0.518161,0.672788
616,0.564579,0.695498
617,0.57827,0.696544
618,0.571185,0.61899
619,0.533669,0.664888
620,0.585278,0.632907
621,0.523442,0.658765
622,0.5916,0.658162
623,0.530078,0.690574
624,0.552488,0.612162
625,0.508552,0.611984
626,0.598051,0.69339
627,0.509701,0.629953
628,0.564355,0.690071
629,0.590247,0.642001
630,0.528962,0.623521
631,0.554409,0.667676
632,0.587384,0.634133
633,0.548687,0.655082
634,0.584894,0.67298
635,0.56856,0.676313
636,0.578018,0.697516
637,0.56878,0.636653
638,0.597991,0.678361
639,0.521051,0.687896
640,0.5665,0.672256
641,0.541378,0.631702
642,0.58975,0.65316
643,0.583634,0.699433
644,0.534676,0.662182
645,0.600317,0.692515
646,0.556696,0.630533
647,0.585378,0.655496
648,0.543275,0.678451
649,0.585052,0.657012
650,0.544548,0.667202
651,0.538814,0.687222
652,0.58722,0.699616
653,0.55551,0.660001
654,0.579978,0.626175
655,0.565511,0.693391
656,0.583737,0.689287
657,0.506078,0.63117
658,0.506955,0.656123
659,0.553871,0.700234
660,0.522442,0.67402
661,0.580219,0.671493
662,0.568701,0.674325
663,0.541711,0.62324
664,0.586447,0.677246
665,0.539369,0.641565
666,0.516991,0.626429
667,0.547908,0.667917
668,0.577721,0.682846
669,0.504117,0.681431
670,0.519608,0.641151
671,0.521297,0.645669
672,0.568174,0.643669
673,0.585495,0.618303
674,0.567645,0.616404
675,0.514969,0.62541
676,0.525597,0.676081
677,0.51277,0.616179
678,0.527555,0.610777
679,0.597452,0.624393
680,0.595223,0.662404
681,0.598842,0.679803
682,0.527015,0.651859
683,0.539525,0.641228
684,0.523608,0.669437
685,0.599462,0.693875
686,0.552597,0.667795
687,0.545378,0.656436
688,0.512013,0.613118
689,0.59894,0.634901
690,0.529031,0.652074
691,0.563517,0.65192
692,0.501198,0.661826
693,0.502025,0.636181
694,0.529747,0.700483
695,0.512092,0.629648
696,0.5703,0.698387
697,0.513367,0.651235
698,0.543649,0.622774
699,0.529343,0.670038
700,0.56566,0.627307
701,0.570307,0.684835
702,0.546577,0.659406
703,0.576571,0.682373
704,0.601223,0.612449
705,0.517411,0.615656
706,0.571132,0.614983
707,0.535432,0.697682
708,0.5577,0.643859
709,0.572824,0.622069
710,0.529392,0.610692
711,0.543524,0.631525
712,0.549066,0.679565
713,0.52381,0.658387
714,0.57855,0.650007
715,0.57043,0.68482
716,0.545886,0.689222
717,0.554842,0.68041
718,0.594074,0.627477
719,0.521254,0.64698
720,0.522113,0.649315
721,0.570728,0.660764
722,0.51136,0.625966
723,0.501959,0.615464
724,0.516138,0.692654
725,0.591832,0.654447
726,0.568037,0.680284
727,0.552411,0.688184
728,0.560947,0.686461
729,0.504079,0.613321
730,0.559547,0.688529
731,0.536439,0.613112
732,0.589936,0.645262
733,0.597104,0.698259
734,0.511321,0.632096
735,0.533092,0.688797
736,0.592625,0.616164
737,0.534754,0.637738
738,0.53345,0.632969
739,0.532557,0.632261
740,0.516267,0.635946
741,0.572274,0.612044
742,0.53234,0.679913
743,0.587669,0.661849
744,0.548399,0.635961
745,0.515629,0.687376
746,0.535217,0.649155
747,0.596925,0.616729
748,0.519971,0.663886
749,0.564119,0.61592
750,0.558692,0.66547
751,0.529047,0.690948
752,0.52218,0.663683
753,0.569987,0.650477
754,0.543873,0.650131
755,0.536588,0.631656
756,0.5052,0.657059
757,0.579951,0.628052
758,0.504433,0.69254
759,0.562555,0.662135
760,0.570351,0.627635
761,0.554478,0.626897
762,0.534514,0.619907
763,0.512668,0.664114
764,0.504594,0.635725
765,0.510749,0.67955
766,0.554992,0.650946
767,0.585833,0.622974
768,0.58187,0.641039
769,0.599695,0.693903
770,0.596033,0.654035
771,0.521655,0.672631
772,0.531075,0.648526
773,0.512439,0.691328
774,0.526414,0.652172
775,0.596562,0.661676
776,0.593568,0.63838
777,0.525306,0.675221
778,0.551933,0.699633
779,0.59412,0.700997
780,0.513045,0.626696
781,0.531942,0.680161
782,0.514875,0.626514
783,0.542745,0.68237
784,0.555738,0.650408
785,0.535117,0.626412
786,0.566738,0.622151
787,0.582709,0.669152
788,0.506558,0.625171
789,0.501272,0.689685
790,0.56481,0.698211
791,0.58429,0.694548
792,0.596877,0.668207
793,0.544014,0.610882
794,0.573945,0.63679
795,0.528226,0.651296
796,0.559943,0.64244
797,0.567067,0.655963
798,0.520154,0.617031
799,0.58407,0.619093
800,0.515238,0.687789
801,0.545466,0.622799
802,0.592308,0.682224
803,0.589818,0.679315
804,0.544349,0.682731
805,0.598165,0.641004
806,0.543633,0.660569
807,0.535181,0.666363
808,0.537969,0.646866
809,0.546839,0.646433
810,0.565833,0.688291
811,0.590162,0.687001
812,0.558226,0.628158
813,0.600739,0.644317
814,0.548639,0.680001
815,0.534927,0.641674
816,0.553445,0.690346
817,0.522137,0.628258
818,0.525464,0.615962
819,0.519965,0.640235
820,0.536827,0.695791
821,0.510189,0.65585
822,0.583136,0.670878
823,0.536032,0.659795
824,0.558405,0.700074
825,0.531566,0.63176
826,0.528204,0.648127
827,0.540736,0.674185
828,0.501349,0.689618
829,0.513053,0.647009
830,0.536179,0.672859
831,0.543754,0.647936
832,0.555871,0.620967
833,0.593307,0.617606
834,0.526884,0.623733
835,0.556773,0.639417
836,0.567027,0.62365
837,0.595504,0.638099
838,0.541046,0.688584
839,0.572732,0.650555
840,0.519897,0.630891
841,0.500916,0.695948
842,0.577096,0.652362
843,0.534195,0.654718
844,0.53626,0.654469
845,0.521769,0.642921
846,0.528841,0.668659
847,0.522857,0.621433
848,0.58155,0.611962
849,0.551455,0.664704
850,0.548784,0.657778
851,0.52017,0.615808
852,0.578307,0.640846
853,0.566514,0.696479
854,0.520742,0.62992
855,0.524015,0.625318
856,0.580321,0.63534
857,0.546855,0.676392
858,0.548503,0.650563
859,0.554875,0.621414
860,0.534864,0.666445
861,0.515348,0.669561
862,0.584374,0.643091
863,0.56518,0.630401
864,0.534635,0.646986
865,0.546658,0.659233
866,0.56937,0.670153
867,0.521754,0.653365
868,0.549948,0.624296
869,0.524912,0.620365
870,0.578973,0.670957
871,0.544538,0.669255
872,0.536841,0.675379
873,0.505915,0.641483
874,0.548444,0.613157
875,0.508016,0.696763
876,0.50521,0.655132
877,0.517178,0.650602
878,0.542304,0.639386
879,0.588974,0.6883
880,0.528249,0.641695
881,0.568237,0.630765
882,0.506089,0.697664
883,0.506227,0.674544
884,0.50692,0.695465
885,0.562916,0.696323
886,0.517508,0.687047
887,0.574091,0.690211
888,0.545077,0.622324
889,0.542497,0.678406
890,0.51529,0.615568
891,0.50623,0.634123
892,0.515218,0.659495
893,0.60059,0.633193
894,0.534535,0.682007
895,0.572256,0.670306
896,0.505019,0.629974
897,0.503562,0.611373
898,0.52849,0.650451
899,0.600455,0.681306
900,0.586951,0.627107
901,0.524038,0.617784
902,0.568242,0.669739
903,0.512865,0.688882
904,0.543975,0.682025
905,0.530751,0.644
906,0.503767,0.675404
907,0.590406,0.669379
908,0.588105,0.666348
909,0.524779,0.645991
910,0.502238,0.683518
911,0.553543,0.681742
912,0.588841,0.675244
913,0.501655,0.613263
914,0.553755,0.642146
915,0.519461,0.62798
916,0.588075,0.660629
917,0.540408,0.627421
918,0.516498,0.638835
919,0.567462,0.643302
920,0.575999,0.632909
921,0.562476,0.659961
922,0.517769,0.684634
923,0.519015,0.685605
924,0.550139,0.648652
925,0.547434,0.675865
926,0.562629,0.690496
927,0.580184,0.627934
928,0.567018,0.661048
929,0.597932,0.635138
930,0.579153,0.688381
931,0.501595,0.680883
932,0.567939,0.679096
933,0.559342,0.611926
934,0.59278,0.645743
935,0.586941,0.670598
936,0.598643,0.685751
937,0.518259,0.678802
938,0.596734,0.675541
939,0.518043,0.616937
940,0.526607,0.658636
941,0.516044,0.621519
942,0.502038,0.664339
943,0.535524,0.672791
944,0.570549,0.69817
945,0.552106,0.649298
946,0.58423,0.664923
947,0.584047,0.650387
948,0.558787,0.673906
949,0.509792,0.619312
950,0.509248,0.646932
951,0.578777,0.646742
952,0.60021,0.651516
953,0.601062,0.683699
954,0.565738,0.676181
955,0.590103,0.649342
956,0.547533,0.630944
957,0.544206,0.675838
958,0.554581,0.644439
959,0.52054,0.623119
960,0.55045,0.631235
961,0.552824,0.678589
962,0.525303,0.65605
963,0.583911,0.636929
964,0.517129,0.614377
965,0.599032,0.619156
966,0.556001,0.633194
967,0.516304,0.696803
968,0.536084,0.668305
969,0.501057,0.653533
970,0.53104,0.638259
971,0.563411,0.642094
972,0.581711,0.697945
973,0.529485,0.635294
974,0.601088,0.650002
975,0.581819,0.629299
976,0.533135,0.614434
977,0.585252,0.634033
978,0.543994,0.652344
979,0.579988,0.627879
980,0.509277,0.648494
981,0.558722,0.663395
982,0.554975,0.697986
983,0.530267,0.641273
984,0.513935,0.677492
985,0.556831,0.61213
986,0.522526,0.650049
987,0.552393,0.687213
988,0.567191,0.635225
989,0.601211,0.636354
990,0.552962,0.645853
991,0.54541,0.612706
992,0.570868,0.652673
993,0.507938,0.6742
994,0.565858,0.667842
995,0.50426,0.681634
996,0.503368,0.685237
997,0.578828,0.614083
998,0.547726,0.67642
999,0.509085,0.663809
1000,0.51116,0.646784
