episode,average_reward
2001,0.8827530279035987
2002,0.5396922235932635
2003,-4.525772334574541
2004,4.039041471605186
2005,-6.426616170252661
2006,-4.171320752156956
2007,1.0539442768193457
2008,-7.592458410689129
2009,-9.426096214809089
2010,-0.28821333009124395
2011,-7.978233985172482
2012,-3.0613924158717536
2013,-7.6799841211798086
2014,-4.257607083167934
2015,-0.10355833229145794
2016,-6.923594198697359
2017,-7.36794167669542
2018,-4.02480576920002
2019,2.712444313820935
2020,4.586687702054402
2021,1.484577564291687
2022,-9.945146662628398
2023,4.062588605297222
2024,-5.639482187417618
2025,1.5385939841218423
2026,-0.32467878136783135
2027,4.803473214309546
2028,4.317327246562588
2029,-9.906384020201994
2030,-2.8004254253500536
2031,-0.6338173470901545
2032,-4.470507379689897
2033,4.239803834096735
2034,-4.973308497583767
2035,-6.919423210403261
2036,-3.4335063085314363
2037,-8.273373814996392
2038,-7.333988290815314
2039,-8.444454220210698
2040,-0.7888113902910767
2041,4.113293220153974
2042,3.4814326065409187
2043,-9.751341995399487
2044,-1.7033597428338325
2045,2.817489079366469
2046,-0.2542205772323971
2047,-2.480715675328825
2048,-0.24095840586633344
2049,-0.7740782831066078
2050,-5.391206583715752
2051,-0.6463452731781594
2052,2.2434686797572994
2053,-2.075020699878803
2054,-6.9117500700103465
2055,-8.629821988882476
2056,-1.6360863553866842
2057,2.307768623096228
2058,-2.9271756598978653
2059,-2.313572432231034
2060,-3.5797856365235567
2061,-4.986695751418149
2062,-7.290216283051398
2063,-8.437947924424783
2064,-0.5684808497626381
2065,-8.094224618620116
2066,-3.9853914047488583
2067,-4.293986339376243
2068,-8.232155217429067
2069,3.727748797529145
2070,0.4187191664047205
2071,3.9654313735649147
2072,-4.47630464881119
2073,-3.107177440989921
2074,3.246835347209025
2075,-8.106784372663919
2076,-8.665223455991097
2077,-9.513482321788125
2078,-5.914620883190127
2079,-8.371956537964927
2080,2.703214240958822
2081,-7.293151630176065
2082,3.1318222205590303
2083,-2.8342386948489695
2084,-7.951518532640588
2085,-0.5353990922224163
2086,0.6916355109927554
2087,-5.73890951775214
2088,-7.441089810518309
2089,-1.398562806686991
2090,2.1323397638465025
2091,-9.754533068696471
2092,4.449713054388656
2093,-9.064363224635146
2094,-5.099179559574902
2095,-6.12210408460273
2096,0.06419413523802042
2097,-0.833537658909048
2098,-0.01783006026324152
2099,-6.877441699943553
2100,-4.605446858426516
2101,-6.034434786303738
2102,-7.896081065313457
2103,-2.5256173450962285
2104,-7.6404466634153145
2105,-1.3374236921158644
2106,-3.1297832368358343
2107,-4.271807527391637
2108,3.9388689726584403
2109,-2.876344812255427
2110,-9.70518017896857
2111,0.8860685398771917
2112,-5.450146504937478
2113,-7.625250129313059
2114,-0.0996869380927059
2115,4.324517193761704
2116,1.6032067331530087
2117,1.9022297144541547
2118,-3.7516183189922474
2119,3.8400766603739385
2120,-6.264332478232514
2121,-8.1222856097737
2122,2.146135339885854
2123,-1.0933409918431227
2124,2.439818439884988
2125,-7.5019725741069365
2126,-2.489402784489105
2127,-4.3559782833213765
2128,-5.581362906386683
2129,-9.536994925524779
2130,-6.109100147591945
2131,-6.697590235846072
2132,4.19283586666233
2133,1.649722852920263
2134,-8.201520146774554
2135,-1.6047176195215815
2136,1.1643192602119878
2137,-1.4732628759268263
2138,-7.024518267759429
2139,-5.742380144718421
2140,-4.730070359682229
2141,-3.668457876492985
2142,0.33516351549182133
2143,4.653070333862363
2144,-0.2726183805619815
2145,-3.5630101445024955
2146,0.1801755324246308
2147,-9.434370793604813
2148,1.0099676108426276
2149,-9.289331782048206
2150,-6.298643675374269
2151,4.618900068170456
2152,-4.093885561782702
2153,-5.656998471229002
2154,2.245160033158097
2155,4.9103342527593785
2156,-9.636125982035322
2157,-9.571330927118252
2158,-1.7812608339772655
2159,-9.465444102825142
2160,-7.363205609675072
2161,-7.641952763193922
2162,-3.562570299293829
2163,-0.6675517361673009
2164,-2.108990710946527
2165,3.718883500616574
2166,-6.084279347179909
2167,-4.268021647252206
2168,-6.63787644672526
2169,-0.17435185950939847
2170,-0.9967501884866845
2171,-0.23864769984179546
2172,-9.500851112003673
2173,2.1042152883974126
2174,-2.234113171080087
2175,-8.37253771355891
2176,4.2108683087743035
2177,2.178186163675745
2178,3.8254306024125633
2179,3.047835882613576
2180,4.153105159523694
2181,0.7335164125523477
2182,2.4107823388676177
2183,1.4146345797702828
2184,-2.511191077371314
2185,1.5424852074713105
2186,-4.132545528106367
2187,-3.09970669983354
2188,2.105517920380027
2189,-7.45670773190149
2190,-0.570200019395644
2191,-2.9111597110892955
2192,-6.411699022012163
2193,4.494025845323085
2194,-4.653317643321925
2195,-8.827157707760449
2196,-2.8093017514877996
2197,3.3345073969891974
2198,-8.109062418953222
2199,-0.2392057014437441
2200,-2.043938002981168
2201,-3.63780471281732
2202,-7.586180294278622
2203,-4.876775556143251
2204,-5.356039810439518
2205,-7.621524298817946
2206,-7.4249772816711355
2207,-1.6749561083119424
2208,-3.197444660929717
2209,3.921661552160554
2210,-4.411052688212817
2211,-3.215779525773124
2212,4.020964162420878
2213,-9.339014570084096
2214,2.874557068189553
2215,4.230475876290857
2216,-7.722001102354762
2217,-7.586531306859039
2218,-9.996775125053567
2219,-7.343285772390343
2220,1.2300507996868681
2221,-5.045593243010244
2222,3.002136265571366
2223,-3.4598410718110664
2224,1.0403336949771749
2225,4.192694501945409
2226,1.058360069750126
2227,-5.184633625363409
2228,3.9501541828187055
2229,-7.200693132675401
2230,-0.23182494001927978
2231,4.741565008776611
2232,-4.443391721268423
2233,-9.482503616081532
2234,-4.256997637760864
2235,-5.610478085978223
2236,-8.793515051989665
2237,-2.4164120294164135
2238,-0.17013018608205854
2239,4.673343668184282
2240,-1.7878954083089464
2241,-0.35325090923864977
2242,2.5338755050256108
2243,-9.135163981652592
2244,-9.105976407640448
2245,-9.20512520947985
2246,-9.611750845389325
2247,-0.5921477896602525
2248,-3.5011644012199525
2249,-9.128485053346852
2250,-7.138069966832568
2251,-0.42780570140252117
2252,-1.1757475632726262
2253,-3.2134367559930146
2254,-9.870972899697712
2255,1.9052113049240518
2256,-9.590016295139899
2257,-0.04909172377873361
2258,-3.788042695146336
2259,-9.11468620088537
2260,0.8068646743359196
2261,-0.08766640108878221
2262,-8.316780971765121
2263,2.2783739863768275
2264,0.7460366830543741
2265,-9.371387622984614
2266,-7.734586292649612
2267,-9.225147669803
2268,2.4489487858924104
2269,3.8667402118915604
2270,-9.88899794847586
2271,2.0288204144702426
2272,-6.82687963675191
2273,-6.820768749487414
2274,-4.101488595941206
2275,-4.748948747327091
2276,-8.22226876880705
2277,1.0076838623379416
2278,-7.604193059362572
2279,-9.869973136980288
2280,-3.3547431284154774
2281,-9.054099488441521
2282,0.6774922308592792
2283,0.1570959961473708
2284,-0.4652506066635702
2285,-5.668877494682044
2286,-2.311589081459301
2287,-2.765460265363741
2288,4.01160405833159
2289,-1.9227927881790592
2290,2.6810483464127746
2291,-2.7264441728374704
2292,-1.4142003952197921
2293,4.925056462295201
2294,-4.645051496023028
2295,-7.8297372145544655
2296,-4.2472944280122595
2297,4.239413361314092
2298,-6.143225993663464
2299,-0.04814279439516511
2300,-4.450261323121522
2301,0.05539505786702392
2302,-4.2882786225519745
2303,-1.8960543360881843
2304,-8.318885970791117
2305,-8.864009650544478
2306,4.076905307744111
2307,2.93577307073409
2308,2.110286229392212
2309,3.3310907570479866
2310,-1.9030702181098391
2311,-7.213762357788118
2312,1.0367437901888792
2313,-7.170145901110457
2314,2.680219553352371
2315,0.2176213916681231
2316,-2.8759480087395337
2317,-9.908170636127897
2318,-3.0350937896973447
2319,2.433891275395176
2320,-7.834822631651487
2321,-5.8131736138738255
2322,-1.1457406833731962
2323,-2.1785847820996596
2324,-7.072512169783615
2325,-7.884271049778579
2326,1.2317301724197698
2327,-0.5048759742075521
2328,-2.7059231368494983
2329,1.7913746503331183
2330,-5.811131084273036
2331,-1.3038500492101672
2332,-3.7334475013415167
2333,-2.4051006866919726
2334,4.832626260785284
2335,1.6896880766702314
2336,-9.093139037539064
2337,1.0404751365783849
2338,-6.042697191584619
2339,2.77268293556863
2340,2.910908179788416
2341,-8.51574476396279
2342,-6.096560029699567
2343,-6.321497774417013
2344,0.3640532606975082
2345,2.7128211122189416
2346,1.5338263419018574
2347,1.3132303568519124
2348,1.2468160676547502
2349,-3.987432579213749
2350,2.255946328210074
2351,-8.420670557119506
2352,2.170900738554927
2353,-4.5947568170156625
2354,-4.095676844020225
2355,-2.800336675225151
2356,-1.8236507762398002
2357,-8.165538227847911
2358,-7.056185124729381
2359,-4.45793634554133
2360,-1.6325230003942046
2361,4.658279160758603
2362,-5.579585383037258
2363,-9.97947850484616
2364,0.7330077295965403
2365,-4.587307421362358
2366,3.6381355621546625
2367,-8.388931433376099
2368,-1.1649951850636278
2369,-3.1269040855435524
2370,4.145925607632252
2371,-2.7704842542109773
2372,-1.749449557373083
2373,2.7021565032077817
2374,-3.998747368609621
2375,-5.399310284876298
2376,0.5160566035743273
2377,-8.369859000352081
2378,-6.683610714229475
2379,-2.549163093478885
2380,-2.6108983867382447
2381,3.0592695173305415
2382,-0.8500103725081765
2383,-7.261482865495676
2384,-3.836793432417502
2385,-4.917265453169803
2386,1.4228953280664598
2387,-3.3773022390086718
2388,2.0116563211618708
2389,0.24256923408884568
2390,-3.3790318410806437
2391,4.916194072738026
2392,-5.804591176723603
2393,2.9583120023649645
2394,-8.700656544152
2395,-1.5262086822086118
2396,1.007731456911504
2397,-6.572054983816689
2398,-8.6837324312737
2399,-6.003888474890914
2400,-8.490105193530715
2401,0.6480357211839589
2402,-6.38671297936629
2403,1.7652025924692474
2404,-3.2552930448498145
2405,4.057121583792707
2406,-6.104794145876015
2407,3.3349978355953542
2408,-4.150181246246869
2409,-2.0788456520207905
2410,-0.9821418114426734
2411,-0.6013779026737502
2412,4.290034300609353
2413,3.990743577848555
2414,2.0138582043363087
2415,-0.7893763367604851
2416,-8.630690348660629
2417,-4.786544778586702
2418,-7.515589964144188
2419,-3.4544415860061397
2420,-6.642392906768089
2421,-2.2738789480037234
2422,-5.095728702426226
2423,3.8464802381210035
2424,0.8483322417866415
2425,-4.405853934220964
2426,-8.128589629908586
2427,-3.972953556151327
2428,-6.004548732490642
2429,-3.1118405920972876
2430,-9.251022821903828
2431,-8.671730174268362
2432,-3.609060645073151
2433,1.934927830130368
2434,-5.690674787807691
2435,4.481383801562821
2436,0.022412451836023806
2437,2.5989422514788796
2438,-6.001036847529429
2439,-6.947642926776823
2440,-3.0222791420738284
2441,-7.719457192659872
2442,-6.820842975361456
2443,-4.941658117731742
2444,3.2393430504025407
2445,4.645986305895155
2446,-7.072443451548411
2447,-8.724288569775416
2448,-7.638762816211379
2449,0.03387449195617975
2450,-9.756449043118367
2451,-6.509549580159544
2452,4.334003460780526
2453,4.87774099588643
2454,-7.335886815079249
2455,0.2034709059457711
2456,3.661196735910824
2457,-9.431866514658392
2458,3.533426452241441
2459,-7.674591110469747
2460,-1.0455319673562613
2461,-9.916295563418332
2462,0.5377327967448
2463,-3.519080647409919
2464,-6.701912697419747
2465,0.38089282818800285
2466,0.504298516943912
2467,0.26069120389052713
2468,-9.875324017121011
2469,4.549047409569244
2470,-8.793405869107952
2471,0.2184738841420799
2472,4.53206970104338
2473,-7.07788190105347
2474,-9.308679874622673
2475,-3.3327201826953132
2476,-4.879338464420507
2477,1.5732403823456842
2478,1.7020334969895838
2479,-6.83648794492576
2480,1.3327149889254422
2481,-8.019578877188515
2482,2.024346360840589
2483,-1.0077376266814628
2484,-4.165164073880192
2485,-8.928927557231784
2486,-4.1755121041464855
2487,4.80343532810614
2488,3.289563185919624
2489,-8.416101650184697
2490,0.6213804469565858
2491,-9.38236238640398
2492,4.059027314539472
2493,-2.27855928614158
2494,3.1534747266935224
2495,-9.569117045938746
2496,2.1350178799397064
2497,-3.108106686663758
2498,-5.097411768418281
2499,-2.1199446564420557
2500,-5.250397949237558
