G04 #@! TF.GenerationSoftware,KiCad,Pcbnew,(5.0.2)-1*
G04 #@! TF.CreationDate,2019-01-22T17:29:42-05:00*
G04 #@! TF.ProjectId,radio-subboard,72616469-6f2d-4737-9562-626f6172642e,rev?*
G04 #@! TF.SameCoordinates,Original*
G04 #@! TF.FileFunction,Soldermask,Bot*
G04 #@! TF.FilePolarity,Negative*
%FSLAX46Y46*%
G04 Gerber Fmt 4.6, Leading zero omitted, Abs format (unit mm)*
G04 Created by KiCad (PCBNEW (5.0.2)-1) date 2019-01-22 5:29:42 PM*
%MOMM*%
%LPD*%
G01*
G04 APERTURE LIST*
%ADD10C,0.100000*%
G04 APERTURE END LIST*
D10*
G36*
X192032812Y-96923624D02*
X192196784Y-96991544D01*
X192344354Y-97090147D01*
X192469853Y-97215646D01*
X192568456Y-97363216D01*
X192636376Y-97527188D01*
X192671000Y-97701259D01*
X192671000Y-97878741D01*
X192636376Y-98052812D01*
X192568456Y-98216784D01*
X192469853Y-98364354D01*
X192344354Y-98489853D01*
X192196784Y-98588456D01*
X192032812Y-98656376D01*
X191858741Y-98691000D01*
X191681259Y-98691000D01*
X191507188Y-98656376D01*
X191343216Y-98588456D01*
X191195646Y-98489853D01*
X191070147Y-98364354D01*
X190971544Y-98216784D01*
X190903624Y-98052812D01*
X190869000Y-97878741D01*
X190869000Y-97701259D01*
X190903624Y-97527188D01*
X190971544Y-97363216D01*
X191070147Y-97215646D01*
X191195646Y-97090147D01*
X191343216Y-96991544D01*
X191507188Y-96923624D01*
X191681259Y-96889000D01*
X191858741Y-96889000D01*
X192032812Y-96923624D01*
X192032812Y-96923624D01*
G37*
G36*
X189492812Y-96923624D02*
X189656784Y-96991544D01*
X189804354Y-97090147D01*
X189929853Y-97215646D01*
X190028456Y-97363216D01*
X190096376Y-97527188D01*
X190131000Y-97701259D01*
X190131000Y-97878741D01*
X190096376Y-98052812D01*
X190028456Y-98216784D01*
X189929853Y-98364354D01*
X189804354Y-98489853D01*
X189656784Y-98588456D01*
X189492812Y-98656376D01*
X189318741Y-98691000D01*
X189141259Y-98691000D01*
X188967188Y-98656376D01*
X188803216Y-98588456D01*
X188655646Y-98489853D01*
X188530147Y-98364354D01*
X188431544Y-98216784D01*
X188363624Y-98052812D01*
X188329000Y-97878741D01*
X188329000Y-97701259D01*
X188363624Y-97527188D01*
X188431544Y-97363216D01*
X188530147Y-97215646D01*
X188655646Y-97090147D01*
X188803216Y-96991544D01*
X188967188Y-96923624D01*
X189141259Y-96889000D01*
X189318741Y-96889000D01*
X189492812Y-96923624D01*
X189492812Y-96923624D01*
G37*
G36*
X190917091Y-94765585D02*
X190951069Y-94775893D01*
X190982387Y-94792633D01*
X191009839Y-94815161D01*
X191032367Y-94842613D01*
X191049107Y-94873931D01*
X191059415Y-94907909D01*
X191063500Y-94949390D01*
X191063500Y-95625610D01*
X191059415Y-95667091D01*
X191049107Y-95701069D01*
X191032367Y-95732387D01*
X191009839Y-95759839D01*
X190982387Y-95782367D01*
X190951069Y-95799107D01*
X190917091Y-95809415D01*
X190875610Y-95813500D01*
X190274390Y-95813500D01*
X190232909Y-95809415D01*
X190198931Y-95799107D01*
X190167613Y-95782367D01*
X190140161Y-95759839D01*
X190117633Y-95732387D01*
X190100893Y-95701069D01*
X190090585Y-95667091D01*
X190086500Y-95625610D01*
X190086500Y-94949390D01*
X190090585Y-94907909D01*
X190100893Y-94873931D01*
X190117633Y-94842613D01*
X190140161Y-94815161D01*
X190167613Y-94792633D01*
X190198931Y-94775893D01*
X190232909Y-94765585D01*
X190274390Y-94761500D01*
X190875610Y-94761500D01*
X190917091Y-94765585D01*
X190917091Y-94765585D01*
G37*
G36*
X192492091Y-94765585D02*
X192526069Y-94775893D01*
X192557387Y-94792633D01*
X192584839Y-94815161D01*
X192607367Y-94842613D01*
X192624107Y-94873931D01*
X192634415Y-94907909D01*
X192638500Y-94949390D01*
X192638500Y-95625610D01*
X192634415Y-95667091D01*
X192624107Y-95701069D01*
X192607367Y-95732387D01*
X192584839Y-95759839D01*
X192557387Y-95782367D01*
X192526069Y-95799107D01*
X192492091Y-95809415D01*
X192450610Y-95813500D01*
X191849390Y-95813500D01*
X191807909Y-95809415D01*
X191773931Y-95799107D01*
X191742613Y-95782367D01*
X191715161Y-95759839D01*
X191692633Y-95732387D01*
X191675893Y-95701069D01*
X191665585Y-95667091D01*
X191661500Y-95625610D01*
X191661500Y-94949390D01*
X191665585Y-94907909D01*
X191675893Y-94873931D01*
X191692633Y-94842613D01*
X191715161Y-94815161D01*
X191742613Y-94792633D01*
X191773931Y-94775893D01*
X191807909Y-94765585D01*
X191849390Y-94761500D01*
X192450610Y-94761500D01*
X192492091Y-94765585D01*
X192492091Y-94765585D01*
G37*
G36*
X189379591Y-94803085D02*
X189413569Y-94813393D01*
X189444887Y-94830133D01*
X189472339Y-94852661D01*
X189494867Y-94880113D01*
X189511607Y-94911431D01*
X189521915Y-94945409D01*
X189526000Y-94986890D01*
X189526000Y-95588110D01*
X189521915Y-95629591D01*
X189511607Y-95663569D01*
X189494867Y-95694887D01*
X189472339Y-95722339D01*
X189444887Y-95744867D01*
X189413569Y-95761607D01*
X189379591Y-95771915D01*
X189338110Y-95776000D01*
X188661890Y-95776000D01*
X188620409Y-95771915D01*
X188586431Y-95761607D01*
X188555113Y-95744867D01*
X188527661Y-95722339D01*
X188505133Y-95694887D01*
X188488393Y-95663569D01*
X188478085Y-95629591D01*
X188474000Y-95588110D01*
X188474000Y-94986890D01*
X188478085Y-94945409D01*
X188488393Y-94911431D01*
X188505133Y-94880113D01*
X188527661Y-94852661D01*
X188555113Y-94830133D01*
X188586431Y-94813393D01*
X188620409Y-94803085D01*
X188661890Y-94799000D01*
X189338110Y-94799000D01*
X189379591Y-94803085D01*
X189379591Y-94803085D01*
G37*
G36*
X192492091Y-93190585D02*
X192526069Y-93200893D01*
X192557387Y-93217633D01*
X192584839Y-93240161D01*
X192607367Y-93267613D01*
X192624107Y-93298931D01*
X192634415Y-93332909D01*
X192638500Y-93374390D01*
X192638500Y-94050610D01*
X192634415Y-94092091D01*
X192624107Y-94126069D01*
X192607367Y-94157387D01*
X192584839Y-94184839D01*
X192557387Y-94207367D01*
X192526069Y-94224107D01*
X192492091Y-94234415D01*
X192450610Y-94238500D01*
X191849390Y-94238500D01*
X191807909Y-94234415D01*
X191773931Y-94224107D01*
X191742613Y-94207367D01*
X191715161Y-94184839D01*
X191692633Y-94157387D01*
X191675893Y-94126069D01*
X191665585Y-94092091D01*
X191661500Y-94050610D01*
X191661500Y-93374390D01*
X191665585Y-93332909D01*
X191675893Y-93298931D01*
X191692633Y-93267613D01*
X191715161Y-93240161D01*
X191742613Y-93217633D01*
X191773931Y-93200893D01*
X191807909Y-93190585D01*
X191849390Y-93186500D01*
X192450610Y-93186500D01*
X192492091Y-93190585D01*
X192492091Y-93190585D01*
G37*
G36*
X190917091Y-93190585D02*
X190951069Y-93200893D01*
X190982387Y-93217633D01*
X191009839Y-93240161D01*
X191032367Y-93267613D01*
X191049107Y-93298931D01*
X191059415Y-93332909D01*
X191063500Y-93374390D01*
X191063500Y-94050610D01*
X191059415Y-94092091D01*
X191049107Y-94126069D01*
X191032367Y-94157387D01*
X191009839Y-94184839D01*
X190982387Y-94207367D01*
X190951069Y-94224107D01*
X190917091Y-94234415D01*
X190875610Y-94238500D01*
X190274390Y-94238500D01*
X190232909Y-94234415D01*
X190198931Y-94224107D01*
X190167613Y-94207367D01*
X190140161Y-94184839D01*
X190117633Y-94157387D01*
X190100893Y-94126069D01*
X190090585Y-94092091D01*
X190086500Y-94050610D01*
X190086500Y-93374390D01*
X190090585Y-93332909D01*
X190100893Y-93298931D01*
X190117633Y-93267613D01*
X190140161Y-93240161D01*
X190167613Y-93217633D01*
X190198931Y-93200893D01*
X190232909Y-93190585D01*
X190274390Y-93186500D01*
X190875610Y-93186500D01*
X190917091Y-93190585D01*
X190917091Y-93190585D01*
G37*
G36*
X189379591Y-93228085D02*
X189413569Y-93238393D01*
X189444887Y-93255133D01*
X189472339Y-93277661D01*
X189494867Y-93305113D01*
X189511607Y-93336431D01*
X189521915Y-93370409D01*
X189526000Y-93411890D01*
X189526000Y-94013110D01*
X189521915Y-94054591D01*
X189511607Y-94088569D01*
X189494867Y-94119887D01*
X189472339Y-94147339D01*
X189444887Y-94169867D01*
X189413569Y-94186607D01*
X189379591Y-94196915D01*
X189338110Y-94201000D01*
X188661890Y-94201000D01*
X188620409Y-94196915D01*
X188586431Y-94186607D01*
X188555113Y-94169867D01*
X188527661Y-94147339D01*
X188505133Y-94119887D01*
X188488393Y-94088569D01*
X188478085Y-94054591D01*
X188474000Y-94013110D01*
X188474000Y-93411890D01*
X188478085Y-93370409D01*
X188488393Y-93336431D01*
X188505133Y-93305113D01*
X188527661Y-93277661D01*
X188555113Y-93255133D01*
X188586431Y-93238393D01*
X188620409Y-93228085D01*
X188661890Y-93224000D01*
X189338110Y-93224000D01*
X189379591Y-93228085D01*
X189379591Y-93228085D01*
G37*
G36*
X189323500Y-92707600D02*
X187951500Y-92707600D01*
X187951500Y-91081600D01*
X189323500Y-91081600D01*
X189323500Y-92707600D01*
X189323500Y-92707600D01*
G37*
G36*
X191177700Y-92707600D02*
X189805700Y-92707600D01*
X189805700Y-91081600D01*
X191177700Y-91081600D01*
X191177700Y-92707600D01*
X191177700Y-92707600D01*
G37*
G36*
X193031900Y-92707600D02*
X191659900Y-92707600D01*
X191659900Y-91081600D01*
X193031900Y-91081600D01*
X193031900Y-92707600D01*
X193031900Y-92707600D01*
G37*
G36*
X184805000Y-91267000D02*
X181703000Y-91267000D01*
X181703000Y-89865000D01*
X184805000Y-89865000D01*
X184805000Y-91267000D01*
X184805000Y-91267000D01*
G37*
G36*
X199805000Y-91267000D02*
X196703000Y-91267000D01*
X196703000Y-89865000D01*
X199805000Y-89865000D01*
X199805000Y-91267000D01*
X199805000Y-91267000D01*
G37*
G36*
X199805000Y-89267000D02*
X196703000Y-89267000D01*
X196703000Y-87865000D01*
X199805000Y-87865000D01*
X199805000Y-89267000D01*
X199805000Y-89267000D01*
G37*
G36*
X184805000Y-89267000D02*
X181703000Y-89267000D01*
X181703000Y-87865000D01*
X184805000Y-87865000D01*
X184805000Y-89267000D01*
X184805000Y-89267000D01*
G37*
G36*
X184805000Y-87267000D02*
X181703000Y-87267000D01*
X181703000Y-85865000D01*
X184805000Y-85865000D01*
X184805000Y-87267000D01*
X184805000Y-87267000D01*
G37*
G36*
X199805000Y-87267000D02*
X196703000Y-87267000D01*
X196703000Y-85865000D01*
X199805000Y-85865000D01*
X199805000Y-87267000D01*
X199805000Y-87267000D01*
G37*
G36*
X193031900Y-86891000D02*
X191659900Y-86891000D01*
X191659900Y-85265000D01*
X193031900Y-85265000D01*
X193031900Y-86891000D01*
X193031900Y-86891000D01*
G37*
G36*
X191177700Y-86891000D02*
X189805700Y-86891000D01*
X189805700Y-85265000D01*
X191177700Y-85265000D01*
X191177700Y-86891000D01*
X191177700Y-86891000D01*
G37*
G36*
X189323500Y-86891000D02*
X187951500Y-86891000D01*
X187951500Y-85265000D01*
X189323500Y-85265000D01*
X189323500Y-86891000D01*
X189323500Y-86891000D01*
G37*
G36*
X199805000Y-85267000D02*
X196703000Y-85267000D01*
X196703000Y-83865000D01*
X199805000Y-83865000D01*
X199805000Y-85267000D01*
X199805000Y-85267000D01*
G37*
G36*
X184805000Y-85267000D02*
X181703000Y-85267000D01*
X181703000Y-83865000D01*
X184805000Y-83865000D01*
X184805000Y-85267000D01*
X184805000Y-85267000D01*
G37*
G36*
X199805000Y-83267000D02*
X196703000Y-83267000D01*
X196703000Y-81865000D01*
X199805000Y-81865000D01*
X199805000Y-83267000D01*
X199805000Y-83267000D01*
G37*
G36*
X184805000Y-83267000D02*
X181703000Y-83267000D01*
X181703000Y-81865000D01*
X184805000Y-81865000D01*
X184805000Y-83267000D01*
X184805000Y-83267000D01*
G37*
G36*
X184805000Y-81267000D02*
X181703000Y-81267000D01*
X181703000Y-79865000D01*
X184805000Y-79865000D01*
X184805000Y-81267000D01*
X184805000Y-81267000D01*
G37*
G36*
X199805000Y-81267000D02*
X196703000Y-81267000D01*
X196703000Y-79865000D01*
X199805000Y-79865000D01*
X199805000Y-81267000D01*
X199805000Y-81267000D01*
G37*
G36*
X184805000Y-79267000D02*
X181703000Y-79267000D01*
X181703000Y-77865000D01*
X184805000Y-77865000D01*
X184805000Y-79267000D01*
X184805000Y-79267000D01*
G37*
G36*
X199805000Y-79267000D02*
X196703000Y-79267000D01*
X196703000Y-77865000D01*
X199805000Y-77865000D01*
X199805000Y-79267000D01*
X199805000Y-79267000D01*
G37*
G36*
X184016812Y-75699624D02*
X184180784Y-75767544D01*
X184328354Y-75866147D01*
X184453853Y-75991646D01*
X184552456Y-76139216D01*
X184620376Y-76303188D01*
X184655000Y-76477259D01*
X184655000Y-76654741D01*
X184620376Y-76828812D01*
X184552456Y-76992784D01*
X184453853Y-77140354D01*
X184328354Y-77265853D01*
X184180784Y-77364456D01*
X184016812Y-77432376D01*
X183842741Y-77467000D01*
X183665259Y-77467000D01*
X183491188Y-77432376D01*
X183327216Y-77364456D01*
X183179646Y-77265853D01*
X183054147Y-77140354D01*
X182955544Y-76992784D01*
X182887624Y-76828812D01*
X182853000Y-76654741D01*
X182853000Y-76477259D01*
X182887624Y-76303188D01*
X182955544Y-76139216D01*
X183054147Y-75991646D01*
X183179646Y-75866147D01*
X183327216Y-75767544D01*
X183491188Y-75699624D01*
X183665259Y-75665000D01*
X183842741Y-75665000D01*
X184016812Y-75699624D01*
X184016812Y-75699624D01*
G37*
G36*
X199805000Y-77267000D02*
X196703000Y-77267000D01*
X196703000Y-75865000D01*
X199805000Y-75865000D01*
X199805000Y-77267000D01*
X199805000Y-77267000D01*
G37*
G36*
X179281190Y-71505483D02*
X179809138Y-71724166D01*
X180284283Y-72041648D01*
X180688352Y-72445717D01*
X181005834Y-72920862D01*
X181224517Y-73448810D01*
X181336000Y-74009275D01*
X181336000Y-74580725D01*
X181224517Y-75141190D01*
X181005834Y-75669138D01*
X180688352Y-76144283D01*
X180284283Y-76548352D01*
X179809138Y-76865834D01*
X179281190Y-77084517D01*
X178720725Y-77196000D01*
X178149275Y-77196000D01*
X177588810Y-77084517D01*
X177060862Y-76865834D01*
X176585717Y-76548352D01*
X176181648Y-76144283D01*
X175864166Y-75669138D01*
X175645483Y-75141190D01*
X175534000Y-74580725D01*
X175534000Y-74009275D01*
X175645483Y-73448810D01*
X175864166Y-72920862D01*
X176181648Y-72445717D01*
X176585717Y-72041648D01*
X177060862Y-71724166D01*
X177588810Y-71505483D01*
X178149275Y-71394000D01*
X178720725Y-71394000D01*
X179281190Y-71505483D01*
X179281190Y-71505483D01*
G37*
G36*
X186733643Y-72429781D02*
X186879415Y-72490162D01*
X187010611Y-72577824D01*
X187122176Y-72689389D01*
X187209838Y-72820585D01*
X187270219Y-72966357D01*
X187301000Y-73121107D01*
X187301000Y-73278893D01*
X187270219Y-73433643D01*
X187209838Y-73579415D01*
X187122176Y-73710611D01*
X187010611Y-73822176D01*
X186879415Y-73909838D01*
X186733643Y-73970219D01*
X186578893Y-74001000D01*
X186421107Y-74001000D01*
X186266357Y-73970219D01*
X186120585Y-73909838D01*
X185989389Y-73822176D01*
X185877824Y-73710611D01*
X185790162Y-73579415D01*
X185729781Y-73433643D01*
X185699000Y-73278893D01*
X185699000Y-73121107D01*
X185729781Y-72966357D01*
X185790162Y-72820585D01*
X185877824Y-72689389D01*
X185989389Y-72577824D01*
X186120585Y-72490162D01*
X186266357Y-72429781D01*
X186421107Y-72399000D01*
X186578893Y-72399000D01*
X186733643Y-72429781D01*
X186733643Y-72429781D01*
G37*
G36*
X194733643Y-72429781D02*
X194879415Y-72490162D01*
X195010611Y-72577824D01*
X195122176Y-72689389D01*
X195209838Y-72820585D01*
X195270219Y-72966357D01*
X195301000Y-73121107D01*
X195301000Y-73278893D01*
X195270219Y-73433643D01*
X195209838Y-73579415D01*
X195122176Y-73710611D01*
X195010611Y-73822176D01*
X194879415Y-73909838D01*
X194733643Y-73970219D01*
X194578893Y-74001000D01*
X194421107Y-74001000D01*
X194266357Y-73970219D01*
X194120585Y-73909838D01*
X193989389Y-73822176D01*
X193877824Y-73710611D01*
X193790162Y-73579415D01*
X193729781Y-73433643D01*
X193699000Y-73278893D01*
X193699000Y-73121107D01*
X193729781Y-72966357D01*
X193790162Y-72820585D01*
X193877824Y-72689389D01*
X193989389Y-72577824D01*
X194120585Y-72490162D01*
X194266357Y-72429781D01*
X194421107Y-72399000D01*
X194578893Y-72399000D01*
X194733643Y-72429781D01*
X194733643Y-72429781D01*
G37*
G36*
X192733643Y-72429781D02*
X192879415Y-72490162D01*
X193010611Y-72577824D01*
X193122176Y-72689389D01*
X193209838Y-72820585D01*
X193270219Y-72966357D01*
X193301000Y-73121107D01*
X193301000Y-73278893D01*
X193270219Y-73433643D01*
X193209838Y-73579415D01*
X193122176Y-73710611D01*
X193010611Y-73822176D01*
X192879415Y-73909838D01*
X192733643Y-73970219D01*
X192578893Y-74001000D01*
X192421107Y-74001000D01*
X192266357Y-73970219D01*
X192120585Y-73909838D01*
X191989389Y-73822176D01*
X191877824Y-73710611D01*
X191790162Y-73579415D01*
X191729781Y-73433643D01*
X191699000Y-73278893D01*
X191699000Y-73121107D01*
X191729781Y-72966357D01*
X191790162Y-72820585D01*
X191877824Y-72689389D01*
X191989389Y-72577824D01*
X192120585Y-72490162D01*
X192266357Y-72429781D01*
X192421107Y-72399000D01*
X192578893Y-72399000D01*
X192733643Y-72429781D01*
X192733643Y-72429781D01*
G37*
G36*
X184733643Y-72429781D02*
X184879415Y-72490162D01*
X185010611Y-72577824D01*
X185122176Y-72689389D01*
X185209838Y-72820585D01*
X185270219Y-72966357D01*
X185301000Y-73121107D01*
X185301000Y-73278893D01*
X185270219Y-73433643D01*
X185209838Y-73579415D01*
X185122176Y-73710611D01*
X185010611Y-73822176D01*
X184879415Y-73909838D01*
X184733643Y-73970219D01*
X184578893Y-74001000D01*
X184421107Y-74001000D01*
X184266357Y-73970219D01*
X184120585Y-73909838D01*
X183989389Y-73822176D01*
X183877824Y-73710611D01*
X183790162Y-73579415D01*
X183729781Y-73433643D01*
X183699000Y-73278893D01*
X183699000Y-73121107D01*
X183729781Y-72966357D01*
X183790162Y-72820585D01*
X183877824Y-72689389D01*
X183989389Y-72577824D01*
X184120585Y-72490162D01*
X184266357Y-72429781D01*
X184421107Y-72399000D01*
X184578893Y-72399000D01*
X184733643Y-72429781D01*
X184733643Y-72429781D01*
G37*
G36*
X190733643Y-72429781D02*
X190879415Y-72490162D01*
X191010611Y-72577824D01*
X191122176Y-72689389D01*
X191209838Y-72820585D01*
X191270219Y-72966357D01*
X191301000Y-73121107D01*
X191301000Y-73278893D01*
X191270219Y-73433643D01*
X191209838Y-73579415D01*
X191122176Y-73710611D01*
X191010611Y-73822176D01*
X190879415Y-73909838D01*
X190733643Y-73970219D01*
X190578893Y-74001000D01*
X190421107Y-74001000D01*
X190266357Y-73970219D01*
X190120585Y-73909838D01*
X189989389Y-73822176D01*
X189877824Y-73710611D01*
X189790162Y-73579415D01*
X189729781Y-73433643D01*
X189699000Y-73278893D01*
X189699000Y-73121107D01*
X189729781Y-72966357D01*
X189790162Y-72820585D01*
X189877824Y-72689389D01*
X189989389Y-72577824D01*
X190120585Y-72490162D01*
X190266357Y-72429781D01*
X190421107Y-72399000D01*
X190578893Y-72399000D01*
X190733643Y-72429781D01*
X190733643Y-72429781D01*
G37*
G36*
X188733643Y-72429781D02*
X188879415Y-72490162D01*
X189010611Y-72577824D01*
X189122176Y-72689389D01*
X189209838Y-72820585D01*
X189270219Y-72966357D01*
X189301000Y-73121107D01*
X189301000Y-73278893D01*
X189270219Y-73433643D01*
X189209838Y-73579415D01*
X189122176Y-73710611D01*
X189010611Y-73822176D01*
X188879415Y-73909838D01*
X188733643Y-73970219D01*
X188578893Y-74001000D01*
X188421107Y-74001000D01*
X188266357Y-73970219D01*
X188120585Y-73909838D01*
X187989389Y-73822176D01*
X187877824Y-73710611D01*
X187790162Y-73579415D01*
X187729781Y-73433643D01*
X187699000Y-73278893D01*
X187699000Y-73121107D01*
X187729781Y-72966357D01*
X187790162Y-72820585D01*
X187877824Y-72689389D01*
X187989389Y-72577824D01*
X188120585Y-72490162D01*
X188266357Y-72429781D01*
X188421107Y-72399000D01*
X188578893Y-72399000D01*
X188733643Y-72429781D01*
X188733643Y-72429781D01*
G37*
G36*
X196733643Y-72429781D02*
X196879415Y-72490162D01*
X197010611Y-72577824D01*
X197122176Y-72689389D01*
X197209838Y-72820585D01*
X197270219Y-72966357D01*
X197301000Y-73121107D01*
X197301000Y-73278893D01*
X197270219Y-73433643D01*
X197209838Y-73579415D01*
X197122176Y-73710611D01*
X197010611Y-73822176D01*
X196879415Y-73909838D01*
X196733643Y-73970219D01*
X196578893Y-74001000D01*
X196421107Y-74001000D01*
X196266357Y-73970219D01*
X196120585Y-73909838D01*
X195989389Y-73822176D01*
X195877824Y-73710611D01*
X195790162Y-73579415D01*
X195729781Y-73433643D01*
X195699000Y-73278893D01*
X195699000Y-73121107D01*
X195729781Y-72966357D01*
X195790162Y-72820585D01*
X195877824Y-72689389D01*
X195989389Y-72577824D01*
X196120585Y-72490162D01*
X196266357Y-72429781D01*
X196421107Y-72399000D01*
X196578893Y-72399000D01*
X196733643Y-72429781D01*
X196733643Y-72429781D01*
G37*
G36*
X184733643Y-70429781D02*
X184879415Y-70490162D01*
X185010611Y-70577824D01*
X185122176Y-70689389D01*
X185209838Y-70820585D01*
X185270219Y-70966357D01*
X185301000Y-71121107D01*
X185301000Y-71278893D01*
X185270219Y-71433643D01*
X185209838Y-71579415D01*
X185122176Y-71710611D01*
X185010611Y-71822176D01*
X184879415Y-71909838D01*
X184733643Y-71970219D01*
X184578893Y-72001000D01*
X184421107Y-72001000D01*
X184266357Y-71970219D01*
X184120585Y-71909838D01*
X183989389Y-71822176D01*
X183877824Y-71710611D01*
X183790162Y-71579415D01*
X183729781Y-71433643D01*
X183699000Y-71278893D01*
X183699000Y-71121107D01*
X183729781Y-70966357D01*
X183790162Y-70820585D01*
X183877824Y-70689389D01*
X183989389Y-70577824D01*
X184120585Y-70490162D01*
X184266357Y-70429781D01*
X184421107Y-70399000D01*
X184578893Y-70399000D01*
X184733643Y-70429781D01*
X184733643Y-70429781D01*
G37*
G36*
X196733643Y-70429781D02*
X196879415Y-70490162D01*
X197010611Y-70577824D01*
X197122176Y-70689389D01*
X197209838Y-70820585D01*
X197270219Y-70966357D01*
X197301000Y-71121107D01*
X197301000Y-71278893D01*
X197270219Y-71433643D01*
X197209838Y-71579415D01*
X197122176Y-71710611D01*
X197010611Y-71822176D01*
X196879415Y-71909838D01*
X196733643Y-71970219D01*
X196578893Y-72001000D01*
X196421107Y-72001000D01*
X196266357Y-71970219D01*
X196120585Y-71909838D01*
X195989389Y-71822176D01*
X195877824Y-71710611D01*
X195790162Y-71579415D01*
X195729781Y-71433643D01*
X195699000Y-71278893D01*
X195699000Y-71121107D01*
X195729781Y-70966357D01*
X195790162Y-70820585D01*
X195877824Y-70689389D01*
X195989389Y-70577824D01*
X196120585Y-70490162D01*
X196266357Y-70429781D01*
X196421107Y-70399000D01*
X196578893Y-70399000D01*
X196733643Y-70429781D01*
X196733643Y-70429781D01*
G37*
G36*
X194733643Y-70429781D02*
X194879415Y-70490162D01*
X195010611Y-70577824D01*
X195122176Y-70689389D01*
X195209838Y-70820585D01*
X195270219Y-70966357D01*
X195301000Y-71121107D01*
X195301000Y-71278893D01*
X195270219Y-71433643D01*
X195209838Y-71579415D01*
X195122176Y-71710611D01*
X195010611Y-71822176D01*
X194879415Y-71909838D01*
X194733643Y-71970219D01*
X194578893Y-72001000D01*
X194421107Y-72001000D01*
X194266357Y-71970219D01*
X194120585Y-71909838D01*
X193989389Y-71822176D01*
X193877824Y-71710611D01*
X193790162Y-71579415D01*
X193729781Y-71433643D01*
X193699000Y-71278893D01*
X193699000Y-71121107D01*
X193729781Y-70966357D01*
X193790162Y-70820585D01*
X193877824Y-70689389D01*
X193989389Y-70577824D01*
X194120585Y-70490162D01*
X194266357Y-70429781D01*
X194421107Y-70399000D01*
X194578893Y-70399000D01*
X194733643Y-70429781D01*
X194733643Y-70429781D01*
G37*
G36*
X192733643Y-70429781D02*
X192879415Y-70490162D01*
X193010611Y-70577824D01*
X193122176Y-70689389D01*
X193209838Y-70820585D01*
X193270219Y-70966357D01*
X193301000Y-71121107D01*
X193301000Y-71278893D01*
X193270219Y-71433643D01*
X193209838Y-71579415D01*
X193122176Y-71710611D01*
X193010611Y-71822176D01*
X192879415Y-71909838D01*
X192733643Y-71970219D01*
X192578893Y-72001000D01*
X192421107Y-72001000D01*
X192266357Y-71970219D01*
X192120585Y-71909838D01*
X191989389Y-71822176D01*
X191877824Y-71710611D01*
X191790162Y-71579415D01*
X191729781Y-71433643D01*
X191699000Y-71278893D01*
X191699000Y-71121107D01*
X191729781Y-70966357D01*
X191790162Y-70820585D01*
X191877824Y-70689389D01*
X191989389Y-70577824D01*
X192120585Y-70490162D01*
X192266357Y-70429781D01*
X192421107Y-70399000D01*
X192578893Y-70399000D01*
X192733643Y-70429781D01*
X192733643Y-70429781D01*
G37*
G36*
X190733643Y-70429781D02*
X190879415Y-70490162D01*
X191010611Y-70577824D01*
X191122176Y-70689389D01*
X191209838Y-70820585D01*
X191270219Y-70966357D01*
X191301000Y-71121107D01*
X191301000Y-71278893D01*
X191270219Y-71433643D01*
X191209838Y-71579415D01*
X191122176Y-71710611D01*
X191010611Y-71822176D01*
X190879415Y-71909838D01*
X190733643Y-71970219D01*
X190578893Y-72001000D01*
X190421107Y-72001000D01*
X190266357Y-71970219D01*
X190120585Y-71909838D01*
X189989389Y-71822176D01*
X189877824Y-71710611D01*
X189790162Y-71579415D01*
X189729781Y-71433643D01*
X189699000Y-71278893D01*
X189699000Y-71121107D01*
X189729781Y-70966357D01*
X189790162Y-70820585D01*
X189877824Y-70689389D01*
X189989389Y-70577824D01*
X190120585Y-70490162D01*
X190266357Y-70429781D01*
X190421107Y-70399000D01*
X190578893Y-70399000D01*
X190733643Y-70429781D01*
X190733643Y-70429781D01*
G37*
G36*
X188733643Y-70429781D02*
X188879415Y-70490162D01*
X189010611Y-70577824D01*
X189122176Y-70689389D01*
X189209838Y-70820585D01*
X189270219Y-70966357D01*
X189301000Y-71121107D01*
X189301000Y-71278893D01*
X189270219Y-71433643D01*
X189209838Y-71579415D01*
X189122176Y-71710611D01*
X189010611Y-71822176D01*
X188879415Y-71909838D01*
X188733643Y-71970219D01*
X188578893Y-72001000D01*
X188421107Y-72001000D01*
X188266357Y-71970219D01*
X188120585Y-71909838D01*
X187989389Y-71822176D01*
X187877824Y-71710611D01*
X187790162Y-71579415D01*
X187729781Y-71433643D01*
X187699000Y-71278893D01*
X187699000Y-71121107D01*
X187729781Y-70966357D01*
X187790162Y-70820585D01*
X187877824Y-70689389D01*
X187989389Y-70577824D01*
X188120585Y-70490162D01*
X188266357Y-70429781D01*
X188421107Y-70399000D01*
X188578893Y-70399000D01*
X188733643Y-70429781D01*
X188733643Y-70429781D01*
G37*
G36*
X186733643Y-70429781D02*
X186879415Y-70490162D01*
X187010611Y-70577824D01*
X187122176Y-70689389D01*
X187209838Y-70820585D01*
X187270219Y-70966357D01*
X187301000Y-71121107D01*
X187301000Y-71278893D01*
X187270219Y-71433643D01*
X187209838Y-71579415D01*
X187122176Y-71710611D01*
X187010611Y-71822176D01*
X186879415Y-71909838D01*
X186733643Y-71970219D01*
X186578893Y-72001000D01*
X186421107Y-72001000D01*
X186266357Y-71970219D01*
X186120585Y-71909838D01*
X185989389Y-71822176D01*
X185877824Y-71710611D01*
X185790162Y-71579415D01*
X185729781Y-71433643D01*
X185699000Y-71278893D01*
X185699000Y-71121107D01*
X185729781Y-70966357D01*
X185790162Y-70820585D01*
X185877824Y-70689389D01*
X185989389Y-70577824D01*
X186120585Y-70490162D01*
X186266357Y-70429781D01*
X186421107Y-70399000D01*
X186578893Y-70399000D01*
X186733643Y-70429781D01*
X186733643Y-70429781D01*
G37*
M02*
