(export (version D)
  (design
    (source /home/cameron/Desktop/MT4TB/hardware/radio-subboard/radio-subboard.sch)
    (date "Tue 22 Jan 2019 02:12:29 PM EST")
    (tool "Eeschema 5.0.2-2.fc30")
    (sheet (number 1) (name /) (tstamps /)
      (title_block
        (title "400001-Node Radio Subboard")
        (company HMS)
        (rev A)
        (date 2019-01-18)
        (source radio-subboard.sch)
        (comment (number 1) (value "Drawn: C. Swinoga"))
        (comment (number 2) (value "Check: C. Swinoga"))
        (comment (number 3) (value ""))
        (comment (number 4) (value "")))))
  (components
    (comp (ref U1)
      (value RFM95)
      (footprint capstone_footprints:RFM9X_THT)
      (fields
        (field (name PN) 109990166))
      (libsource (lib RF_AM_FM) (part RFM95W-915S2) (description "Low power long range transceiver module, SPI and parallel interface, 915 MHz, spreading factor 6 to12, bandwith 7.8 to 500kHz, -111 to -148 dBm, SMD-16, DIP-16"))
      (sheetpath (names /) (tstamps /))
      (tstamp 5C1D66B5))
    (comp (ref AE1)
      (value Antenna_Dipole)
      (footprint capstone_footprints:dipole-holddown)
      (datasheet ~)
      (libsource (lib Device) (part Antenna_Dipole) (description "Dipole antenna"))
      (sheetpath (names /) (tstamps /))
      (tstamp 5C1D6858))
    (comp (ref C2)
      (value 7.2p)
      (footprint Capacitor_SMD:C_0603_1608Metric)
      (datasheet ~)
      (fields
        (field (name PN) CBR06C729B5GAC))
      (libsource (lib Device) (part C) (description "Unpolarized capacitor"))
      (sheetpath (names /) (tstamps /))
      (tstamp 5C1D68BC))
    (comp (ref L1)
      (value 6.8n)
      (footprint Inductor_SMD:L_0603_1608Metric)
      (datasheet ~)
      (fields
        (field (name PN) LQW18AN6N8C00D))
      (libsource (lib Device) (part L) (description Inductor))
      (sheetpath (names /) (tstamps /))
      (tstamp 5C1D691D))
    (comp (ref C3)
      (value 8p)
      (footprint Capacitor_SMD:C_0603_1608Metric)
      (datasheet ~)
      (fields
        (field (name PN) "CBR06C809BAGAC "))
      (libsource (lib Device) (part C) (description "Unpolarized capacitor"))
      (sheetpath (names /) (tstamps /))
      (tstamp 5C1D6959))
    (comp (ref C1)
      (value 10u)
      (footprint Capacitor_SMD:C_0603_1608Metric_Pad1.05x0.95mm_HandSolder)
      (datasheet ~)
      (libsource (lib Device) (part C) (description "Unpolarized capacitor"))
      (sheetpath (names /) (tstamps /))
      (tstamp 5C1D6A11))
    (comp (ref T1)
      (value CX2024NL)
      (footprint capstone_footprints:CX2024NL)
      (datasheet ~)
      (fields
        (field (name PN) CX2024NL))
      (libsource (lib Device) (part Transformer_1P_1S) (description "Transformer, single primary, single secondary"))
      (sheetpath (names /) (tstamps /))
      (tstamp 5C1D7F71))
    (comp (ref J1)
      (value Conn_02x07_Odd_Even)
      (footprint capstone_footprints:MOLEX_878331420)
      (datasheet ~)
      (fields
        (field (name PN) 878331420))
      (libsource (lib Connector_Generic) (part Conn_02x07_Odd_Even) (description "Generic connector, double row, 02x07, odd/even pin numbering scheme (row 1 odd numbers, row 2 even numbers), script generated (kicad-library-utils/schlib/autogen/connector/)"))
      (sheetpath (names /) (tstamps /))
      (tstamp 5C27ECB8)))
  (libparts
    (libpart (lib Connector_Generic) (part Conn_02x07_Odd_Even)
      (description "Generic connector, double row, 02x07, odd/even pin numbering scheme (row 1 odd numbers, row 2 even numbers), script generated (kicad-library-utils/schlib/autogen/connector/)")
      (docs ~)
      (footprints
        (fp Connector*:*_2x??_*))
      (fields
        (field (name Reference) J)
        (field (name Value) Conn_02x07_Odd_Even))
      (pins
        (pin (num 1) (name Pin_1) (type passive))
        (pin (num 2) (name Pin_2) (type passive))
        (pin (num 3) (name Pin_3) (type passive))
        (pin (num 4) (name Pin_4) (type passive))
        (pin (num 5) (name Pin_5) (type passive))
        (pin (num 6) (name Pin_6) (type passive))
        (pin (num 7) (name Pin_7) (type passive))
        (pin (num 8) (name Pin_8) (type passive))
        (pin (num 9) (name Pin_9) (type passive))
        (pin (num 10) (name Pin_10) (type passive))
        (pin (num 11) (name Pin_11) (type passive))
        (pin (num 12) (name Pin_12) (type passive))
        (pin (num 13) (name Pin_13) (type passive))
        (pin (num 14) (name Pin_14) (type passive))))
    (libpart (lib Device) (part Antenna_Dipole)
      (description "Dipole antenna")
      (docs ~)
      (fields
        (field (name Reference) AE)
        (field (name Value) Antenna_Dipole))
      (pins
        (pin (num 1) (name ~) (type input))
        (pin (num 2) (name ~) (type input))))
    (libpart (lib Device) (part C)
      (description "Unpolarized capacitor")
      (docs ~)
      (footprints
        (fp C_*))
      (fields
        (field (name Reference) C)
        (field (name Value) C))
      (pins
        (pin (num 1) (name ~) (type passive))
        (pin (num 2) (name ~) (type passive))))
    (libpart (lib Device) (part L)
      (description Inductor)
      (docs ~)
      (footprints
        (fp Choke_*)
        (fp *Coil*)
        (fp Inductor_*)
        (fp L_*))
      (fields
        (field (name Reference) L)
        (field (name Value) L))
      (pins
        (pin (num 1) (name 1) (type passive))
        (pin (num 2) (name 2) (type passive))))
    (libpart (lib Device) (part Transformer_1P_1S)
      (description "Transformer, single primary, single secondary")
      (docs ~)
      (fields
        (field (name Reference) T)
        (field (name Value) Transformer_1P_1S))
      (pins
        (pin (num 1) (name AA) (type passive))
        (pin (num 2) (name AB) (type passive))
        (pin (num 3) (name SA) (type passive))
        (pin (num 4) (name SB) (type passive))))
    (libpart (lib RF_AM_FM) (part RFM95W-868S2)
      (aliases
        (alias RFM95W-915S2)
        (alias RFM96W-315S2)
        (alias RFM96W-433S2)
        (alias RFM97W-868S2)
        (alias RFM97W-915S2)
        (alias RFM98W-315S2)
        (alias RFM98W-433S2)
        (alias RFM69HCW))
      (description "Low power long range transceiver module, SPI and parallel interface, 868 MHz, spreading factor 6 to12, bandwith 7.8 to 500kHz, -111 to -148 dBm, SMD-16, DIP-16")
      (docs http://www.hoperf.com/upload/rf/RFM95_96_97_98W.pdf)
      (footprints
        (fp HOPERF?RFM9XW*SMD*)
        (fp HOPERF?RFM9XW*THT*))
      (fields
        (field (name Reference) U)
        (field (name Value) RFM95W-868S2))
      (pins
        (pin (num 1) (name GND) (type power_in))
        (pin (num 2) (name MISO) (type output))
        (pin (num 3) (name MOSI) (type input))
        (pin (num 4) (name SCK) (type input))
        (pin (num 5) (name NSS) (type input))
        (pin (num 6) (name RESET) (type BiDi))
        (pin (num 7) (name DIO5) (type BiDi))
        (pin (num 8) (name GND) (type power_in))
        (pin (num 9) (name ANT) (type BiDi))
        (pin (num 10) (name GND) (type power_in))
        (pin (num 11) (name DIO3) (type BiDi))
        (pin (num 12) (name DIO4) (type BiDi))
        (pin (num 13) (name 3.3V) (type power_in))
        (pin (num 14) (name DIO0) (type BiDi))
        (pin (num 15) (name DIO1) (type BiDi))
        (pin (num 16) (name DIO2) (type BiDi)))))
  (libraries
    (library (logical Connector_Generic)
      (uri /usr/share/kicad/library/Connector_Generic.lib))
    (library (logical Device)
      (uri /usr/share/kicad/library/Device.lib))
    (library (logical RF_AM_FM)
      (uri /usr/share/kicad/library/RF_AM_FM.lib)))
  (nets
    (net (code 1) (name "Net-(C3-Pad1)")
      (node (ref C3) (pin 1))
      (node (ref L1) (pin 2))
      (node (ref T1) (pin 4)))
    (net (code 2) (name GND)
      (node (ref C1) (pin 2))
      (node (ref T1) (pin 2))
      (node (ref U1) (pin 8))
      (node (ref U1) (pin 10))
      (node (ref U1) (pin 1))
      (node (ref J1) (pin 3))
      (node (ref J1) (pin 2)))
    (net (code 3) (name 3V3)
      (node (ref C1) (pin 1))
      (node (ref U1) (pin 13))
      (node (ref J1) (pin 1)))
    (net (code 4) (name /Ant_Unbal)
      (node (ref T1) (pin 1))
      (node (ref U1) (pin 9)))
    (net (code 5) (name /Ant_N)
      (node (ref C3) (pin 2))
      (node (ref C2) (pin 2))
      (node (ref AE1) (pin 2))
      (node (ref T1) (pin 3)))
    (net (code 6) (name /DIO0_3V3)
      (node (ref U1) (pin 14))
      (node (ref J1) (pin 8)))
    (net (code 7) (name /SCLK_3V3)
      (node (ref U1) (pin 4))
      (node (ref J1) (pin 9)))
    (net (code 8) (name /MOSI_3V3)
      (node (ref J1) (pin 7))
      (node (ref U1) (pin 3)))
    (net (code 9) (name /Ant_P)
      (node (ref AE1) (pin 1))
      (node (ref L1) (pin 1))
      (node (ref C2) (pin 1)))
    (net (code 10) (name /DIO4_3V3)
      (node (ref U1) (pin 12))
      (node (ref J1) (pin 6)))
    (net (code 11) (name /MISO_3V3)
      (node (ref U1) (pin 2))
      (node (ref J1) (pin 5)))
    (net (code 12) (name /DIO3_3V3)
      (node (ref J1) (pin 4))
      (node (ref U1) (pin 11)))
    (net (code 13) (name /DIO5_3V3)
      (node (ref J1) (pin 14))
      (node (ref U1) (pin 7)))
    (net (code 14) (name /RST_3V3)
      (node (ref J1) (pin 13))
      (node (ref U1) (pin 6)))
    (net (code 15) (name /DIO2_3V3)
      (node (ref J1) (pin 12))
      (node (ref U1) (pin 16)))
    (net (code 16) (name /CS_3V3)
      (node (ref J1) (pin 11))
      (node (ref U1) (pin 5)))
    (net (code 17) (name /DIO1_3V3)
      (node (ref J1) (pin 10))
      (node (ref U1) (pin 15)))))