gameweek,minutes,G,A,xG,xA,bonus,points,price,available
2020/21,3330.0,3.0,7.0,2.166595253162086,3.5017576599493623,2.0,114.0,,0.0
1,90.0,1.0,0.0,0.0847328156232833,0.0,0.0,7.0,6.0,1.0
2,90.0,0.0,0.0,0.0216920897364616,0.0801973342895507,0.0,3.0,6.0,1.0
3,0.0,0.0,0.0,0.0,0.0,0.0,0.0,6.0,1.0
4,90.0,0.0,0.0,0.0182618014514446,0.6872077584266663,0.0,1.0,5.9,1.0
5,39.0,0.0,0.0,0.0710543319582939,0.0,0.0,1.0,5.9,1.0
6,90.0,0.0,0.0,0.0,0.0,0.0,2.0,5.8,1.0
7,90.0,0.0,0.0,0.0736505687236785,0.0471701472997665,0.0,2.0,5.8,1.0
8,90.0,1.0,1.0,0.0358469486236572,0.6257299184799194,3.0,13.0,5.8,1.0
9,90.0,0.0,0.0,0.0227327030152082,0.0,0.0,1.0,5.8,1.0
10,90.0,0.0,0.0,0.1093651726841926,0.0707333385944366,0.0,1.0,5.8,1.0
11,90.0,0.0,0.0,0.0231563299894332,0.0481517538428306,0.0,2.0,5.8,1.0
12,90.0,0.0,0.0,0.0,0.0447916314005851,0.0,3.0,5.8,1.0
13,90.0,1.0,0.0,0.1502623111009597,0.0147986803203821,3.0,10.0,5.8,1.0
14,90.0,0.0,0.0,0.0,0.0152208814397454,0.0,2.0,5.8,1.0
15,90.0,0.0,1.0,0.0,0.8511002063751221,2.0,7.0,5.8,1.0
16,90.0,0.0,0.0,0.0,0.0,0.0,2.0,5.8,1.0
17,90.0,0.0,0.0,0.0111018512398004,0.2348030805587768,0.0,3.0,5.9,1.0
18,,,,,,,,,
19,0.0,0.0,0.0,0.0,0.0,0.0,0.0,5.9,1.0
20,,,,,,,,,
21,,,,,,,,,
22,,,,,,,,,
23,,,,,,,,,
24,,,,,,,,,
25,,,,,,,,,
26,,,,,,,,,
27,,,,,,,,,
28,,,,,,,,,
29,,,,,,,,,
30,,,,,,,,,
31,,,,,,,,,
32,,,,,,,,,
33,,,,,,,,,
34,,,,,,,,,
35,,,,,,,,,
36,,,,,,,,,
37,,,,,,,,,
38,,,,,,,,,
total,1389.0,3.0,2.0,0.6218569241464136,2.719904731027782,8.0,60.0,93.5,0.0
