gameweek,minutes,G,A,xG,xA,bonus,points,price,available
2020/21,613.0,0.0,2.0,1.6745913289487362,1.3262444715946913,0.0,30.0,,0.0
1,90.0,0.0,0.0,0.0,0.0,0.0,3.0,6.5,1.0
2,90.0,1.0,0.0,0.7611688375473022,0.0,1.0,9.0,6.5,1.0
3,90.0,0.0,0.0,0.1751084178686142,0.0,0.0,2.0,6.5,1.0
4,90.0,0.0,0.0,0.0,0.0,0.0,2.0,6.5,1.0
5,90.0,0.0,0.0,0.0,0.0,0.0,2.0,6.5,1.0
6,48.0,0.0,0.0,0.0,0.0,0.0,1.0,6.5,1.0
7,0.0,0.0,0.0,0.0,0.0,0.0,0.0,6.5,1.0
8,0.0,0.0,0.0,0.0,0.0,0.0,0.0,6.5,1.0
9,0.0,0.0,0.0,0.0,0.0,0.0,0.0,6.4,1.0
10,16.0,0.0,0.0,0.0,0.0,0.0,1.0,6.4,1.0
11,0.0,0.0,0.0,0.0,0.0,0.0,0.0,6.4,1.0
12,1.0,0.0,0.0,0.0,0.0,0.0,1.0,6.3,1.0
13,,,,,,,,,
14,0.0,0.0,0.0,0.0,0.0,0.0,0.0,6.3,1.0
15,0.0,0.0,0.0,0.0,0.0,0.0,0.0,6.3,1.0
16,,,,,,,,,
17,,,,,,,,,
18,84.0,0.0,0.0,0.4649996161460876,0.4709970951080322,0.0,2.0,6.2,1.0
19,0.0,0.0,0.0,0.0,0.0,0.0,0.0,6.2,1.0
20,,,,,,,,,
21,,,,,,,,,
22,,,,,,,,,
23,,,,,,,,,
24,,,,,,,,,
25,,,,,,,,,
26,,,,,,,,,
27,,,,,,,,,
28,,,,,,,,,
29,,,,,,,,,
30,,,,,,,,,
31,,,,,,,,,
32,,,,,,,,,
33,,,,,,,,,
34,,,,,,,,,
35,,,,,,,,,
36,,,,,,,,,
37,,,,,,,,,
38,,,,,,,,,
total,599.0,1.0,0.0,1.401276871562004,0.4709970951080322,1.0,23.0,57.900000000000006,0.0
