gameweek,minutes,G,A,xG,xA,bonus,points,price,available
2020/21,1397.0,3.0,5.0,1.9466326590627432,2.0640352852642536,5.0,80.0,,0.0
1,90.0,0.0,0.0,0.1544882357120514,0.1074579283595085,0.0,2.0,6.5,1.0
2,72.0,0.0,0.0,0.0,0.0,0.0,3.0,6.5,1.0
3,21.0,0.0,0.0,0.0663247853517532,0.0,0.0,1.0,6.5,1.0
4,90.0,0.0,0.0,0.0775645673274993,0.0,0.0,1.0,6.5,1.0
5,0.0,0.0,0.0,0.0,0.0,0.0,0.0,6.4,0.0
6,90.0,0.0,0.0,0.0493596121668815,0.015911940485239,0.0,2.0,6.4,1.0
7,90.0,0.0,0.0,0.1558369547128677,0.1449251621961593,0.0,2.0,6.4,1.0
8,90.0,0.0,0.0,0.1659405678510666,0.0212621204555034,0.0,2.0,6.4,1.0
9,90.0,0.0,0.0,0.1336326599121093,0.0,0.0,2.0,6.4,1.0
10,55.0,0.0,0.0,0.0,0.4073198735713959,0.0,1.0,6.4,1.0
11,72.0,0.0,0.0,0.1662612110376358,0.0887078493833541,0.0,3.0,6.4,1.0
12,90.0,0.0,1.0,0.0261756051331758,0.6874712109565735,0.0,5.0,6.4,1.0
13,,,,,,,,,
14,79.0,0.0,0.0,0.0838159397244453,0.0,0.0,3.0,6.4,1.0
15,83.0,1.0,0.0,0.1475123167037964,0.1425951719284057,1.0,9.0,6.4,1.0
16,,,,,,,,,
17,,,,,,,,,
18,6.0,0.0,0.0,0.0,0.0,0.0,1.0,6.4,1.0
19,90.0,1.0,2.0,1.3503284454345703,0.9867312908172607,3.0,17.0,6.5,1.0
20,,,,,,,,,
21,,,,,,,,,
22,,,,,,,,,
23,,,,,,,,,
24,,,,,,,,,
25,,,,,,,,,
26,,,,,,,,,
27,,,,,,,,,
28,,,,,,,,,
29,,,,,,,,,
30,,,,,,,,,
31,,,,,,,,,
32,,,,,,,,,
33,,,,,,,,,
34,,,,,,,,,
35,,,,,,,,,
36,,,,,,,,,
37,,,,,,,,,
38,,,,,,,,,
total,1108.0,2.0,3.0,2.577240901067853,2.6023825481534004,4.0,54.0,96.50000000000003,0.0
