gameweek,minutes,saves,bonus,points,price,available
2020/21,0.0,0.0,0.0,0.0,0.0,0.0
1,0.0,0.0,0.0,0.0,0.0,0.0
2,0.0,0.0,0.0,0.0,4.5,1.0
3,0.0,0.0,0.0,0.0,4.5,1.0
4,0.0,0.0,0.0,0.0,4.5,1.0
5,0.0,0.0,0.0,0.0,4.5,1.0
6,0.0,0.0,0.0,0.0,4.5,1.0
7,0.0,0.0,0.0,0.0,4.5,1.0
8,0.0,0.0,0.0,0.0,4.5,1.0
9,0.0,0.0,0.0,0.0,4.5,1.0
10,90.0,2.0,0.0,1.0,4.5,1.0
11,90.0,4.0,0.0,2.0,4.5,1.0
12,90.0,6.0,0.0,3.0,4.5,1.0
13,90.0,5.0,2.0,9.0,4.5,1.0
14,90.0,5.0,0.0,2.0,4.5,1.0
15,90.0,4.0,0.0,2.0,4.5,1.0
16,90.0,1.0,0.0,2.0,4.5,1.0
17,,,,,,
18,,,,,,
19,90.0,3.0,0.0,2.0,4.5,1.0
20,,,,,,
21,,,,,,
22,,,,,,
23,,,,,,
24,,,,,,
25,,,,,,
26,,,,,,
27,,,,,,
28,,,,,,
29,,,,,,
30,,,,,,
31,,,,,,
32,,,,,,
33,,,,,,
34,,,,,,
35,,,,,,
36,,,,,,
37,,,,,,
38,,,,,,
total,720.0,30.0,2.0,23.0,36.0,0.0
