index,fantasy_id,understat_id,first_name,second_name,web_name,understat_name,team_id,position,price,chance_of_playing,predicted_points_next_game,predicted_points_next_5,pppm_next_5,rating_next_5
0,1,181.0,Bernd,Leno,Leno,Bernd Leno,1,1,4.5,100,,,,
1,2,6875.0,Rúnar Alex,Rúnarsson,Rúnarsson,Rúnar Alex Rúnarsson,1,1,4.0,0,,,,
2,3,700.0,Willian,Borges Da Silva,Willian,Willian,1,3,6.3,0,0.0,0.0,0.0,0.0
3,4,318.0,Pierre-Emerick,Aubameyang,Aubameyang,Pierre-Emerick Aubameyang,1,4,9.6,100,3.556171905942745,17.292596655613362,1.801312151626392,0.2726446559271838
4,5,847.0,Cédric,Soares,Cédric,Cédric Soares,1,2,4.2,25,0.0874707666265111,0.4335092768439021,0.1032164944866433,0.0005510368217149074
5,6,3277.0,Alexandre,Lacazette,Lacazette,Alexandre Lacazette,1,4,8.5,100,2.2852274491126594,11.114727262180152,1.3076149720211945,0.12721153521028947
6,7,204.0,Granit,Xhaka,Xhaka,Granit Xhaka,1,3,4.8,100,2.140147800935275,10.566251172465336,2.201302327596945,0.16044720128627638
7,8,8380.0,Pablo,Marí,Marí,Pablo Marí,1,2,4.2,100,0.267716414739263,1.332174299640385,0.3171843570572344,0.005203624278949906
8,9,492.0,Héctor,Bellerín,Bellerín,Héctor Bellerín,1,2,4.8,0,0.0,0.0,0.0,0.0
9,10,508.0,Calum,Chambers,Chambers,Calum Chambers,1,2,4.2,25,0.0799959472931196,0.3956202895773311,0.0941953070422216,0.0004589241818933063
10,11,342.0,Sead,Kolasinac,Kolasinac,Sead Kolasinac,1,2,4.3,0,0.0,0.0,0.0,0.0
11,12,496.0,Mohamed Naser,El Sayed Elneny,Elneny,Mohamed Elneny,1,3,4.4,100,0.2175344032683133,1.0827667937413132,0.2460833622139348,0.0018380135270440307
12,13,1750.0,Ainsley,Maitland-Niles,Maitland-Niles,Ainsley Maitland-Niles,1,3,5.2,25,0.0969586116551765,0.4810936240218285,0.0925180046195824,0.00030703464420662763
13,14,1749.0,Rob,Holding,Holding,Rob Holding,1,2,4.1,100,0.4693705308528808,2.3265696220729364,0.567456005383643,0.01625853347522789
14,15,2328.0,Thomas,Partey,Partey,Thomas Partey,1,3,5.0,100,2.289492140978798,11.283039545138852,2.25660790902777,0.17563608148446652
15,16,8089.0,Kieran,Tierney,Tierney,Kieran Tierney,1,2,4.9,100,2.288585501128236,11.360344147323456,2.3184375810864197,0.3243545658247136
16,17,5656.0,Nicolas,Pépé,Pépé,Nicolas Pepe,1,3,6.9,100,1.2936119494433016,6.289666876902035,0.9115459241887006,0.03954920162310822
17,18,1227.0,Lucas,Torreira,Torreira,Lucas Torreira,1,3,4.5,0,0.0,0.0,0.0,0.0
18,20,6482.0,Edward,Nketiah,Nketiah,Eddie Nketiah,1,4,5.4,100,0.1124405960159552,0.5482920047692307,0.1015355564387464,0.0004872791906894784
19,21,7230.0,Emile,Smith Rowe,Smith Rowe,Emile Smith-Rowe,1,3,6.1,100,3.1509679646711466,15.384739687400565,2.522088473344355,0.2676590872511932
20,22,7322.0,Bukayo,Saka,Saka,Bukayo Saka,1,3,6.3,100,3.954871495097961,19.2310635261161,3.0525497660501744,0.40494643368476135
21,23,5613.0,Gabriel,Magalhães,Gabriel,Gabriel,1,2,5.3,100,2.792394386186486,13.83467166999649,2.6103154094333,0.44472850204593584
22,24,,Konstantinos,Mavropanos,Mavropanos,,1,2,4.5,0,0.0,0.0,0.0,0.0
23,25,5759.0,Mattéo,Guendouzi,Guendouzi,Matteo Guendouzi,1,3,4.5,0,0.0,0.0,0.0,0.0
24,26,7752.0,Gabriel Teodoro,Martinelli Silva,Martinelli,Gabriel Martinelli,1,3,5.4,100,2.312569077682137,11.20192638491353,2.074430812021024,0.16029618700667578
25,27,6888.0,William,Saliba,Saliba,William Saliba,1,2,4.5,0,0.0,0.0,0.0,0.0
26,67,7298.0,Ben,White,White,Ben White,1,2,4.5,100,2.268852898071296,11.300892299460164,2.5113093998800364,0.34949911310827686
27,466,9691.0,Nuno,Varela Tavares,Tavares,Nuno Tavares,1,2,4.3,100,1.1108897792012558,5.473148240765138,1.2728251722709625,0.08579047780941047
28,478,9689.0,Albert,Sambi Lokonga,Sambi Lokonga,Albert Sambi Lokonga,1,3,4.8,100,1.217378725538125,6.029160567426671,1.2560751182138898,0.052240098337591336
29,530,9690.0,Folarin,Balogun,Balogun,Folarin Balogun,1,4,4.7,100,0.0864601220477985,0.4307173073850491,0.0916419802946913,0.0003454892888158262
30,531,6492.0,Reiss,Nelson,Nelson,Reiss Nelson,1,3,5.0,0,0.0,0.0,0.0,0.0
31,532,,Karl,Hein,Hein,,1,1,4.0,100,,,,
32,558,2517.0,Martin,Ødegaard,Ødegaard,Martin Odegaard,1,3,5.6,100,2.6907434617490424,13.199636028625806,2.3570778622546085,0.214618624928237
33,559,5603.0,Aaron,Ramsdale,Ramsdale,Aaron Ramsdale,1,1,5.2,100,,,,
34,572,,Arthur,Okonkwo,Okonkwo,,1,1,4.0,100,,,,
35,590,7931.0,Takehiro,Tomiyasu,Tomiyasu,Takehiro Tomiyasu,1,2,4.8,25,0.5959306104366587,2.9613913170959107,0.6169565243949814,0.022500049822581625
36,664,,Charlie,Patino,Patino,,1,3,4.5,100,0.0,0.0,0.0,0.0
37,28,4475.0,Jed,Steer,Steer,Jed Steer,2,1,4.0,100,,,,
38,29,7721.0,Conor,Hourihane,Hourihane,Conor Hourihane,2,3,4.9,0,0.0,0.0,0.0,0.0
39,30,4401.0,Emiliano,Martínez,Martínez,Emiliano Martinez,2,1,5.5,100,,,,
40,31,7152.0,Björn,Engels,Engels,Björn Engels,2,2,4.5,0,0.0,0.0,0.0,0.0
41,32,695.0,Bertrand,Traoré,Traoré,Bertrand Traoré,2,3,5.7,100,0.3261899103335841,1.5514608507777234,0.2721861141715304,0.0029129854118414736
42,34,3696.0,Morgan,Sanson,Sanson,Morgan Sanson,2,3,5.0,100,0.306346690445064,1.5206189833725776,0.3041237966745155,0.0031900855839677045
43,35,7723.0,John,McGinn,McGinn,John McGinn,2,3,5.9,100,2.9205523988279443,14.216437738293854,2.4095657183548904,0.23629856601994417
44,36,6859.0,Kortney,Hause,Hause,Kortney Hause,2,2,4.4,100,0.5816844709245337,2.829513621181073,0.6430712775411529,0.022408047747219616
45,37,7722.0,Mahmoud Ahmed,Ibrahim Hassan,Trézéguet,Trézéguet,2,3,5.4,100,0.0,0.0,0.0,0.0
46,38,1024.0,Tyrone,Mings,Mings,Tyrone Mings,2,2,5.0,0,0.0,0.0,0.0,0.0
47,39,884.0,Matt,Targett,Targett,Matt Targett,2,2,4.7,100,2.566413684581733,12.455085892843789,2.6500182750731462,0.4064702041220556
48,40,8865.0,Ollie,Watkins,Watkins,Ollie Watkins,2,4,7.9,100,4.416456828056966,21.085094792544503,2.6689993408284183,0.4925743844767704
49,41,8040.0,Marvelous,Nakamba,Nakamba,Marvelous Nakamba,2,3,4.5,0,0.0,0.0,0.0,0.0
50,42,5612.0,Anwar,El Ghazi,El Ghazi,Anwar El Ghazi,2,3,5.6,100,1.2487095462386992,5.918673431338283,1.0569059698818364,0.04315113784507086
51,43,2203.0,Emiliano,Buendía Stati,Buendía,Emiliano Buendía,2,3,6.2,100,2.205441397006593,10.652973218693672,1.718221486886076,0.12626456997385926
52,44,8864.0,Matthew,Cash,Cash,Matthew Cash,2,2,5.0,100,2.9184718348368346,14.204584751891304,2.840916950378261,0.4969585880573488
53,45,7726.0,Ezri,Konsa Ngoyo,Konsa,Ezri Konsa Ngoyo,2,2,4.9,100,2.4701152981428662,12.116398184395091,2.472734323345937,0.36896410222232473
54,46,3253.0,Frédéric,Guilbert,Guilbert,Frederic Guilbert,2,2,4.5,0,0.0,0.0,0.0,0.0
55,47,7724.0,Wesley,Moraes,Wesley,Wesley,2,4,5.4,0,0.0,0.0,0.0,0.0
56,48,8287.0,Mbwana Ally,Samatta,Samatta,Mbwana Samatta,2,4,5.5,0,0.0,0.0,0.0,0.0
57,49,1053.0,Keinan,Davis,Davis,Keinan Davis,2,4,4.5,100,0.06815775715795,0.3202976442382124,0.0711772542751583,0.00019954588402619952
58,50,6122.0,Douglas Luiz,Soares de Paulo,Douglas Luiz,Douglas Luiz,2,3,4.5,100,2.20244596711548,10.795225007735835,2.398938890607964,0.17864152068954173
59,51,8941.0,Jacob,Ramsey,Ramsey,Jacob Ramsey,2,3,4.6,100,1.954581597701725,9.469553952546184,2.058598685336127,0.13447227022309707
60,52,631.0,Ashley,Young,Young,Ashley Young,2,2,4.7,50,0.5873248759254391,2.883355536826942,0.6134799014525408,0.02178370043301721
61,283,934.0,Axel,Tuanzebe,Tuanzebe,Axel Tuanzebe,2,2,4.4,100,0.6657089570460352,3.3083565698188613,0.7518992204133775,0.030634095742916492
62,337,986.0,Danny,Ings,Ings,Danny Ings,2,4,7.7,100,2.4532601083777963,11.876158921251267,1.5423583014612037,0.16032788915740928
63,492,5221.0,Leon,Bailey,Bailey,Leon Bailey,2,3,6.3,0,0.0,0.0,0.0,0.0
64,496,8941.0,Aaron,Ramsey,Ramsey,Jacob Ramsey,2,3,4.4,100,0.0,0.0,0.0,0.0
65,497,9415.0,Jaden,Philogene-Bidace,Philogene-Bidace,Jaden Philogene-Bidace,2,3,5.0,100,0.0014814814814814,0.0074074074074074,0.0014814814814814,7.569966920507321e-08
66,526,9356.0,Carney,Chukwuemeka,Chukwuemeka,Carney Chukwuemeka,2,3,4.5,100,0.3432813567940121,1.6165004276611712,0.359222317258038,0.004005628394369754
67,568,9912.0,Cameron,Archer,Archer,Cameron Archer,2,4,4.5,100,0.0282070658091305,0.1408174834213641,0.0312927740936364,3.856989375570128e-05
68,596,,Viljami,Sinisalo,Sinisalo,,2,1,4.0,100,,,,
69,610,,Lamare,Bogarde,Bogarde,,2,2,4.0,100,0.0,0.0,0.0,0.0
70,638,,Tim,Iroegbunam,Iroegbunam,,2,3,4.5,100,0.0,0.0,0.0,0.0
71,650,,Filip,Marschall,Marschall,,2,1,4.0,100,,,,
72,76,1801.0,Pontus,Jansson,Jansson,Pontus Jansson,3,2,4.6,100,2.845296232262775,15.219210694912878,3.3085240641114955,0.6200968811547697
73,77,7083.0,Christian,Nørgaard,Nørgaard,Christian Nørgaard,3,3,5.0,0,0.0,0.0,0.0,0.0
74,78,998.0,Ivan,Toney,Toney,Ivan Toney,3,4,6.6,100,3.524856220779779,19.729943493347758,2.989385377779963,0.5162446289975656
75,79,,Tariqe,Fosu-Henry,Fosu,,3,3,5.1,0,0.0,0.0,0.0,0.0
76,80,9676.0,David,Raya Martin,Raya,David Raya,3,1,4.3,0,,,,
77,81,1078.0,Sergi,Canós,Canós,Sergi Canos,3,3,5.5,100,2.608416087624516,14.169514434076955,2.576275351650356,0.2518133608602501
78,82,,Pelenda Joshua,Dasilva,Dasilva,,3,3,5.3,0,0.0,0.0,0.0,0.0
79,83,9679.0,Rico,Henry,Henry,Rico Henry,3,2,4.5,0,0.0,0.0,0.0,0.0
80,84,9680.0,Vitaly,Janelt,Janelt,Vitaly Janelt,3,3,5.0,0,0.0,0.0,0.0,0.0
81,85,7069.0,Saman,Ghoddos,Ghoddos,Saman Ghoddos,3,3,5.3,100,0.5220451925310623,2.910305440204673,0.5491142340008817,0.011023837320329037
82,86,7166.0,Mathias,Jensen,Jensen,Mathias Jensen,3,3,4.9,100,1.1124559305630075,5.839115895783333,1.1916563052619047,0.047998717518817305
83,87,9687.0,Charlie,Goode,Goode,Charlie Goode,3,2,3.9,0,0.0,0.0,0.0,0.0
84,88,9684.0,Marcus,Forss,Forss,Marcus Forss,3,4,5.3,100,0.2736634235814147,1.439464866825606,0.2715971446840766,0.003421953220891534
85,89,9685.0,Mads,Roerslev Rasmussen,Roerslev,Mads Roerslev,3,2,4.3,25,0.1227125506531532,0.6359572118397692,0.1478970260092486,0.0011582984028291263
86,90,9683.0,Mads,Bech Sørensen,Sørensen,Mads Bech Sørensen,3,2,4.3,100,0.3016051962475148,1.5112201172531283,0.3514465388960764,0.00654063805266317
87,91,9678.0,Ethan,Pinnock,Pinnock,Ethan Pinnock,3,2,4.5,100,2.6371687812066886,14.204994525546656,3.156665450121479,0.5522080677547037
88,92,,Ellery,Balcombe,Balcombe,,3,1,4.0,0,,,,
89,93,,Jan,Zamburek,Zamburek,,3,3,4.4,100,0.0,0.0,0.0,0.0
90,94,,Patrik,Gunnarsson,Gunnarsson,,3,1,3.9,0,,,,
91,95,,Halil,Dervişoğlu,Dervişoğlu,,3,4,5.4,0,0.0,0.0,0.0,0.0
92,96,6552.0,Bryan,Mbeumo,Mbeumo,Bryan Mbeumo,3,3,5.4,25,0.7442707724590214,4.247088971890905,0.786497957757575,0.02304201639910088
93,97,9682.0,Mads,Bidstrup,Bidstrup,Mads Bidstrup,3,3,4.4,100,0.0169934640522875,0.0849673202614379,0.0193107546048722,1.1318338791770453e-05
94,479,9681.0,Frank,Onyeka,Onyeka,Frank Onyeka,3,3,4.9,100,1.136187111999496,5.873896342124526,1.1987543555356177,0.04857222513683896
95,483,9677.0,Kristoffer,Ajer,Ajer,Kristoffer Ajer,3,2,4.4,0,0.0,0.0,0.0,0.0
96,498,9915.0,Dominic,Thompson,Thompson,Dominic Thompson,3,2,4.4,100,0.0924235549710226,0.4639490287263125,0.1054429610741619,0.0006024499643822953
97,499,9914.0,Shandon,Baptiste,Baptiste,Shandon Baptiste,3,3,4.9,100,1.326732477343194,6.909963537492741,1.4101966403046409,0.06721821173897659
98,524,5786.0,Yoane,Wissa,Wissa,Yoane Wissa,3,3,5.9,100,0.5022453990722164,2.6814327320278264,0.4544801240725129,0.008406463358436344
99,556,5191.0,Álvaro,Fernández,Fernández,Álvaro Fernández,3,1,4.5,100,,,,
100,569,,Finley,Stevens,Stevens,,3,2,4.0,100,0.0,0.0,0.0,0.0
101,594,6030.0,Mathias,Jorgensen,Zanka,Zanka,3,2,4.5,0,0.0,0.0,0.0,0.0
102,614,,Paris,Maghoma,Maghoma,,3,3,4.5,100,0.0,0.0,0.0,0.0
103,619,,Matthew,Cox,Cox,,3,1,4.0,100,,,,
104,628,,Maxwell,Haygarth,Haygarth,,3,3,4.5,100,0.0,0.0,0.0,0.0
105,640,,Nathan,Young-Coombes,Young-Coombes,,3,4,4.5,100,0.0,0.0,0.0,0.0
106,662,,Myles,Peart-Harris,Peart-Harris,,3,3,4.5,100,0.0,0.0,0.0,0.0
107,53,486.0,Adam,Lallana,Lallana,Adam Lallana,4,3,5.3,100,1.8170182526495875,9.509842981017115,1.7943099964183238,0.11770701490729657
108,54,7235.0,Jason,Steele,Steele,Jason Steele,4,1,4.0,100,,,,
109,55,239.0,Pascal,Groß,Groß,Pascal Groß,4,3,5.7,100,1.6204209129826674,8.892477816423398,1.5600838274427014,0.0956978648672407
110,56,6047.0,Shane,Duffy,Duffy,Shane Duffy,4,2,4.1,50,0.9545060938428536,4.928526274053631,1.2020795790374712,0.07295976312605519
111,57,6050.0,Davy,Pröpper,Pröpper,Davy Pröpper,4,3,4.5,0,0.0,0.0,0.0,0.0
112,58,7382.0,Dan,Burn,Burn,Dan Burn,4,2,4.4,100,1.292115123298201,6.806383352342246,1.5469053073505104,0.12966216094978628
113,59,6048.0,Lewis,Dunk,Dunk,Lewis Dunk,4,2,4.9,0,0.0,0.0,0.0,0.0
114,60,6049.0,Solomon,March,March,Solly March,4,3,5.3,100,1.2779476850325098,7.003313846737253,1.3213799710825007,0.06383558342629145
115,61,7699.0,Adam,Webster,Webster,Adam Webster,4,2,4.4,100,1.2870821628976183,6.496673257705899,1.4765166494786133,0.11813062271278116
116,62,8780.0,Joël,Veltman,Veltman,Joël Veltman,4,2,4.2,50,1.0016335590400682,5.112346709056097,1.2172254069181183,0.07663451754718714
117,63,3621.0,Neal,Maupay,Maupay,Neal Maupay,4,4,6.4,100,2.99539448604862,16.911761550397948,2.642462742249679,0.3911519667080353
118,64,7698.0,Leandro,Trossard,Trossard,Leandro Trossard,4,3,6.2,75,2.4014165729203523,13.327431078253678,2.149585657782852,0.19762083233066097
119,65,2385.0,Mathew,Ryan,Ryan,Mat Ryan,4,1,4.5,0,,,,
120,66,6842.0,Alireza,Jahanbakhsh,Jahanbakhsh,Alireza Jahanbakhsh,4,3,5.5,0,0.0,0.0,0.0,0.0
121,68,5245.0,Bernardo,Fernandes Da Silva Junior,Bernardo,Bernardo,4,2,4.0,0,0.0,0.0,0.0,0.0
122,69,9098.0,Robert,Sánchez,Sánchez,Robert Sánchez,4,1,4.6,100,,,,
123,70,5609.0,Yves,Bissouma,Bissouma,Yves Bissouma,4,3,4.4,100,1.8789576859184007,9.691932496522492,2.202711931027839,0.1472650224218948
124,71,8226.0,Tariq,Lamptey,Lamptey,Tariq Lamptey,4,2,4.5,100,1.3951174005735747,7.551979208388663,1.6782176018641473,0.156078174634877
125,72,7991.0,Aaron,Connolly,Connolly,Aaron Connolly,4,4,5.3,100,0.3875018766055866,2.241391535154549,0.4229040632367073,0.00829673816032907
126,73,8020.0,Steven,Alzate,Alzate,Steven Alzate,4,3,4.8,100,0.3551124893473094,1.8960134466147336,0.3950028013780695,0.005166222562206799
127,74,8379.0,Alexis,Mac Allister,Mac Allister,Alexis Mac Allister,4,3,5.3,100,0.9383709502660836,5.289483504334951,0.9980157555348964,0.036415157075798725
128,75,9284.0,Jakub,Moder,Moder,Jakub Moder,4,3,4.5,100,1.7361099742041826,9.703828250511307,2.156406277891401,0.1443461523129384
129,447,501.0,Danny,Welbeck,Welbeck,Danny Welbeck,4,4,5.9,100,2.5121220898720997,13.986022265896906,2.3705122484571026,0.29019118633396723
130,462,9734.0,Enock,Mwepu,Mwepu,Enock Mwepu,4,3,5.9,100,1.3722174719402866,7.705656435389815,1.3060434636253924,0.06942226749984372
131,476,,Kjell,Scherpen,Scherpen,,4,1,4.5,100,,,,
132,500,4068.0,Florin,Andone,Andone,Florin Andone,4,4,5.0,0,0.0,0.0,0.0,0.0
133,535,9099.0,Andi,Zeqiri,Zeqiri,Andi Zeqiri,4,4,4.5,0,0.0,0.0,0.0,0.0
134,536,,Michal,Karbownik,Karbownik,,4,2,4.0,0,0.0,0.0,0.0,0.0
135,537,9735.0,Taylor,Richards,Richards,Taylor Richards,4,3,4.5,100,0.0272177371708589,0.136590909954767,0.0303535355455037,2.8599774296929327e-05
136,538,,Moisés,Caicedo,Caicedo,,4,3,4.5,0,0.0,0.0,0.0,0.0
137,560,,Haydon,Roberts,Roberts,,4,2,4.0,100,0.0,0.0,0.0,0.0
138,584,7134.0,Marc,Cucurella,Cucurella,Marc Cucurella,4,2,5.0,100,2.6689340495690645,13.789067228125278,2.757813445625056,0.46830941975575163
139,595,6542.0,Jürgen,Locadia,Locadia,Jürgen Locadia,4,4,4.5,100,0.0322238565634882,0.1621465288570408,0.0360325619682312,5.1138807570233346e-05
140,612,10036.0,Jeremy,Sarmiento,Sarmiento,Jeremy Sarmiento,4,3,4.5,0,0.0,0.0,0.0,0.0
141,653,,Ed,Turns,Turns,,4,2,4.0,100,0.0,0.0,0.0,0.0
142,654,,Marc,Leonard,Leonard,,4,3,4.5,100,0.0,0.0,0.0,0.0
143,655,,Evan,Ferguson,Ferguson,,4,4,4.5,100,0.0,0.0,0.0,0.0
144,98,1665.0,James,Tarkowski,Tarkowski,James Tarkowski,5,2,4.9,100,2.68203223677459,13.858558331905105,2.8282772105928777,0.4826953866371166
145,99,857.0,Phil,Bardsley,Bardsley,Phil Bardsley,5,2,3.9,100,0.0,0.0,0.0,0.0
146,100,887.0,Erik,Pieters,Pieters,Erik Pieters,5,2,4.2,100,0.1787778581936924,0.8988079895823036,0.2140019022815008,0.002368741549046616
147,101,712.0,Jack,Cork,Cork,Jack Cork,5,3,4.4,100,0.7856609634316641,3.951993356270535,0.8981803082433034,0.024485628622374085
148,102,6051.0,Dale,Stephens,Stephens,Dale Stephens,5,3,4.4,75,0.0,0.0,0.0,0.0
149,103,1747.0,Kevin,Long,Long,Kevin Long,5,2,4.0,100,0.0,0.0,0.0,0.0
150,104,844.0,Jay,Rodriguez,Rodriguez,Jay Rodriguez,5,4,5.2,100,0.8374000978471416,4.376464857075447,0.8416278571298935,0.03223972630183191
151,105,4422.0,Ashley,Barnes,Barnes,Ashley Barnes,5,4,5.2,0,0.0,0.0,0.0,0.0
152,106,1654.0,Ben,Mee,Mee,Ben Mee,5,2,4.8,100,2.633229522056989,13.692033558787424,2.852506991414047,0.48098085744753316
153,107,669.0,Ashley,Westwood,Westwood,Ashley Westwood,5,3,5.3,100,2.5706175211208,13.244932915480566,2.499043946317088,0.2283259006218248
154,108,1663.0,Johann Berg,Gudmundsson,Gudmundsson,Johann Berg Gudmundsson,5,3,5.4,100,1.9566456353560249,10.127763049360285,1.87551167580746,0.13102821575508164
155,109,4456.0,Chris,Wood,Wood,Chris Wood,5,4,6.7,100,2.9080803845940464,15.125724915428636,2.257570882899796,0.2988858754383832
156,110,1652.0,Matthew,Lowton,Lowton,Matthew Lowton,5,2,4.4,100,2.8288327611320145,14.480640192970611,3.291054589311502,0.5868889983406075
157,111,1017.0,Matej,Vydra,Vydra,Matej Vydra,5,4,5.2,100,0.9803681314732277,5.1408625619948,0.9886274157682308,0.04448529164613233
158,112,5552.0,Nick,Pope,Pope,Nick Pope,5,1,5.4,100,,,,
159,113,6044.0,Charlie,Taylor,Taylor,Charlie Taylor,5,2,4.4,100,2.698702021186845,13.62414530879466,3.096396661089696,0.5195160595394414
160,114,7459.0,Will,Norris,Norris,Will Norris,5,1,4.4,100,,,,
161,115,8323.0,Josh,Brownhill,Brownhill,Josh Brownhill,5,3,4.3,100,2.011881383458677,10.219160570688985,2.3765489699276707,0.16753035692055837
162,116,7383.0,Josh,Benson,Benson,Josh Benson,5,3,4.5,0,0.0,0.0,0.0,0.0
163,117,8482.0,Bailey,Peacock-Farrell,Peacock-Farrell,Bailey Peacock-Farrell,5,1,4.5,0,,,,
164,118,6756.0,Dwight,McNeil,McNeil,Dwight McNeil,5,3,5.7,100,2.5892051195294523,13.297356628132365,2.3328695838828706,0.21398695571168405
165,451,9733.0,Nathan,Collins,Collins,Nathan Collins,5,2,4.3,100,0.878062477598049,4.461863005418733,1.0376425593997054,0.0570160501571723
166,480,509.0,Wayne,Hennessey,Hennessey,Wayne Hennessey,5,1,4.5,100,,,,
167,533,9082.0,Lewis,Richardson,Richardson,Lewis Richardson,5,4,4.5,100,0.0,0.0,0.0,0.0
168,534,,Bobby,Thomas,Thomas,,5,2,4.0,100,0.0,0.0,0.0,0.0
169,565,,Owen,Dodgson,Dodgson,,5,2,3.9,100,0.0,0.0,0.0,0.0
170,575,593.0,Aaron,Lennon,Lennon,Aaron Lennon,5,3,4.9,100,0.2055505875344787,1.0326196177651246,0.2107386975030866,0.0015011226781375705
171,578,3278.0,Maxwel,Cornet,Cornet,Maxwel Cornet,5,3,5.9,50,1.131108312569764,5.863929151605625,0.9938862968823092,0.040202859150084376
172,585,5568.0,Connor,Roberts,Roberts,Connor Roberts,5,2,4.5,0,0.0,0.0,0.0,0.0
173,119,681.0,César,Azpilicueta,Azpilicueta,César Azpilicueta,6,2,5.7,100,1.5649166582709977,7.917347278175537,1.3890082944167608,0.13543086543060998
174,120,502.0,Olivier,Giroud,Giroud,Olivier Giroud,6,4,6.5,0,0.0,0.0,0.0,0.0
175,121,3288.0,Thiago,Emiliano da Silva,Thiago Silva,Thiago Silva,6,2,5.6,25,0.5422764440964511,2.7254212773545885,0.4866823709561765,0.016334745673593776
176,122,1621.0,Marcos,Alonso,Alonso,Marcos Alonso,6,2,5.7,100,2.421639122352816,12.284288181283308,2.155138277418124,0.3260305198254915
177,123,1389.0,Jorge Luiz,Frello Filho,Jorginho,Jorginho,6,3,5.9,100,3.28886059663345,16.788303898753774,2.845475237076911,0.32952863216140943
178,124,592.0,Ross,Barkley,Barkley,Ross Barkley,6,3,5.2,100,0.3233337998757039,1.6537126689351105,0.3180216671029058,0.0036278413486428244
179,125,2254.0,Mateo,Kovacic,Kovacic,Mateo Kovacic,6,3,5.0,100,2.557649523844252,13.01662779967628,2.6033255599352563,0.23375369905502894
180,126,1678.0,Michy,Batshuayi,Batshuayi,Michy Batshuayi,6,4,5.5,0,0.0,0.0,0.0,0.0
181,127,1822.0,Antonio,Rüdiger,Rüdiger,Antonio Rüdiger,6,2,6.2,100,2.655719745910109,13.398291175183076,2.16101470567469,0.3565662666028954
182,129,5061.0,Kepa,Arrizabalaga,Arrizabalaga,Kepa,6,1,4.7,100,,,,
183,130,751.0,N'Golo,Kanté,Kanté,N'Golo Kanté,6,3,4.9,25,0.3980306826516561,2.0102633911852474,0.4102578349357647,0.005689071220096052
184,131,8992.0,Hakim,Ziyech,Ziyech,Hakim Ziyech,6,3,7.3,100,1.5128066427943658,7.74857117534287,1.061448106211352,0.05673511195877546
185,132,688.0,Ruben,Loftus-Cheek,Loftus-Cheek,Ruben Loftus-Cheek,6,3,5.4,75,1.1053814173166057,5.60700890865565,1.0383349830843795,0.04016060581752547
186,133,200.0,Andreas,Christensen,Christensen,Andreas Christensen,6,2,4.6,100,1.3862613674581885,6.973418051194737,1.5159604459118994,0.1301867218189251
187,134,65.0,Timo,Werner,Werner,Timo Werner,6,4,8.6,25,0.4319909116743753,2.2076535621641824,0.2567039025772305,0.004960337108591576
188,135,782.0,Benjamin,Chilwell,Chilwell,Ben Chilwell,6,2,5.6,0,0.0,0.0,0.0,0.0
189,136,702.0,Tammy,Abraham,Abraham,Tammy Abraham,6,4,6.5,0,0.0,0.0,0.0,0.0
190,137,2662.0,Christian,Pulisic,Pulisic,Christian Pulisic,6,3,7.9,100,1.959503523948313,10.04589209273834,1.2716319104732074,0.08812141243987494
191,138,7768.0,Mason,Mount,Mount,Mason Mount,6,3,7.7,100,3.07622135851675,15.760072511540184,2.0467626638363874,0.22251393835075212
192,139,6369.0,Ethan,Ampadu,Ampadu,Ethan Ampadu,6,2,4.5,0,0.0,0.0,0.0,0.0
193,140,6456.0,Callum,Hudson-Odoi,Hudson-Odoi,Callum Hudson-Odoi,6,3,5.3,100,1.7620500909947578,9.02359437969602,1.7025649773011358,0.10597777165803123
194,141,5220.0,Kai,Havertz,Havertz,Kai Havertz,6,3,7.8,25,0.5689686816516513,2.913554658076998,0.3735326484714101,0.007507291165324306
195,142,8067.0,Reece,James,James,Reece James,6,2,6.4,100,3.1812463382952703,16.161414689642775,2.5252210452566834,0.5025877442158853
196,143,6880.0,Edouard,Mendy,Mendy,Edouard Mendy,6,1,6.2,100,,,,
197,501,5648.0,Malang,Sarr,Sarr,Malang Sarr,6,2,4.9,100,1.2584946884827657,6.432722307809628,1.3128004709815566,0.10399839754089386
198,527,1677.0,Trevoh,Chalobah,Chalobah,Nathaniel Chalobah,6,2,4.7,100,0.0,0.0,0.0,0.0
199,529,594.0,Romelu,Lukaku,Lukaku,Romelu Lukaku,6,4,11.5,100,2.8461252846953693,14.55114371086602,1.2653168444231322,0.16115516104811692
200,539,1245.0,Emerson,Palmieri dos Santos,Emerson,Emerson,6,2,4.5,0,0.0,0.0,0.0,0.0
201,592,2266.0,Saúl,Ñíguez,Saúl,Saúl Ñíguez,6,3,5.0,100,0.2215769321236704,1.1094683929209528,0.2218936785841905,0.0016982099745125963
202,606,,Marcus,Bettinelli,[200~Bettinelli[201~,,6,1,4.0,100,,,,
203,144,9040.0,Conor,Gallagher,Gallagher,Conor Gallagher,7,3,6.1,100,5.181274873422269,23.524441693454072,3.856465851385914,0.6258068869518892
204,146,2190.0,Vicente,Guaita,Guaita,Vicente Guaita,7,1,4.6,100,,,,
205,147,530.0,James,Tomkins,Tomkins,James Tomkins,7,2,4.3,100,1.041661053032118,4.970158643678182,1.1558508473670193,0.07074653383197087
206,148,633.0,James,McArthur,McArthur,James McArthur,7,3,4.3,0,0.0,0.0,0.0,0.0
207,149,606.0,Christian,Benteke,Benteke,Christian Benteke,7,4,6.3,100,3.116247147666256,14.177095951359048,2.2503326906919123,0.2792426860876059
208,150,532.0,Cheikhou,Kouyaté,Kouyaté,Cheikhou Kouyaté,7,2,4.5,100,1.9096798419692549,9.40663776390751,2.090363947535002,0.2421527729358519
209,151,525.0,Martin,Kelly,Kelly,Martin Kelly,7,2,3.9,100,0.0,0.0,0.0,0.0
210,152,5549.0,Luka,Milivojevic,Milivojevic,Luka Milivojevic,7,3,5.3,100,0.9383221549671384,4.50754794124395,0.850480743630934,0.02644456103607036
211,153,672.0,Jordan,Ayew,Ayew,Jordan Ayew,7,4,5.8,100,2.495030149492213,11.57404555821761,1.995525096244416,0.20215764999925123
212,154,522.0,Wilfried,Zaha,Zaha,Wilfried Zaha,7,3,6.8,0,0.0,0.0,0.0,0.0
213,155,757.0,Jeffrey,Schlupp,Schlupp,Jeffrey Schlupp,7,3,5.4,100,0.8552109577840102,3.9892654173685904,0.7387528550682574,0.020329356297641762
214,156,856.0,Jack,Butland,Butland,Jack Butland,7,1,4.4,100,,,,
215,157,6027.0,Jairo,Riedewald,Riedewald,Jairo Riedewald,7,3,4.7,100,0.1571501826866411,0.7676607811645417,0.1633320810988386,0.0008649128955117955
216,158,,Jarosław,Jach,Jach,,7,2,4.3,100,0.0,0.0,0.0,0.0
217,159,5735.0,Jean-Philippe,Mateta,Mateta,Jean-Philippe Mateta,7,4,5.2,100,0.1774513806968748,0.8576210088688978,0.1649271170901726,0.0012380417139856148
218,160,8706.0,Eberechi,Eze,Eze,Eberechi Eze,7,3,5.9,100,0.1591112379830412,0.7557427306641028,0.128091988248153,0.0006677708674469855
219,161,6451.0,Nathan,Ferguson,Ferguson,Nathan Ferguson,7,2,4.5,100,0.1333333333333333,0.6666666666666666,0.1481481481481481,0.0012162926656127664
220,162,8214.0,Tyrick,Mitchell,Mitchell,Tyrick Mitchell,7,2,4.5,100,2.347181074460801,11.518910847873874,2.5597579661941943,0.36311437324389095
221,386,6104.0,Will,Hughes,Hughes,Will Hughes,7,3,4.7,100,0.4781911781112579,2.319261486798113,0.4934598908081091,0.007894653940011953
222,464,9948.0,Michael,Olise,Olise,Michael Olise,7,3,5.4,100,0.8254813733815309,3.798592322224017,0.7034430226340771,0.018432453009690923
223,474,510.0,Joel,Ward,Ward,Joel Ward,7,2,4.5,100,2.170981340274433,10.70252286995527,2.3783384155456155,0.31346779940892816
224,477,7603.0,Marc,Guéhi,Guéhi,Marc Guehi,7,2,4.6,100,2.8661113479013687,13.657677297702849,2.969060282109315,0.4993775130346338
225,488,6314.0,Joachim,Andersen,Andersen,Joachim Andersen,7,2,4.5,100,2.138188595196702,10.559297135899522,2.3465104746443384,0.3051340180939692
226,493,603.0,Nathaniel,Clyne,Clyne,Nathaniel Clyne,7,2,4.3,100,0.1192415332936981,0.5900618689528179,0.1372236904541437,0.0009971483277040158
227,540,,Reece,Hannam,Hannam,,7,2,3.9,100,0.0,0.0,0.0,0.0
228,541,9461.0,Jesurun,Rak-Sakyi,Rak-Sakyi,Jesurun Rak-Sakyi,7,3,4.4,100,0.0148148148148148,0.074074074074074,0.0168350168350168,8.602235136940592e-06
229,542,,Robert,Street,Street,,7,4,4.5,100,0.0,0.0,0.0,0.0
230,543,,Scott,Banks,Banks,,7,3,4.5,100,0.0,0.0,0.0,0.0
231,561,,Remi,Matthews,Matthews,,7,1,4.0,100,,,,
232,586,3697.0,Odsonne,Edouard,Edouard,Odsonne Edouard,7,4,6.3,100,2.751956847729349,12.60067805625247,2.0001076279765826,0.2205947034764895
233,163,876.0,Fabian,Delph,Delph,Fabian Delph,8,3,4.3,100,0.5646384218764863,2.8150129229041183,0.6546541681172369,0.012712291802913478
234,164,714.0,Gylfi,Sigurdsson,Sigurdsson,Gylfi Sigurdsson,8,3,6.7,0,0.0,0.0,0.0,0.0
235,165,585.0,Seamus,Coleman,Coleman,Seamus Coleman,8,2,4.9,100,1.996933442411996,9.912810457831007,2.023022542414492,0.24696229027560337
236,166,2249.0,James,Rodríguez,James,James Rodríguez,8,3,6.9,0,0.0,0.0,0.0,0.0
237,167,7063.0,Bernard,Anício Caldeira Duarte,Bernard,Bernard,8,3,5.5,0,0.0,0.0,0.0,0.0
238,168,1823.0,Lucas,Digne,Digne,Lucas Digne,8,2,5.0,100,2.261841885290646,11.122449391667072,2.2244898783334146,0.3046940630738064
239,169,1653.0,Michael,Keane,Keane,Michael Keane,8,2,4.9,100,2.992992765101446,14.731422842651254,3.006412825030868,0.5454141873454637
240,170,741.0,Jordan,Pickford,Pickford,Jordan Pickford,8,1,4.9,100,,,,
241,171,1379.0,Allan,Marques Loureiro,Allan,Allan,8,3,4.4,100,2.093927308058631,10.424215435442258,2.3691398716914223,0.17035920437136529
242,172,2383.0,André Filipe,Tavares Gomes,André Gomes,André Gomes,8,3,4.9,100,0.8569658836745652,4.190167190339719,0.8551361612938201,0.024717135982986423
243,173,1726.0,Abdoulaye,Doucouré,Doucouré,Abdoulaye Doucouré,8,3,5.4,100,3.7711439405141873,18.434008119426363,3.413705207301178,0.43408753202485223
244,174,500.0,Alex,Iwobi,Iwobi,Alex Iwobi,8,3,5.8,100,1.924381104226705,9.323981051768063,1.607582939960011,0.10339660856486901
245,175,6521.0,Yerry,Mina,Mina,Yerry Mina,8,2,4.9,0,0.0,0.0,0.0,0.0
246,176,1042.0,Tom,Davies,Davies,Tom Davies,8,3,4.8,0,0.0,0.0,0.0,0.0
247,177,5555.0,Dominic,Calvert-Lewin,Calvert-Lewin,Dominic Calvert-Lewin,8,4,7.9,100,6.259322210699022,30.04274739411883,3.802879416977067,1.0
248,178,985.0,Mason,Holgate,Holgate,Mason Holgate,8,2,4.2,100,0.9880109548379336,4.866805194387649,1.1587631415208688,0.06944992086376912
249,179,7689.0,Ben,Godfrey,Godfrey,Ben Godfrey,8,2,4.8,100,2.228643856726401,10.950328572830468,2.2813184526730144,0.3076423950975416
250,180,6026.0,Richarlison,de Andrade,Richarlison,Richarlison,8,4,7.4,0,0.0,0.0,0.0,0.0
251,181,8366.0,João,Virgínia,Virgínia,João Virgínia,8,1,4.0,0,,,,
252,481,694.0,Asmir,Begović,Begović,Asmir Begovic,8,1,4.0,100,,,,
253,482,775.0,Andros,Townsend,Townsend,Andros Townsend,8,3,5.2,0,0.0,0.0,0.0,0.0
254,484,762.0,Demarai,Gray,Gray,Demarai Gray,8,3,5.5,100,3.063335882890617,14.844745272369556,2.6990445949762827,0.27638491330156123
255,502,1084.0,Jonjoe,Kenny,Kenny,Jonjoe Kenny,8,2,4.4,100,0.1300301921012587,0.6494483445293004,0.1476018964839319,0.0011805100032857589
256,503,8150.0,Anthony,Gordon,Gordon,Anthony Gordon,8,3,4.5,100,1.4416213535162885,7.012627192229977,1.5583615982733283,0.07538423154330975
257,504,4764.0,Jean-Philippe,Gbamin,Gbamin,Jean-Philippe Gbamin,8,3,4.4,100,0.0930555555555555,0.4652777777777778,0.1057449494949494,0.00033939345875736094
258,544,8476.0,Jarrad,Branthwaite,Branthwaite,Jarrad Branthwaite,8,2,4.0,100,0.1939700826055838,0.9498158235733656,0.2374539558933414,0.002777486325493809
259,545,9406.0,Nathan,Broadhead,Broadhead,Nathan Broadhead,8,4,4.5,0,0.0,0.0,0.0,0.0
260,564,1304.0,Moise,Kean,Kean,Moise Kean,8,4,6.0,0,0.0,0.0,0.0,0.0
261,570,8109.0,Niels,Nkounkou,Nkounkou,Niels Nkounkou,8,2,4.0,0,0.0,0.0,0.0,0.0
262,571,,Andy,Lonergan,Lonergan,,8,1,4.0,100,,,,
263,591,813.0,Salomón,Rondón,Rondón,Salomón Rondón,8,4,6.0,100,1.740590418463796,8.462457495186149,1.4104095825310248,0.10446950797151092
264,602,8582.0,Ellis,Simms,Simms,Ellis Simms,8,4,4.5,100,0.1076923076923076,0.5384615384615384,0.1196581196581196,0.0005639552716118186
265,607,10027.0,Lewis,Dobbin,Dobbin,Lewis Dobbin,8,4,4.5,100,0.0537037037037037,0.2685185185185185,0.0596707818930041,0.00014024383205767652
266,613,,Charlie,Whitaker,Whitaker,,8,3,4.5,100,0.0,0.0,0.0,0.0
267,616,,Harry,Tyrer,Tyrer,,8,1,4.0,100,,,,
268,622,6477.0,Cenk,Tosun,Tosun,Cenk Tosun,8,4,5.0,100,0.0055555555555555,0.0277777777777777,0.0055555555555555,1.3507432100679734e-06
269,623,,Reece,Welch,Welch,,8,2,4.0,100,0.0,0.0,0.0,0.0
270,630,9287.0,Tyler,Onyango,Onyango,Tyler Onyango,8,3,4.5,100,0.0074074074074074,0.037037037037037,0.0082304526748971,2.1027685890299217e-06
271,200,745.0,Kasper,Schmeichel,Schmeichel,Kasper Schmeichel,9,1,4.8,100,,,,
272,201,807.0,Jonny,Evans,Evans,Jonny Evans,9,2,5.4,50,1.1290769481817269,5.813139671796856,1.0765073466290471,0.07706565530245285
273,202,753.0,Marc,Albrighton,Albrighton,Marc Albrighton,9,3,5.2,100,0.9130878549917932,4.668606121374446,0.8978088694950858,0.02891363203088058
274,203,1785.0,Nampalys,Mendy,Mendy,Nampalys Mendy,9,3,4.3,0,0.0,0.0,0.0,0.0
275,204,473.0,Danny,Ward,Ward,Danny Ward,9,1,4.0,0,,,,
276,205,755.0,Jamie,Vardy,Vardy,Jamie Vardy,9,4,10.4,100,3.846999442365071,19.892473684766607,1.9127378543044813,0.3330366613127405
277,206,1234.0,Dennis,Praet,Praet,Dennis Praet,9,3,4.9,0,0.0,0.0,0.0,0.0
278,207,3303.0,Ricardo Domingos,Barbosa Pereira,Pereira,Ricardo Pereira,9,2,5.2,0,0.0,0.0,0.0,0.0
279,208,759.0,Daniel,Amartey,Amartey,Daniel Amartey,9,2,3.8,100,0.9538515517982572,4.782892695777727,1.258655972573086,0.07413628137693987
280,209,6157.0,Timothy,Castagne,Castagne,Timothy Castagne,9,2,5.3,100,1.6919427381478602,8.489652817068428,1.6018212862393262,0.16747003481449071
281,210,5956.0,Youri,Tielemans,Tielemans,Youri Tielemans,9,3,6.4,100,4.025449022240752,20.79309482931972,3.248921067081206,0.4660041856008923
282,211,770.0,Ayoze,Pérez,Pérez,Ayoze Pérez,9,3,5.7,100,0.6707447281205676,3.502585040815536,0.6144886036518483,0.014846840550351355
283,212,6818.0,James,Maddison,Maddison,James Maddison,9,3,6.8,100,3.191175483059616,16.488498035370526,2.424779122848607,0.27579399384435194
284,213,620.0,Kelechi,Iheanacho,Iheanacho,Kelechi Iheanacho,9,4,6.9,100,1.95036022144096,10.149119813955249,1.4708869295587317,0.1306638550589818
285,214,6418.0,Hamza,Choudhury,Choudhury,Hamza Choudhury,9,3,4.4,100,0.1389614445420329,0.7084501325748207,0.1610113937670046,0.0007868599091012667
286,215,6681.0,Harvey,Barnes,Barnes,Harvey Barnes,9,3,6.5,0,0.0,0.0,0.0,0.0
287,216,5545.0,Wilfred,Ndidi,Ndidi,Wilfred Ndidi,9,3,4.8,100,1.85927943990608,9.3640507201317,1.9508439000274371,0.12601371072208092
288,217,5264.0,Çaglar,Söyüncü,Söyüncü,Caglar Söyüncü,9,2,4.9,0,0.0,0.0,0.0,0.0
289,218,7753.0,James,Justin,Justin,James Justin,9,2,4.9,0,0.0,0.0,0.0,0.0
290,219,8562.0,Luke,Thomas,Thomas,Luke Thomas,9,2,4.3,100,1.3468148388723935,6.841003008435507,1.590930932194304,0.13403068187057204
291,220,7589.0,Wesley,Fofana,Fofana,Wesley Fofana,9,2,4.3,0,0.0,0.0,0.0,0.0
292,340,111.0,Jannik,Vestergaard,Vestergaard,Jannik Vestergaard,9,2,4.7,100,0.8571295162403743,4.327444159527555,0.9207327998994796,0.04906798308886625
293,455,9738.0,Patson,Daka,Daka,Patson Daka,9,4,7.1,0,0.0,0.0,0.0,0.0
294,458,6310.0,Boubakary,Soumaré,Soumaré,Boubakary Soumare,9,3,4.8,100,1.274773735715966,6.416076975105891,1.3366827031470605,0.059160170495124335
295,473,835.0,Ryan,Bertrand,Bertrand,Ryan Bertrand,9,2,4.6,50,0.2963764134029577,1.4892473421019137,0.3237494221960682,0.005937572908702905
296,505,9739.0,Kiernan,Dewsbury-Hall,Dewsbury-Hall,Kiernan Dewsbury-Hall,9,3,4.4,100,0.583343131412608,2.9827451151559066,0.6778966170808878,0.013947974117801238
297,573,1697.0,Eldin,Jakupovic,Jakupovic,Eldin Jakupovic,9,1,4.0,100,,,,
298,587,5556.0,Ademola,Lookman,Lookman,Ademola Lookman,9,3,6.0,100,2.0032261009522854,10.406465953274822,1.7344109922124702,0.12450500441514864
299,639,,Vontae,Daley-Campbell,Daley-Campbell,,9,2,4.0,100,0.0,0.0,0.0,0.0
300,645,,Ben,Nelson,Nelson,,9,2,4.0,100,0.0,0.0,0.0,0.0
301,646,,Lewis,Brunt,Brunt,,9,3,4.5,100,0.0,0.0,0.0,0.0
302,647,10166.0,Kasey,McAteer,McAteer,Kasey McAteer,9,3,4.5,100,0.0111111111111111,0.0555555555555555,0.0123456790123456,4.731229325317305e-06
303,182,2164.0,Pablo,Hernández Domínguez,Hernández,Pablo Hernández,10,3,5.5,0,0.0,0.0,0.0,0.0
304,183,2259.0,Francisco,Casilla Cortés,Casilla,Kiko Casilla,10,1,4.5,0,,,,
305,184,8816.0,Liam,Cooper,Cooper,Liam Cooper,10,2,4.5,0,0.0,0.0,0.0,0.0
306,185,8716.0,Luke,Ayling,Ayling,Luke Ayling,10,2,4.3,100,2.753366668421543,13.83932360219149,3.2184473493468584,0.5485224323334762
307,186,4381.0,Mateusz,Klich,Klich,Mateusz Klich,10,3,5.2,100,1.919366167646568,9.701128016709358,1.8656015416748768,0.12484543031324663
308,187,2381.0,Rodrigo,Moreno,Rodrigo,Rodrigo,10,4,6.2,0,0.0,0.0,0.0,0.0
309,188,8718.0,Stuart,Dallas,Dallas,Stuart Dallas,10,3,5.0,100,2.643584599062411,13.302361165994505,2.6604722331989006,0.24412878441429334
310,189,822.0,Patrick,Bamford,Bamford,Patrick Bamford,10,4,7.7,0,0.0,0.0,0.0,0.0
311,190,2163.0,Diego,Llorente,Llorente,Diego Llorente,10,2,4.5,75,1.7320174301504545,8.698074670398807,1.932905482310846,0.20704601175874054
312,191,8719.0,Kalvin,Phillips,Phillips,Kalvin Phillips,10,3,4.8,0,0.0,0.0,0.0,0.0
313,192,3428.0,Hélder Wander,Sousa de Azevedo e Costa,Costa,Hélder Costa,10,3,5.4,0,0.0,0.0,0.0,0.0
314,193,1014.0,Tyler,Roberts,Roberts,Tyler Roberts,10,3,4.8,100,1.7245968445309376,8.748006082934149,1.822501267277948,0.10997866367461359
315,194,6273.0,Robin,Koch,Koch,Robin Koch,10,2,4.3,100,1.5621218018476193,7.83589015276679,1.8223000355271608,0.17584958294175215
316,195,8723.0,Ian Carlo,Poveda-Ocampo,Poveda,Ian Poveda-Ocampo,10,3,4.5,0,0.0,0.0,0.0,0.0
317,196,8026.0,Raphael,Dias Belloli,Raphinha,Raphinha,10,3,6.5,100,4.031657337788456,20.477594033908684,3.1503990821397974,0.44501640825920813
318,197,8721.0,Jamie,Shackleton,Shackleton,Jamie Shackleton,10,3,4.4,0,0.0,0.0,0.0,0.0
319,198,8717.0,Pascal,Struijk,Struijk,Pascal Struijk,10,2,4.3,0,0.0,0.0,0.0,0.0
320,199,8715.0,Illan,Meslier,Meslier,Illan Meslier,10,1,4.9,100,,,,
321,267,8720.0,Jack,Harrison,Harrison,Jack Harrison,10,3,5.6,75,1.6509713115416689,8.351467160306692,1.491333421483338,0.0859150112827812
322,287,5595.0,Daniel,James,James,Daniel James,10,3,6.0,0,0.0,0.0,0.0,0.0
323,463,6485.0,Héctor Junior,Firpo Adames,Firpo,Júnior Firpo,10,2,4.7,100,1.97966615079215,9.970049615212904,2.1212871521729584,0.2604533219183934
324,490,,Kristoffer,Klaesson,Klaesson,,10,1,4.4,100,,,,
325,550,9493.0,Sam,Greenwood,Greenwood,Sam Greenwood,10,4,4.5,100,0.0117647058823529,0.0588235294117647,0.0130718954248366,6.730346790650194e-06
326,551,9492.0,Crysencio,Summerville,Summerville,Crysencio Summerville,10,3,4.5,100,0.1852809439528336,0.9315347914894444,0.2070077314420987,0.0013302006903337176
327,552,1711.0,Adam,Forshaw,Forshaw,Adam Forshaw,10,3,4.5,100,1.3416129500536988,6.749890673618745,1.49997570524861,0.06984132768244394
328,562,9499.0,Cody,Drameh,Drameh,Cody Drameh,10,2,3.9,100,0.1607653417489023,0.8040490321141001,0.2061664184907949,0.002041425708575135
329,563,9220.0,Charlie,Cresswell,Cresswell,Charlie Cresswell,10,2,4.0,0,0.0,0.0,0.0,0.0
330,576,9933.0,Liam,McCarron,McCarron,Liam McCarron,10,3,4.5,100,0.0083333333333333,0.0416666666666666,0.0092592592592592,2.6613164954909827e-06
331,577,9339.0,Joe,Gelhardt,Gelhardt,Joe Gelhardt,10,4,4.6,100,0.6614794185739006,3.34374485674065,0.7269010558131849,0.02127434657675734
332,600,,Nohan,Kenneh,Kenneh,,10,3,4.4,100,0.0,0.0,0.0,0.0
333,601,10001.0,Stuart,McKinstry,McKinstry,Stuart McKinstry,10,3,4.3,100,0.0015873015873015,0.0079365079365079,0.0018456995201181,1.0104666333140791e-07
334,608,,Leo Fuhr,Hjelde,Hjelde,,10,2,4.0,100,0.0,0.0,0.0,0.0
335,624,,Lewis,Bate,Bate,,10,3,4.5,100,0.0,0.0,0.0,0.0
336,631,,Jack,Jenkins,Jenkins,,10,3,4.5,100,0.0,0.0,0.0,0.0
337,657,,Kris,Moore,Moore,,10,2,4.0,100,0.0,0.0,0.0,0.0
338,658,,Archie,Gray,Gray,,10,3,4.5,100,0.0,0.0,0.0,0.0
339,221,489.0,James,Milner,Milner,James Milner,11,3,4.9,100,1.1082396949251807,5.629139434324107,1.1488039661885932,0.04460868855125867
340,222,605.0,Jordan,Henderson,Henderson,Jordan Henderson,11,3,5.1,100,2.7382634912246195,13.917888377733483,2.7289977211242125,0.2620040744643053
341,223,527.0,Adrián,San Miguel del Castillo,Adrián,Adrián,11,1,4.3,0,,,,
342,224,332.0,Joel,Matip,Matip,Joel Matip,11,2,4.9,100,1.9100372460325288,9.635963113775974,1.966523084444076,0.23336047358830195
343,225,229.0,Thiago,Alcántara do Nascimento,Thiago,Thiago Alcántara,11,3,5.3,100,1.9973883897107416,10.22390636493315,1.92903893677984,0.136047128646996
344,226,888.0,Xherdan,Shaqiri,Shaqiri,Xherdan Shaqiri,11,3,5.9,0,0.0,0.0,0.0,0.0
345,227,966.0,Alex,Oxlade-Chamberlain,Chamberlain,Alex Oxlade-Chamberlain,11,3,5.8,100,0.9603131423611704,4.892182732836655,0.8434797815235613,0.028464848084615267
346,228,482.0,Roberto,Firmino,Firmino,Roberto Firmino,11,4,8.7,100,2.502677009219846,12.946775087672414,1.4881350675485534,0.1686365673005135
347,229,833.0,Virgil,van Dijk,van Dijk,Virgil van Dijk,11,2,6.6,100,2.9779300792578085,15.05809866514154,2.281530100779021,0.4230867856388107
348,230,838.0,Sadio,Mané,Mané,Sadio Mané,11,3,11.8,100,4.764170304188308,24.79378844259099,2.1011685120839823,0.35936460360856054
349,231,1257.0,Alisson,Ramses Becker,Alisson,Alisson,11,1,6.0,100,,,,
350,232,3420.0,Fabio Henrique,Tavares,Fabinho,Fabinho,11,3,5.4,100,1.9688080748780057,9.970112025736803,1.846317041803112,0.12698073585634542
351,233,1250.0,Mohamed,Salah,Salah,Mohamed Salah,11,3,13.0,100,7.226780309199959,37.59057655634682,2.8915828120266784,0.749801223051805
352,234,1688.0,Andrew,Robertson,Robertson,Andrew Robertson,11,2,7.0,0,0.0,0.0,0.0,0.0
353,235,484.0,Divock,Origi,Origi,Divock Origi,11,4,4.8,25,0.0266817544409814,0.1380987882698295,0.0287705808895478,3.477653412477561e-05
354,236,8239.0,Takumi,Minamino,Minamino,Takumi Minamino,11,3,5.1,100,0.0678465002434657,0.3501223358215514,0.0686514383963826,0.0001658062821506677
355,237,1791.0,Trent,Alexander-Arnold,Alexander-Arnold,Trent Alexander-Arnold,11,2,8.3,100,4.799312992280806,24.54327889308368,2.9570215533835755,0.89375851469821
356,238,987.0,Joseph,Gomez,Gomez,Joseph Gomez,11,2,4.7,100,0.0225199831229152,0.1127048625732015,0.0239797579942982,3.328285472946974e-05
357,239,5247.0,Naby,Keita,Keita,Naby Keita,11,3,5.0,100,1.2284295970143289,6.278233273248143,1.2556466546496283,0.054379650897691784
358,240,6854.0,Diogo,Jota,Jota,Diogo Jota,11,3,8.1,100,5.043701740304649,26.417460082472545,3.2614148249966104,0.5943313290694074
359,241,8228.0,Nathaniel,Phillips,Phillips,Nathaniel Phillips,11,2,4.2,0,0.0,0.0,0.0,0.0
360,242,7904.0,Caoimhin,Kelleher,Kelleher,Caoimhin Kelleher,11,1,4.3,100,,,,
361,243,6326.0,Ibrahima,Konaté,Konaté,Ibrahima Konaté,11,2,5.1,100,0.6729855670719922,3.3671549557705065,0.6602264619157856,0.027377207628957043
362,244,6665.0,Curtis,Jones,Jones,Curtis Jones,11,3,5.0,100,1.4024632480838073,7.132449644884947,1.4264899289769892,0.07018413425941378
363,245,8852.0,Konstantinos,Tsimikas,Tsimikas,Konstantinos Tsimikas,11,2,3.7,100,0.7851748651695794,3.99419668447485,1.079512617425635,0.053099482605279455
364,246,8204.0,Neco,Williams,N.Williams,Neco Williams,11,2,3.9,100,0.0113033299444666,0.0573676286284736,0.0147096483662752,1.0392075874100436e-05
365,247,9086.0,Rhys,Williams,R.Williams,Rhys Williams,11,2,4.4,0,0.0,0.0,0.0,0.0
366,248,660.0,Ben,Davies,Davies,Ben Davies,11,2,4.0,0,0.0,0.0,0.0,0.0
367,506,7546.0,Harvey,Elliott,Elliott,Harvey Elliott,11,3,5.3,0,0.0,0.0,0.0,0.0
368,553,,Ben,Woodburn,Woodburn,,11,3,4.5,0,0.0,0.0,0.0,0.0
369,620,10091.0,Tyler,Morton,Morton,Tyler Morton,11,3,4.5,100,0.1679012345679012,0.8395061728395061,0.186556927297668,0.00108035577285271
370,625,,Kaide,Gordon,Gordon,,11,3,4.5,100,0.0,0.0,0.0,0.0
371,626,,Conor,Bradley,Bradley,,11,2,4.0,100,0.0,0.0,0.0,0.0
372,627,,Owen,Beck,Beck,,11,2,4.0,100,0.0,0.0,0.0,0.0
373,656,,Marcelo,de Araújo Pitaluga Filho,Pitaluga,,11,1,4.0,100,,,,
374,660,,Jarell,Quansah,Quansah,,11,2,4.0,100,0.0,0.0,0.0,0.0
375,33,675.0,Jack,Grealish,Grealish,Jack Grealish,12,3,7.6,100,3.5739522560273627,15.769463260716938,2.0749293764101235,0.22571049545476066
376,249,638.0,Kyle,Walker,Walker,Kyle Walker,12,2,5.5,75,1.4349857131692545,6.944931645218789,1.2627148445852343,0.1079956795341941
377,250,314.0,Ilkay,Gündogan,Gündogan,Ilkay Gündogan,12,3,7.3,100,4.390767879077798,19.294708342748088,2.6431107318833,0.351791303568567
378,251,447.0,Kevin,De Bruyne,De Bruyne,Kevin De Bruyne,12,3,11.9,100,3.384440043313384,15.178973771848495,1.27554401444105,0.13355783877800562
379,252,586.0,John,Stones,Stones,John Stones,12,2,5.3,75,0.7230936496585404,3.3778111487296654,0.6373228582508803,0.026511114155138182
380,253,3389.0,Benjamin,Mendy,Mendy,Benjamin Mendy,12,2,5.2,0,0.0,0.0,0.0,0.0
381,254,750.0,Riyad,Mahrez,Mahrez,Riyad Mahrez,12,3,8.6,100,3.03595253501288,13.253543608428531,1.5411097219102945,0.14089549091221096
382,255,618.0,Raheem,Sterling,Sterling,Raheem Sterling,12,3,10.6,100,4.527445640143598,19.658914165429543,1.854614543908448,0.2515038923439808
383,256,2379.0,João Pedro Cavaco,Cancelo,Cancelo,João Cancelo,12,2,6.9,100,4.292014106974239,20.011631436888784,2.900236440128809,0.71474153486019
384,257,6054.0,Ederson,Santana de Moraes,Ederson,Ederson,12,1,6.0,100,,,,
385,258,579.0,Nathan,Aké,Aké,Nathan Aké,12,2,4.7,100,0.5677175873437256,2.772820678716981,0.5899618465355279,0.02014553615591514
386,259,2498.0,Aymeric,Laporte,Laporte,Aymeric Laporte,12,2,5.5,100,2.7076249201460723,12.618207794100972,2.2942195989274494,0.35650512729408707
387,260,7817.0,Zack,Steffen,Steffen,Zack Steffen,12,1,4.5,100,,,,
388,261,3635.0,Bernardo Mota,Veiga de Carvalho e Silva,Bernardo,Bernardo Silva,12,3,7.6,100,5.034944662635562,22.673089531333304,2.9833012541228032,0.4665942007472958
389,262,8961.0,Rúben Santos,Gato Alves Dias,Dias,Rúben Dias,12,2,6.2,100,2.9477084152959474,13.900554561999066,2.242024929354688,0.38380063046350327
390,263,5543.0,Gabriel Fernando,de Jesus,Jesus,Gabriel Jesus,12,4,8.7,100,3.838716145870112,17.20528139277684,1.9776185508938895,0.297818797791604
391,264,2958.0,Oleksandr,Zinchenko,Zinchenko,Oleksandr Zinchenko,12,2,5.3,100,0.940835010966399,4.536516856407338,0.8559465766806298,0.04781920020036285
392,265,6055.0,Phil,Foden,Foden,Phil Foden,12,3,8.1,100,4.19528316719647,18.51228497076784,2.2854672803417087,0.29185461038624644
393,266,2496.0,Rodrigo,Hernandez,Rodrigo,Rodri,12,3,5.5,75,1.7275303087912073,8.370624053447058,1.5219316460812833,0.0878788788665848
394,268,6441.0,Ferran,Torres,Torres,Ferrán Torres,12,3,6.7,0,0.0,0.0,0.0,0.0
395,453,614.0,Fernando,Luiz Rosa,Fernandinho,Fernandinho,12,3,4.8,100,0.8498199341783932,4.016542444788018,0.8367796759975038,0.02318435441274678
396,507,8497.0,Cole,Palmer,Palmer,Cole Palmer,12,3,4.5,100,0.2106228733195167,0.9967665195535084,0.2215036710118907,0.0015230210059630745
397,508,,Samuel,Edozie,Edozie,,12,3,4.8,100,0.0,0.0,0.0,0.0
398,566,,Tommy,Doyle,Doyle,,12,3,4.5,0,0.0,0.0,0.0,0.0
399,593,8158.0,Scott,Carson,Carson,Scott Carson,12,1,3.9,100,,,,
400,603,,Luke,Mbete,Mbete,,12,2,4.0,100,0.0,0.0,0.0,0.0
401,604,,Joshua,Wilson-Esbrand,Wilson-Esbrand,,12,2,3.9,100,0.0,0.0,0.0,0.0
402,605,,Romeo,Lavia,Lavia,,12,3,4.4,100,0.0,0.0,0.0,0.0
403,615,,Cieran,Slicker,Slicker,,12,1,4.0,100,,,,
404,629,10126.0,James,McAtee,McAtee,James McAtee,12,3,4.4,100,0.0029515044692401,0.0145909585398631,0.0033161269408779,3.337693810612558e-07
405,651,,Conrad,Egan-Riley,Egan-Riley,,12,2,4.0,100,0.0,0.0,0.0,0.0
406,663,,Kayky da Silva,Chagas,Kayky,,12,4,5.0,100,0.0,0.0,0.0,0.0
407,269,3294.0,Edinson,Cavani,Cavani,Edinson Cavani,13,4,8.4,100,1.9191687660918573,9.203619186784,1.0956689508076192,0.08826444495144939
408,270,546.0,David,de Gea,de Gea,David de Gea,13,1,5.1,100,,,,
409,271,697.0,Nemanja,Matic,Matic,Nemanja Matic,13,3,4.4,100,0.9488490024504604,4.676751793374052,1.062898134857739,0.03429000034265399
410,272,1740.0,Paul,Pogba,Pogba,Paul Pogba,13,3,7.4,0,0.0,0.0,0.0,0.0
411,273,1687.0,Harry,Maguire,Maguire,Harry Maguire,13,2,5.4,100,2.4686481308340644,12.173736590649527,2.2543956649350974,0.33797701106076156
412,274,6817.0,Frederico,Rodrigues de Paula Santos,Fred,Fred,13,3,5.0,100,2.2520273350684925,11.172805230568748,2.234561046113749,0.17222094769266172
413,275,1006.0,Luke,Shaw,Shaw,Luke Shaw,13,2,5.0,100,2.0961002916000364,10.304943514248292,2.0609887028496585,0.2615497724920353
414,276,558.0,Jesse,Lingard,Lingard,Jesse Lingard,13,3,6.8,100,0.2755549736477837,1.3308124724486354,0.195707716536564,0.0017966204355341273
415,277,1228.0,Bruno Miguel,Borges Fernandes,Fernandes,Bruno Fernandes,13,3,11.6,0,0.0,0.0,0.0,0.0
416,278,553.0,Anthony,Martial,Martial,Anthony Martial,13,4,7.6,100,0.7516146944139427,3.614436479482154,0.4755837473002834,0.015045804010191215
417,279,1828.0,Alex Nicolao,Telles,Telles,Alex Telles,13,2,5.0,100,1.129526323653974,5.548426184501373,1.1096852369002748,0.07582331025083808
418,280,7702.0,Dean,Henderson,Henderson,Dean Henderson,13,1,4.7,100,,,,
419,281,556.0,Marcus,Rashford,Rashford,Marcus Rashford,13,3,9.4,100,2.376269615522882,11.461468557926713,1.219305165736884,0.09640159158282793
420,282,8821.0,Donny,van de Beek,van de Beek,Donny van de Beek,13,3,5.7,100,0.1346958761969616,0.6532464282335354,0.1146046365321991,0.000516429158093862
421,284,6080.0,Victor,Lindelöf,Lindelöf,Victor Lindelöf,13,2,4.8,25,0.4261185875554651,2.117958145924554,0.4412412804009488,0.011508709543455236
422,285,5560.0,Scott,McTominay,McTominay,Scott McTominay,13,3,5.4,100,2.0947459312070604,10.310199218489126,1.9092961515720603,0.1357912784758799
423,286,1739.0,Eric,Bailly,Bailly,Eric Bailly,13,2,4.9,100,0.2662176938669253,1.329366682135021,0.2712993228846981,0.004441468839207265
424,288,5584.0,Aaron,Wan-Bissaka,Wan-Bissaka,Aaron Wan-Bissaka,13,2,5.1,100,2.1258986539192035,10.558153458989532,2.0702261684293206,0.26917757962503275
425,289,7490.0,Mason,Greenwood,Greenwood,Mason Greenwood,13,3,7.2,100,2.747342501140827,13.282841328888368,1.8448390734567175,0.1690366963043832
426,459,554.0,Juan,Mata,Mata,Juan Mata,13,3,4.7,100,0.0,0.0,0.0,0.0
427,485,6345.0,Jadon,Sancho,Sancho,Jadon Sancho,13,3,8.9,100,1.6732595157215475,8.135277115844705,0.9140760804319892,0.05129632102483668
428,509,1651.0,Tom,Heaton,Heaton,Tom Heaton,13,1,4.0,100,,,,
429,510,7281.0,José Diogo,Dalot Teixeira,Dalot,Diogo Dalot,13,2,4.5,100,0.7806635678128366,3.8722236614190986,0.8604941469820219,0.041033775195857734
430,511,922.0,Andreas,Pereira,Pereira,Andreas Pereira,13,3,5.0,0,0.0,0.0,0.0,0.0
431,512,9524.0,Anthony,Elanga,Elanga,Anthony Elanga,13,3,4.8,100,0.0418879981484563,0.2037539898216364,0.0424487478795075,5.966264858906642e-05
432,555,2245.0,Raphaël,Varane,Varane,Raphael Varane,13,2,5.5,100,2.4569800325280733,12.156765858532625,2.21032106518775,0.3309074422011678
433,579,2371.0,Cristiano Ronaldo,dos Santos Aveiro,Ronaldo,Cristiano Ronaldo,13,4,12.5,100,5.37994422782341,25.81769291168421,2.0654154329347367,0.4667374482836267
434,632,,Phil,Jones,Jones,,13,2,4.5,100,0.0,0.0,0.0,0.0
435,636,,Amad,Diallo,Diallo,,13,3,5.0,100,0.0,0.0,0.0,0.0
436,19,6630.0,Joseph,Willock,Willock,Joe Willock,14,3,5.7,25,0.4393962485711853,2.275291861096239,0.3991740107186384,0.00626514164266476
437,291,769.0,Jonjo,Shelvey,Shelvey,Jonjo Shelvey,14,3,5.3,100,1.832555258038452,9.310420674951647,1.756683146217292,0.11282212150886482
438,292,461.0,Matt,Ritchie,Ritchie,Matt Ritchie,14,2,4.9,25,0.5161839807067123,2.659184387791375,0.5426906913859948,0.01777190342072798
439,293,875.0,Ciaran,Clark,Clark,Ciaran Clark,14,2,4.4,25,0.4103891913692106,2.1162701488729745,0.4809704883802214,0.012534951425650614
440,294,780.0,Karl,Darlow,Darlow,Karl Darlow,14,1,4.5,25,,,,
441,295,6532.0,Martin,Dubravka,Dubravka,Martin Dubravka,14,1,4.4,100,,,,
442,296,468.0,Callum,Wilson,Wilson,Callum Wilson,14,4,7.4,25,0.919112297283804,4.833156438751006,0.6531292484798656,0.027629802738547635
443,297,1746.0,Jeff,Hendrick,Hendrick,Jeff Hendrick,14,3,4.8,100,0.1044332099913941,0.537822402058126,0.1120463337621096,0.00041568854959441706
444,298,1683.0,Ryan,Fraser,Fraser,Ryan Fraser,14,3,5.3,100,0.9770894243936225,5.062605583640301,0.9552086006868492,0.033358294693853645
445,299,766.0,Jamaal,Lascelles,Lascelles,Jamaal Lascelles,14,2,4.4,100,2.025510882348431,10.345769877132003,2.3513113357118187,0.2995753473069499
446,300,743.0,Dwight,Gayle,Gayle,Dwight Gayle,14,4,5.2,100,0.0491056800529705,0.2618376668740782,0.0503533974757842,0.00011540076833175531
447,301,853.0,Paul,Dummett,Dummett,Paul Dummett,14,2,4.5,0,0.0,0.0,0.0,0.0
448,302,1719.0,Javier,Manquillo,Manquillo,Javier Manquillo,14,2,3.9,0,0.0,0.0,0.0,0.0
449,303,1545.0,Emil,Krafth,Krafth,Emil Krafth,14,2,4.3,100,0.8458453526793405,4.328349537749388,1.0065929157556717,0.05365489070151149
450,304,6063.0,Jacob,Murphy,Murphy,Jacob Murphy,14,3,4.7,100,1.269971816908973,6.620597117127604,1.4086376844952349,0.06433213820479684
451,305,76.0,Fabian,Schär,Schär,Fabian Schär,14,2,4.3,100,1.1561911134644485,5.869319025985872,1.3649579130199705,0.09865976951553129
452,306,6062.0,Isaac,Hayden,Hayden,Isaac Hayden,14,3,4.5,100,1.4985028399682578,7.555392339682885,1.6789760754850855,0.0875050368933091
453,307,101.0,Allan,Saint-Maximin,Saint-Maximin,Allan Saint-Maximin,14,4,6.6,50,1.8744187569491055,9.806003889072285,1.4857581650109524,0.12752284282142917
454,308,7420.0,Miguel,Almirón,Almirón,Miguel Almirón,14,3,5.1,100,1.4723540742211034,7.595596771082594,1.4893327002122734,0.07803422999908961
455,309,7078.0,Sean,Longstaff,S.Longstaff,Sean Longstaff,14,3,4.5,100,1.2331323200763684,6.302263593162382,1.4005030207027516,0.06088525601978532
456,310,87.0,Joelinton Cássio,Apolinário de Lira,Joelinton,Joelinton,14,4,5.8,100,1.9337579986256148,9.935015122438042,1.7129336417996623,0.1489556120763959
457,311,7691.0,Jamal,Lewis,Lewis,Jamal Lewis,14,2,4.2,0,0.0,0.0,0.0,0.0
458,312,8016.0,Matthew,Longstaff,M.Longstaff,Matthew Longstaff,14,3,4.5,0,0.0,0.0,0.0,0.0
459,465,708.0,Federico,Fernández,Fernández,Federico Fernández,14,2,4.3,0,0.0,0.0,0.0,0.0
460,513,852.0,Freddie,Woodman,Woodman,Freddie Woodman,14,1,4.4,100,,,,
461,514,,Mark,Gillespie,Gillespie,,14,1,4.0,100,,,,
462,599,,Joe,White,White,,14,3,4.4,100,0.0,0.0,0.0,0.0
463,609,9154.0,Elliot,Anderson,Anderson,Elliot Anderson,14,3,4.5,100,0.0,0.0,0.0,0.0
464,145,7988.0,Billy,Gilmour,Gilmour,Billy Gilmour,15,3,4.4,100,1.5795680604725404,7.804477959132375,1.7737449907119032,0.09549190634882168
465,290,8075.0,Brandon,Williams,Williams,Brandon Williams,15,2,3.9,100,1.5000566529038823,7.449239027271764,1.910061289044042,0.17522349261274803
466,313,8022.0,Michael,McGovern,McGovern,Michael McGovern,15,1,4.0,100,,,,
467,314,982.0,Tim,Krul,Krul,Tim Krul,15,1,4.5,25,,,,
468,315,7696.0,Teemu,Pukki,Pukki,Teemu Pukki,15,4,5.9,100,3.9248440584560105,19.039039037327036,3.22695576903848,0.5377567073810612
469,316,7694.0,Marco,Stiepermann,Stiepermann,Marco Stiepermann,15,3,5.0,0,0.0,0.0,0.0,0.0
470,317,62.0,Lukas,Rupp,Rupp,Lukas Rupp,15,3,4.4,75,0.8128208599864413,3.939965747150055,0.8954467607159216,0.024336814900611802
471,318,7693.0,Kenny,McLean,McLean,Kenny McLean,15,3,4.9,100,2.2976648570745835,11.311332177465143,2.3084351382581927,0.18012042201235187
472,319,7690.0,Grant,Hanley,Hanley,Grant Hanley,15,2,4.4,0,0.0,0.0,0.0,0.0
473,320,7697.0,Onel,Hernández,Hernández,Onel Hernández,15,3,4.9,0,0.0,0.0,0.0,0.0
474,321,902.0,Sam,Byram,Byram,Sam Byram,15,2,4.4,100,0.2,1.0,0.2272727272727272,0.0027988552816657413
475,322,6526.0,Jordan,Hugill,Hugill,Jordan Hugill,15,4,5.4,0,0.0,0.0,0.0,0.0
476,323,1032.0,Kieran,Dowell,Dowell,Kieran Dowell,15,3,5.1,100,0.4443088156802968,2.199594865169201,0.4312931108174905,0.006544051994619417
477,324,7990.0,Christoph,Zimmermann,Zimmermann,Christoph Zimmermann,15,2,4.4,0,0.0,0.0,0.0,0.0
478,325,7695.0,Todd,Cantwell,Cantwell,Todd Cantwell,15,3,5.3,100,0.7779250436269768,3.843508470156676,0.7251902773880521,0.019226991681442818
479,326,7688.0,Max,Aarons,Aarons,Max Aarons,15,2,4.3,100,2.6518688918461097,13.054310774031029,3.035886226518844,0.48805926214680523
480,327,9748.0,Jacob,Sørensen,Sørensen,Jacob Sørensen,15,2,4.3,100,0.2321286956477231,1.150333958815608,0.2675195253059553,0.0037897673129578687
481,328,10097.0,Przemyslaw,Placheta,Placheta,Przemyslaw Placheta,15,3,4.7,100,0.4683298223401825,2.324166957019676,0.4945036078765267,0.007928085224723162
482,329,8021.0,Adam,Idah,Idah,Adam Idah,15,4,4.9,100,0.3446413029216702,1.6753858078241517,0.3419154709845207,0.005013965985249115
483,330,,Josh,Martin,Martin,,15,3,5.0,0,0.0,0.0,0.0,0.0
484,331,9833.0,Andrew,Omobamidele,Omobamidele,Andrew Omobamidele,15,2,3.9,0,0.0,0.0,0.0,0.0
485,448,5544.0,Angus,Gunn,Gunn,Angus Gunn,15,1,4.0,100,,,,
486,449,6523.0,Milot,Rashica,Rashica,Milot Rashica,15,3,5.2,0,0.0,0.0,0.0,0.0
487,456,1707.0,Ben,Gibson,Gibson,Ben Gibson,15,2,4.4,100,2.17695539437501,10.671966208656368,2.42544686560372,0.31876404276566506
488,457,9745.0,Dimitris,Giannoulis,Giannoulis,Dimitris Giannoulis,15,2,4.4,100,0.9050503898775292,4.484367828307355,1.0191745064334896,0.05628373371866674
489,471,5619.0,Pierre,Lees-Melou,Lees-Melou,Pierre Lees-Melou,15,3,4.8,100,1.611914286257025,7.894964260784191,1.6447842209967063,0.08957578491543683
490,515,9747.0,Bali,Mumba,Mumba,Bali Mumba,15,2,3.9,100,0.0,0.0,0.0,0.0
491,516,7295.0,Joshua,Sargent,Sargent,Joshua Sargent,15,4,5.4,100,1.662985167616967,8.152019076362105,1.509633162289279,0.10771704073484178
492,528,9746.0,Christos,Tzolis,Tzolis,Christos Tzolis,15,3,4.8,100,0.4064462801287715,1.9881849587993048,0.4142051997498551,0.005680726145711679
493,580,7376.0,Ozan,Kabak,Kabak,Ozan Kabak,15,2,4.4,100,1.2989102254790534,6.39490823217369,1.4533882345849294,0.11445877054812642
494,581,7470.0,Mathias,Normann,Normann,Mathias Normann,15,3,4.5,0,0.0,0.0,0.0,0.0
495,643,,Jonathan,Tomkinson,Tomkinson,,15,2,4.0,100,0.0,0.0,0.0,0.0
496,648,,Jonathan,Rowe,Rowe,,15,3,4.5,100,0.0,0.0,0.0,0.0
497,649,,Thomas,Dickson-Peters,Dickson-Peters,,15,4,4.5,100,0.0,0.0,0.0,0.0
498,332,503.0,Theo,Walcott,Walcott,Theo Walcott,16,3,5.8,100,0.9180919819540254,4.50921921949926,0.777451589568838,0.024182780186586185
499,333,831.0,Fraser,Forster,Forster,Fraser Forster,16,1,4.4,100,,,,
500,334,635.0,Alex,McCarthy,McCarthy,Alex McCarthy,16,1,4.5,0,,,,
501,335,842.0,Oriol,Romeu Vidal,Romeu,Oriol Romeu,16,3,4.5,100,2.013736277160047,10.011847464381956,2.2248549920848792,0.1536552692039188
502,336,790.0,Nathan,Redmond,Redmond,Nathan Redmond,16,3,5.9,100,2.5721666643709304,12.592751950264448,2.134364737332957,0.18540472974829386
503,338,1735.0,Jack,Stephens,Stephens,Jack Stephens,16,2,4.4,0,0.0,0.0,0.0,0.0
504,339,6893.0,Stuart,Armstrong,S.Armstrong,Stuart Armstrong,16,3,5.8,100,0.522488746281249,2.565089406879743,0.4422567942896109,0.007825435997554487
505,341,843.0,James,Ward-Prowse,Ward-Prowse,James Ward-Prowse,16,3,6.3,100,3.494813183813387,17.128580553005264,2.7188223100008355,0.3212430365707563
506,342,885.0,Kyle,Walker-Peters,Walker-Peters,Kyle Walker-Peters,16,2,4.8,100,1.8913007386969087,9.344333699864151,1.9467361874716984,0.2240209120812458
507,343,6042.0,Jan,Bednarek,Bednarek,Jan Bednarek,16,2,4.4,100,2.356562470375168,11.680794159610093,2.65472594536593,0.38187847969818145
508,344,,Daniel,N'Lundulu,Nlundulu,,16,4,4.5,0,0.0,0.0,0.0,0.0
509,345,7700.0,Che,Adams,Adams,Che Adams,16,4,6.8,100,2.6383235295247336,12.944166314179682,1.9035538697323064,0.21566866747019559
510,346,8456.0,Nathan,Tella,Tella,Nathan Tella,16,3,4.7,75,0.7390704964356021,3.618771331802444,0.7699513471920092,0.019220113474237414
511,347,8224.0,William,Smallbone,Smallbone,William Smallbone,16,3,4.5,100,0.1474549449203982,0.7332895010085341,0.1629532224463409,0.0008242708532415599
512,348,6504.0,Michael,Obafemi,Obafemi,Michael Obafemi,16,4,4.5,0,0.0,0.0,0.0,0.0
513,349,6736.0,Ibrahima,Diallo,Diallo,Ibrahima Diallo,16,3,4.5,100,0.7304426437712833,3.615401336703647,0.803422519267477,0.020036969530672022
514,350,7701.0,Moussa,Djenepo,Djenepo,Moussa Djenepo,16,3,5.2,100,0.7872301687370075,3.862757251317521,0.742837932945677,0.019793519001398713
515,351,6923.0,Mohammed,Salisu,Salisu,Mohammed Salisu,16,2,4.5,100,2.22538587974828,11.066459468791082,2.459213215286907,0.3351490567935725
516,460,6500.0,Romain,Perraud,Perraud,Romain Perraud,16,2,4.8,100,0.7492995736705822,3.734327183906514,0.7779848299805238,0.03577804571049083
517,491,9512.0,Tino,Livramento,Livramento,Valentino Livramento,16,2,4.4,100,2.493717674420284,12.359917151971532,2.8090720799935296,0.42757426979242186
518,517,6894.0,Mohamed,Elyounoussi,Elyounoussi,Mohamed Elyounoussi,16,3,5.4,100,2.2934209256174687,11.167243233653007,2.0680080062320383,0.1593051127946993
519,518,8384.0,Armando,Broja,Broja,Armando Broja,16,4,5.2,100,1.965071798079043,9.657181429693123,1.8571502749409856,0.1569803295626151
520,519,839.0,Shane,Long,Long,Shane Long,16,4,5.4,100,0.0505745343104708,0.2515346694497672,0.0465804943425494,0.00010255332489969992
521,525,4419.0,Adam,Armstrong,A.Armstrong,Adam Armstrong,16,4,5.8,100,2.815185012019875,13.73446642556855,2.368011452684233,0.28467110654316413
522,546,7280.0,Yan,Valery,Valery,Yan Valery,16,2,3.9,100,0.0,0.0,0.0,0.0
523,567,6252.0,Lyanco Evangelista,Silveira Neves Vojnovic,Lyanco,Lyanco,16,2,4.4,0,0.0,0.0,0.0,0.0
524,637,,Harry,Lewis,Lewis,,16,1,4.0,100,,,,
525,641,624.0,Willy,Caballero,Caballero,Willy Caballero,16,1,4.5,100,,,,
526,665,,Dynel,Simeu,Simeu,,16,2,4.0,100,0.0,0.0,0.0,0.0
527,352,609.0,Joe,Hart,Hart,Joe Hart,17,1,4.5,0,,,,
528,353,637.0,Hugo,Lloris,Lloris,Hugo Lloris,17,1,5.4,100,,,,
529,355,639.0,Toby,Alderweireld,Alderweireld,Toby Alderweireld,17,2,5.0,0,0.0,0.0,0.0,0.0
530,356,644.0,Erik,Lamela,Lamela,Erik Lamela,17,3,6.0,0,0.0,0.0,0.0,0.0
531,357,647.0,Harry,Kane,Kane,Harry Kane,17,4,12.1,100,4.4129713368604975,20.632789722226438,1.705189233241854,0.3079486700923347
532,358,3600.0,Serge,Aurier,Aurier,Serge Aurier,17,2,4.9,0,0.0,0.0,0.0,0.0
533,359,453.0,Heung-Min,Son,Son,Son Heung-Min,17,3,10.5,100,5.319049114040743,24.912201645474152,2.3725906329023,0.4077241584563436
534,360,6852.0,Matt,Doherty,Doherty,Matt Doherty,17,2,4.7,100,0.1043837186439175,0.511944966808927,0.1089244610231759,0.0006867233539195875
535,361,643.0,Eric,Dier,Dier,Eric Dier,17,2,4.6,100,2.6406178540587835,12.968974503670822,2.819342283406701,0.450284047301154
536,362,3293.0,Lucas,Rodrigues Moura da Silva,Lucas Moura,Lucas Moura,17,3,6.5,100,3.466721254269079,16.36146126988448,2.5171478876745352,0.28409418451167584
537,363,645.0,Bamidele,Alli,Dele,Dele Alli,17,3,6.2,100,1.5379932427744865,7.278764160242834,1.1739942193940054,0.05894610719500196
538,364,660.0,Ben,Davies,Davies,Ben Davies,17,2,4.5,100,0.0,0.0,0.0,0.0
539,365,343.0,Pierre-Emile,Højbjerg,Højbjerg,Pierre-Emile Højbjerg,17,3,5.0,100,2.8335773783040694,13.796089353421896,2.759217870684379,0.2625871778956074
540,366,971.0,Harry,Winks,Winks,Harry Winks,17,3,4.4,100,0.3836732279668661,1.9105577121976487,0.434217661863102,0.005722676134964477
541,367,6249.0,Davinson,Sánchez,Sánchez,Davinson Sánchez,17,2,4.5,100,1.8037896778252276,8.72006006158207,1.9377911247960156,0.2080940000945636
542,368,6837.0,Ryan,Sessegnon,Sessegnon,Ryan Sessegnon,17,2,4.3,0,0.0,0.0,0.0,0.0
543,369,8300.0,Steven,Bergwijn,Bergwijn,Steven Bergwijn,17,3,5.9,100,1.031212576312137,4.881473376347221,0.8273683688724103,0.0278600159933262
544,370,7187.0,Sergio,Reguilón,Reguilón,Sergio Reguilón,17,2,5.3,100,3.192172561863855,15.32554488990868,2.8916122433789964,0.5457441627832823
545,371,8222.0,Japhet,Tanganga,Tanganga,Japhet Tanganga,17,2,4.2,100,1.0376584028656564,5.061712521295009,1.205169647927383,0.0751240133417391
546,372,5681.0,Giovani,Lo Celso,Lo Celso,Giovani Lo Celso,17,3,5.9,75,0.6392558645985457,3.0085817851309766,0.5099291161238944,0.010582862537616583
547,373,7198.0,Oliver,Skipp,Skipp,Oliver Skipp,17,3,4.5,100,1.7597375898329506,8.696454243829724,1.9325453875177163,0.11593203033687349
548,374,6377.0,Joe,Rodon,Rodon,Joe Rodon,17,2,4.3,100,0.1372959160760169,0.6859770522958123,0.1595295470455377,0.0013476708650412227
549,375,5962.0,Tanguy,Ndombele,Ndombele,Tanguy NDombele Alvaro,17,3,5.7,100,1.0088495102237345,4.864316425344476,0.8533888465516624,0.028635205470648736
550,486,1841.0,Pierluigi,Gollini,Gollini,Pierluigi Gollini,17,1,4.3,100,,,,
551,487,7338.0,Bryan,Gil Salvatierra,Bryan,Bryan Gil Salvatierra,17,3,5.7,100,0.1033537834053148,0.5156670909634853,0.0904679106953482,0.00032180700985192355
552,494,7218.0,Cristian,Romero,Romero,Cristian Romero,17,2,4.9,0,0.0,0.0,0.0,0.0
553,520,9332.0,Dane,Scarlett,Scarlett,Dane Scarlett,17,4,4.5,100,0.0,0.0,0.0,0.0
554,588,7430.0,Emerson Aparecido,Leite de Souza Junior,Emerson Royal,Emerson,17,2,4.9,100,2.507132799591776,12.258795033393897,2.501794904774264,0.3776874961761879
555,597,,Dilan,Markanday,Markanday,,17,3,4.5,100,0.0,0.0,0.0,0.0
556,598,,Tobi,Omole,Omole,,17,2,4.0,100,0.0,0.0,0.0,0.0
557,659,,Brandon,Austin,Austin,,17,1,4.0,100,,,,
558,354,772.0,Moussa,Sissoko,Sissoko,Moussa Sissoko,18,3,4.4,100,2.1229364399881105,10.802986771847236,2.455224266328917,0.18296437444628444
559,376,803.0,Ben,Foster,Foster,Ben Foster,18,1,4.1,0,,,,
560,377,641.0,Danny,Rose,Rose,Danny Rose,18,2,4.2,100,1.131591332520769,5.753659458377137,1.369918918661223,0.09706711836066964
561,378,462.0,Dan,Gosling,Gosling,Dan Gosling,18,3,4.7,100,0.0263888888888888,0.1319444444444444,0.0280732860520094,2.555146954447474e-05
562,379,581.0,Craig,Cathcart,Cathcart,Craig Cathcart,18,2,4.3,100,1.8274281888478396,9.228167619045676,2.14608549280132,0.2438909093495964
563,380,574.0,Troy,Deeney,Deeney,Troy Deeney,18,4,5.4,0,0.0,0.0,0.0,0.0
564,381,596.0,Tom,Cleverley,Cleverley,Tom Cleverley,18,3,4.8,100,1.3203432836729712,6.763615405729606,1.4090865428603347,0.06574278458565905
565,382,5043.0,Francisco,Femenía Far,Femenía,Kiko Femenía,18,2,4.3,100,1.76810124083667,8.981654494015245,2.088756859073313,0.23103477462964014
566,383,1660.0,Andre,Gray,Gray,Andre Gray,18,4,5.4,0,0.0,0.0,0.0,0.0
567,384,1725.0,Christian,Kabasele,Kabasele,Christian Kabasele,18,2,4.3,0,0.0,0.0,0.0,0.0
568,385,1677.0,Nathaniel,Chalobah,Chalobah,Nathaniel Chalobah,18,3,5.0,0,0.0,0.0,0.0,0.0
569,387,6996.0,William,Troost-Ekong,Troost-Ekong,William Troost-Ekong,18,2,4.3,100,1.8322637678434155,9.189566690439245,2.137108532660289,0.24185481161698258
570,388,1154.0,Stipe,Perica,Perica,Stipe Perica,18,4,4.5,0,0.0,0.0,0.0,0.0
571,389,1025.0,Daniel,Bachmann,Bachmann,Daniel Bachmann,18,1,4.2,100,,,,
572,390,1441.0,Adam,Masina,Masina,Adam Masina,18,2,4.3,100,1.2522072302357212,6.350936336325831,1.4769619386804258,0.1155154788481602
573,391,6841.0,Ken,Sema,Sema,Ken Sema,18,3,5.2,100,0.668805439723789,3.411760804539566,0.6561078470268397,0.015441352259943968
574,392,,Philip,Zinckernagel,Zinckernagel,,18,3,5.5,0,0.0,0.0,0.0,0.0
575,393,1724.0,Isaac,Success Ajayi,Success,Isaac Success,18,4,5.0,0,0.0,0.0,0.0,0.0
576,394,,Ayotomiwa,Dele-Bashiru,Dele-Bashiru,,18,3,4.5,0,0.0,0.0,0.0,0.0
577,395,1675.0,Ashley,Fletcher,Fletcher,Ashley Fletcher,18,4,4.9,100,0.0396492289687253,0.2017917108050113,0.041181981796941,7.273749889442525e-05
578,396,7081.0,Francisco,Sierralta,Sierralta,Francisco Sierralta,18,2,4.3,100,0.7936507936507937,3.968253968253968,0.9228497600590624,0.04509865424821899
579,397,5573.0,Domingos,Quina,Quina,Domingos Quina,18,3,4.5,0,0.0,0.0,0.0,0.0
580,398,5085.0,Marc,Navarro,Navarro,Marc Navarro,18,2,4.0,0,0.0,0.0,0.0,0.0
581,399,5675.0,Ismaila,Sarr,Sarr,Ismaila Sarr,18,3,5.8,0,0.0,0.0,0.0,0.0
582,400,8235.0,Jeremy,Ngakia,Ngakia,Jeremy Ngakia,18,2,4.3,100,0.7028159392877519,3.533593197053765,0.8217658597799454,0.03576002094442534
583,401,7216.0,Ben,Wilmot,Wilmot,Ben Wilmot,18,2,4.5,0,0.0,0.0,0.0,0.0
584,402,,Joseph,Hungbo,Hungbo,,18,3,4.5,0,0.0,0.0,0.0,0.0
585,403,7278.0,Imrân,Louza,Louza,Imran Louza,18,3,5.2,100,0.4941126516912777,2.511700204321589,0.483019270061844,0.00836881141063553
586,404,8272.0,João Pedro,Junqueira de Jesus,João Pedro,João Pedro,18,4,5.4,100,1.53243071080533,7.933827133776957,1.4692272469957328,0.1020280312175927
587,405,,Kwadwo,Baah,Baah,,18,3,4.4,0,0.0,0.0,0.0,0.0
588,450,9301.0,Emmanuel,Dennis,Dennis,Emmanuel Dennis,18,4,6.0,100,3.7754871222723088,19.54745686191112,3.257909476985187,0.5574129771984855
589,454,,Matthew,Pollock,Pollock,,18,2,4.0,0,0.0,0.0,0.0,0.0
590,467,6538.0,Oghenekaro Peter,Etebo,Etebo,Oghenekaro Etebo,18,3,4.3,0,0.0,0.0,0.0,0.0
591,468,465.0,Joshua,King,King,Joshua King,18,4,5.8,100,3.65090925723996,19.280340010831697,3.324196553591672,0.5609823305279535
592,469,,Adedapo,Awokoya-Mebude,Mebude,,18,4,4.5,0,0.0,0.0,0.0,0.0
593,472,6954.0,Juan Camilo,Hernández Suárez,Cucho,Juan Camilo Hernández,18,4,5.0,100,1.4136302666871383,7.328420309861145,1.4656840619722291,0.09401529950495441
594,495,1123.0,Juraj,Kucka,Kucka,Juraj Kucka,18,3,5.5,100,1.9599046085856484,10.006909754177414,1.8194381371231665,0.12559397326506458
595,557,9957.0,Ozan,Tufan,Tufan,Ozan Tufan,18,3,5.0,100,0.52336012425303,2.680229887433936,0.5360459774867872,0.00991072921121734
596,574,,Robert,Elliot,Elliot,,18,1,4.0,100,,,,
597,618,3387.0,Nicolas,Nkoulou,Nkoulou,Nicolas N'Koulou,18,2,4.4,0,0.0,0.0,0.0,0.0
598,633,,James,Morris,Morris,,18,2,4.0,100,0.0,0.0,0.0,0.0
599,642,,Vincent,Angelini,Angelini,,18,1,4.0,100,,,,
600,128,935.0,Kurt,Zouma,Zouma,Kurt Zouma,19,2,5.4,25,0.4646864889006002,2.2930014295509187,0.4246298943612812,0.01199079590534989
601,406,533.0,Mark,Noble,Noble,Mark Noble,19,3,4.4,100,0.0032892363459146,0.0160908889402897,0.0036570202137022,4.059185712225282e-07
602,407,540.0,Darren,Randolph,Randolph,Darren Randolph,19,1,4.4,100,,,,
603,408,706.0,Lukasz,Fabianski,Fabianski,Lukasz Fabianski,19,1,5.0,100,,,,
604,409,528.0,Angelo,Ogbonna,Ogbonna,Angelo Ogbonna,19,2,4.9,0,0.0,0.0,0.0,0.0
605,410,529.0,Winston,Reid,Reid,Winston Reid,19,2,3.9,0,0.0,0.0,0.0,0.0
606,411,534.0,Aaron,Cresswell,Cresswell,Aaron Cresswell,19,2,5.3,75,2.337614473003267,11.484043284609584,2.166800619737658,0.3064410146486757
607,412,6274.0,Andriy,Yarmolenko,Yarmolenko,Andriy Yarmolenko,19,3,5.1,100,0.1211764232480966,0.5856647008522519,0.1148362158533827,0.0004639374648893155
608,413,531.0,Michail,Antonio,Antonio,Michail Antonio,19,4,7.7,100,5.490118845334524,26.153578180812364,3.3965685949106965,0.77753384727941
609,414,804.0,Craig,Dawson,Dawson,Craig Dawson,19,2,4.9,100,1.8467248644269456,9.006393638988806,1.8380395181609808,0.20386322439355006
610,415,6891.0,Ryan,Fredericks,Fredericks,Ryan Fredericks,19,2,4.4,100,0.0025947721583904,0.0125902910712825,0.0028614297889278,4.436617464087817e-07
611,416,535.0,Manuel,Lanzini,Lanzini,Manuel Lanzini,19,3,5.8,100,1.0633960397563398,5.108203326826785,0.8807247115218595,0.03103415183853894
612,417,1760.0,Arthur,Masuaku,Masuaku,Arthur Masuaku,19,2,4.4,100,0.9273562913041828,4.55654159645803,1.035577635558643,0.058110032973008936
613,418,8965.0,Vladimir,Coufal,Coufal,Vladimir Coufal,19,2,4.7,100,1.9695607432419335,9.61067982771867,2.0448254952592912,0.24201566662384674
614,419,3585.0,Saïd,Benrahma,Benrahma,Said Benrahma,19,3,5.9,100,3.6847427696417183,17.7232483462443,3.0039403976685253,0.36725368105919665
615,420,1776.0,Jarrod,Bowen,Bowen,Jarrod Bowen,19,3,6.5,100,4.644563495848137,22.11562060336419,3.402403169748337,0.5190586445306027
616,421,5553.0,Declan,Rice,Rice,Declan Rice,19,3,5.1,0,0.0,0.0,0.0,0.0
617,422,8288.0,Tomas,Soucek,Soucek,Tomas Soucek,19,3,5.7,100,3.5393879434711453,17.169091222856213,3.012121267167757,0.35673956927915024
618,423,2335.0,Pablo,Fornals,Fornals,Pablo Fornals,19,3,6.0,100,3.4589795749878043,16.598105842391217,2.766350973731869,0.3167359301130919
619,424,3203.0,Issa,Diop,Diop,Issa Diop,19,2,4.3,100,0.5155832693368607,2.5505526117920163,0.5931517701841899,0.01863087435660265
620,425,6424.0,Ben,Johnson,Johnson,Ben Johnson,19,2,4.0,100,1.131245541178353,5.596408441009302,1.3991021102523256,0.09642550774249188
621,489,2310.0,Alphonse,Areola,Areola,Alphonse Areola,19,1,4.7,100,,,,
622,521,,Frederik,Alves,Alves,,19,2,4.0,0,0.0,0.0,0.0,0.0
623,522,,Conor,Coventry,Coventry,,19,3,4.5,0,0.0,0.0,0.0,0.0
624,554,,Jamal,Baptiste,Baptiste,,19,2,4.0,100,0.0,0.0,0.0,0.0
625,582,6276.0,Nikola,Vlasic,Vlasic,Nikola Vlasic,19,3,5.7,100,0.3194520615605306,1.5725869223635065,0.2758924425199133,0.0029928571399488045
626,589,,Alex,Kral,Kral,,19,3,4.4,100,0.0,0.0,0.0,0.0
627,617,10061.0,Harrison,Ashby,Ashby,Harrison Ashby,19,2,4.0,100,0.0121212121212121,0.0606060606060605,0.0151515151515151,1.1308506188548392e-05
628,634,,Sonny,Perkins,Perkins,,19,3,4.5,100,0.0,0.0,0.0,0.0
629,644,,Ajibola,Alese,Alese,,19,2,4.0,100,0.0,0.0,0.0,0.0
630,652,,Armstrong,Oko-Flex,Oko-Flex,,19,3,4.5,100,0.0,0.0,0.0,0.0
631,426,3422.0,João Filipe Iria,Santos Moutinho,Moutinho,João Moutinho,20,3,4.9,100,2.290565065183729,11.78016997986957,2.404116322422361,0.19536130926554396
632,427,6849.0,Rui Pedro,dos Santos Patrício,Patrício,Rui Patrício,20,1,5.0,0,,,,
633,428,6850.0,Willy,Boly,Boly,Willy Boly,20,2,4.9,100,0.0,0.0,0.0,0.0
634,429,6851.0,Conor,Coady,Coady,Conor Coady,20,2,4.5,100,2.500522010988295,12.689011497071585,2.819780332682574,0.44063215631653097
635,430,4105.0,Raúl,Jiménez,Jiménez,Raúl Jiménez,20,4,7.5,100,3.142561199114051,16.472495630411274,2.196332750721503,0.3166688446816839
636,431,3491.0,Romain,Saïss,Saïss,Romain Saiss,20,2,5.0,100,2.99832069532258,15.58490690180916,3.1169813803618323,0.5982346171341523
637,432,5708.0,Fernando,Marçal,Marçal,Fernando Marçal,20,2,4.2,100,1.6461441359006974,8.35842315286152,1.990100750681314,0.20484838163160612
638,433,2280.0,Jonathan,Castro Otto,Jonny,Jonny,20,2,4.5,0,0.0,0.0,0.0,0.0
639,434,7236.0,Leander,Dendoncker,Dendoncker,Leander Dendoncker,20,3,4.8,100,1.083308710740352,5.611587823874867,1.1690807966405974,0.04525450449969356
640,435,900.0,Adama,Traoré,Traoré,Adama Traoré,20,3,5.6,100,1.969598221909881,10.441023547235512,1.86446849057777,0.13428566260722857
641,436,6853.0,Rúben Diogo,da Silva Neves,Neves,Rúben Neves,20,3,5.3,100,2.1093863230415133,10.820370914537436,2.0415794178372524,0.1523842037555604
642,437,6163.0,Nélson,Cabral Semedo,Semedo,Nélson Semedo,20,2,4.8,100,2.4412809436851863,12.56448527101702,2.617601098128546,0.4050244915887703
643,438,8291.0,Daniel,Castelo Podence,Podence,Daniel Podence,20,3,5.5,100,1.0913211251183843,5.775184843635869,1.0500336079337944,0.04183122777776113
644,439,7332.0,Max,Kilman,Kilman,Max Kilman,20,2,4.5,100,2.375451619746135,12.142025185863195,2.6982278190807105,0.4034622115794244
645,440,6857.0,Morgan,Gibbs-White,Gibbs-White,Morgan Gibbs-White,20,3,4.5,0,0.0,0.0,0.0,0.0
646,441,6382.0,Pedro,Lomba Neto,Neto,Pedro Neto,20,3,6.4,0,0.0,0.0,0.0,0.0
647,442,8180.0,Owen,Otasowie,Otasowie,Owen Otasowie,20,3,4.5,0,0.0,0.0,0.0,0.0
648,443,8351.0,Ki-Jana,Hoever,Hoever,Ki-Jana Hoever,20,2,3.9,100,0.2501677538676918,1.263750236542095,0.3240385221902808,0.005043023739273783
649,444,,Andreas,Söndergaard,Söndergaard,,20,1,3.9,0,,,,
650,445,8778.0,Fabio,Silva,Fabio Silva,Fabio Silva,20,4,5.6,75,0.04817714668547,0.2572039003023604,0.0459292679111357,0.00010339865084060137
651,446,,Yerson,Mosquera Valdelamar,Mosquera,,20,2,4.4,0,0.0,0.0,0.0,0.0
652,452,785.0,John,Ruddy,Ruddy,John Ruddy,20,1,4.4,100,,,,
653,461,8934.0,Francisco,Machado Mota de Castro Trincão,Trincão,Trincão,20,3,5.6,100,1.8930159675306115,10.156594449675318,1.813677580299164,0.12706903128665098
654,470,6674.0,Rayan,Ait Nouri,Ait Nouri,Rayan Ait Nouri,20,2,4.3,75,1.094955960406172,5.599070399583071,1.302109395251877,0.0897834977404314
655,475,9740.0,José,Malheiro de Sá,Sá,José Sá,20,1,5.1,100,,,,
656,523,4918.0,Patrick,Cutrone,Cutrone,Patrick Cutrone,20,4,5.0,0,0.0,0.0,0.0,0.0
657,547,,Luke,Cundle,Cundle,,20,3,4.5,100,0.0,0.0,0.0,0.0
658,548,,Chem,Campbell,Campbell,,20,3,4.5,100,0.0,0.0,0.0,0.0
659,549,,Christian,Marques,Marques,,20,2,4.0,0,0.0,0.0,0.0,0.0
660,583,8845.0,Hee-Chan,Hwang,Hwang,Hee-Chan Hwang,20,4,5.5,0,0.0,0.0,0.0,0.0
661,611,,Louie,Moulden,Moulden,,20,1,4.0,100,,,,
662,621,,James,Storer,Storer,,20,1,4.0,100,,,,
663,635,,Hugo,Bueno,Bueno,,20,2,4.0,100,0.0,0.0,0.0,0.0
664,661,,Bruno André,Cavaco Jordão,Jordão,,20,3,4.5,100,0.0,0.0,0.0,0.0
