gameweek,minutes,G,A,xG,xA,bonus,points,price,available
2020/21,2640.0,2.0,4.0,2.0761541817337275,5.271671320311725,5.0,94.0,,0.0
1,90.0,0.0,0.0,0.7481988668441772,0.081414982676506,0.0,2.0,6.0,1.0
2,90.0,0.0,0.0,0.6998610496520996,0.1591017097234726,0.0,2.0,6.0,1.0
3,88.0,0.0,0.0,0.0509335398674011,0.3675090968608856,0.0,2.0,6.0,1.0
4,82.0,0.0,0.0,0.0,0.0758291557431221,0.0,3.0,6.0,1.0
5,90.0,0.0,0.0,0.057142399251461,0.055262666195631,0.0,2.0,6.0,1.0
6,18.0,0.0,0.0,0.0,0.0,0.0,1.0,6.0,1.0
7,1.0,0.0,0.0,0.0,0.0,0.0,1.0,6.0,1.0
8,90.0,0.0,0.0,0.3675370216369629,0.0,0.0,5.0,6.0,1.0
9,77.0,0.0,0.0,0.0,0.0364875495433807,0.0,3.0,5.9,1.0
10,0.0,0.0,0.0,0.0,0.0,0.0,0.0,5.9,1.0
11,19.0,0.0,0.0,0.0,0.0,0.0,1.0,5.8,1.0
12,14.0,0.0,0.0,0.1249229684472084,0.0,0.0,1.0,5.8,1.0
13,20.0,0.0,0.0,0.0,0.0,0.0,1.0,5.7,1.0
14,90.0,0.0,0.0,0.2414331287145614,0.0511314161121845,0.0,3.0,5.7,1.0
15,90.0,0.0,0.0,0.0,0.0,0.0,3.0,5.7,1.0
16,74.0,0.0,0.0,0.0,0.0,0.0,2.0,5.7,1.0
17,75.0,0.0,0.0,0.0,0.5103616714477539,0.0,3.0,5.7,1.0
18,7.0,0.0,0.0,0.0,0.0,0.0,1.0,5.7,1.0
19,,,,,,,,,
20,,,,,,,,,
21,,,,,,,,,
22,,,,,,,,,
23,,,,,,,,,
24,,,,,,,,,
25,,,,,,,,,
26,,,,,,,,,
27,,,,,,,,,
28,,,,,,,,,
29,,,,,,,,,
30,,,,,,,,,
31,,,,,,,,,
32,,,,,,,,,
33,,,,,,,,,
34,,,,,,,,,
35,,,,,,,,,
36,,,,,,,,,
37,,,,,,,,,
38,,,,,,,,,
total,1015.0,0.0,0.0,2.290028974413872,1.3370982483029366,0.0,36.0,99.7,0.0
