gameweek,minutes,G,A,xG,xA,bonus,points,price,available
2020/21,0.0,0.0,0.0,0.0,0.0,0.0,0.0,0.0,0.0
1,0.0,0.0,0.0,0.0,0.0,0.0,0.0,0.0,0.0
2,0.0,0.0,0.0,0.0,0.0,0.0,0.0,0.0,0.0
3,0.0,0.0,0.0,0.0,0.0,0.0,0.0,6.0,1.0
4,15.0,0.0,0.0,0.5437225103378296,0.0,0.0,1.0,6.0,1.0
5,42.0,0.0,0.0,0.1123659312725067,0.0627495944499969,0.0,1.0,6.0,1.0
6,82.0,0.0,0.0,0.0450318679213523,0.3606738746166229,1.0,3.0,6.0,1.0
7,82.0,0.0,0.0,0.0475115217268466,0.0,0.0,2.0,6.0,1.0
8,0.0,0.0,0.0,0.0,0.0,0.0,0.0,6.0,1.0
9,0.0,0.0,0.0,0.0,0.0,0.0,0.0,6.0,1.0
10,42.0,0.0,0.0,0.0417176894843578,0.0,0.0,1.0,6.0,1.0
11,82.0,0.0,0.0,0.0,0.1208948343992233,0.0,2.0,6.0,1.0
12,48.0,0.0,0.0,0.0,0.0,0.0,1.0,6.0,1.0
13,77.0,1.0,0.0,0.8233782649040222,0.0760315880179405,0.0,7.0,6.0,1.0
14,62.0,0.0,0.0,0.0,0.0481293760240078,0.0,1.0,6.0,1.0
15,68.0,0.0,0.0,0.0,0.0620012059807777,0.0,2.0,6.0,1.0
16,0.0,0.0,0.0,0.0,0.0,0.0,0.0,6.0,0.0
17,,,,,,,,,
18,,,,,,,,,
19,90.0,1.0,0.0,0.4363333582878113,0.13016954064369202,0.0,7.0,6.0,1.0
20,,,,,,,,,
21,,,,,,,,,
22,,,,,,,,,
23,,,,,,,,,
24,,,,,,,,,
25,,,,,,,,,
26,,,,,,,,,
27,,,,,,,,,
28,,,,,,,,,
29,,,,,,,,,
30,,,,,,,,,
31,,,,,,,,,
32,,,,,,,,,
33,,,,,,,,,
34,,,,,,,,,
35,,,,,,,,,
36,,,,,,,,,
37,,,,,,,,,
38,,,,,,,,,
total,690.0,2.0,0.0,2.0500611439347267,0.8606500141322613,1.0,28.0,66.0,0.0
