gameweek,minutes,G,A,xG,xA,bonus,points,price,available
2020/21,1810.0,2.0,0.0,0.5630812272429466,0.8973613884299994,4.0,64.0,,0.0
1,78.0,0.0,0.0,0.0,0.0,0.0,2.0,5.0,1.0
2,0.0,0.0,0.0,0.0,0.0,0.0,0.0,5.0,1.0
3,0.0,0.0,0.0,0.0,0.0,0.0,0.0,4.9,1.0
4,0.0,0.0,0.0,0.0,0.0,0.0,0.0,4.9,1.0
5,24.0,0.0,0.0,0.0,0.053624365478754,0.0,1.0,4.9,1.0
6,0.0,0.0,0.0,0.0,0.0,0.0,0.0,4.9,1.0
7,0.0,0.0,0.0,0.0,0.0,0.0,0.0,4.8,1.0
8,0.0,0.0,0.0,0.0,0.0,0.0,0.0,4.8,1.0
9,0.0,0.0,0.0,0.0,0.0,0.0,0.0,4.8,1.0
10,0.0,0.0,0.0,0.0,0.0,0.0,0.0,4.8,1.0
11,0.0,0.0,0.0,0.0,0.0,0.0,0.0,4.8,1.0
12,0.0,0.0,0.0,0.0,0.0,0.0,0.0,4.8,1.0
13,0.0,0.0,0.0,0.0,0.0,0.0,0.0,4.8,1.0
14,0.0,0.0,0.0,0.0,0.0,0.0,0.0,4.8,1.0
15,0.0,0.0,0.0,0.0,0.0,0.0,0.0,4.8,1.0
16,0.0,0.0,0.0,0.0,0.0,0.0,0.0,4.8,1.0
17,0.0,0.0,0.0,0.0,0.0,0.0,0.0,4.7,1.0
18,,,,,,,,,
19,0.0,0.0,0.0,0.0,0.0,0.0,0.0,4.7,1.0
20,,,,,,,,,
21,,,,,,,,,
22,,,,,,,,,
23,,,,,,,,,
24,,,,,,,,,
25,,,,,,,,,
26,,,,,,,,,
27,,,,,,,,,
28,,,,,,,,,
29,,,,,,,,,
30,,,,,,,,,
31,,,,,,,,,
32,,,,,,,,,
33,,,,,,,,,
34,,,,,,,,,
35,,,,,,,,,
36,,,,,,,,,
37,,,,,,,,,
38,,,,,,,,,
total,102.0,0.0,0.0,0.0,0.053624365478754,0.0,3.0,9.9,0.0
