gameweek,minutes,G,A,xG,xA,bonus,points,price,available
2020/21,2428.0,1.0,2.0,0.3886227561160922,3.2330581322312355,2.0,67.0,,0.0
1,0.0,0.0,0.0,0.0,0.0,0.0,0.0,5.0,1.0
2,90.0,0.0,0.0,0.0199241861701011,0.090700164437294,0.0,2.0,5.0,1.0
3,90.0,0.0,0.0,0.0875208005309104,0.0281741227954626,0.0,1.0,5.0,1.0
4,90.0,0.0,0.0,0.0,0.0,0.0,2.0,4.9,1.0
5,90.0,0.0,0.0,0.0395824760198593,0.0,0.0,2.0,4.9,1.0
6,90.0,0.0,0.0,0.0255386643111705,0.0,0.0,2.0,4.9,1.0
7,90.0,0.0,0.0,0.0,0.0,0.0,3.0,4.9,1.0
8,0.0,0.0,0.0,0.0,0.0,0.0,0.0,4.9,0.0
9,0.0,0.0,0.0,0.0,0.0,0.0,0.0,4.8,1.0
10,90.0,0.0,1.0,0.0,0.0356029719114303,0.0,5.0,4.8,1.0
11,90.0,0.0,0.0,0.3659019768238067,0.9246001839637756,0.0,2.0,4.8,1.0
12,90.0,0.0,0.0,0.0649005025625228,0.0,0.0,1.0,4.8,1.0
13,48.0,0.0,0.0,0.0,0.0,0.0,1.0,4.8,1.0
14,90.0,0.0,0.0,0.0610361695289611,0.0359169952571392,0.0,3.0,4.8,1.0
15,58.0,0.0,0.0,0.0211815740913152,0.0,0.0,1.0,4.8,1.0
16,0.0,0.0,0.0,0.0,0.0,0.0,0.0,4.8,0.0
17,0.0,0.0,0.0,0.0,0.0,0.0,0.0,4.8,0.0
18,0.0,0.0,0.0,0.0,0.0,0.0,0.0,4.8,0.0
19,,,,,,,,,
20,,,,,,,,,
21,,,,,,,,,
22,,,,,,,,,
23,,,,,,,,,
24,,,,,,,,,
25,,,,,,,,,
26,,,,,,,,,
27,,,,,,,,,
28,,,,,,,,,
29,,,,,,,,,
30,,,,,,,,,
31,,,,,,,,,
32,,,,,,,,,
33,,,,,,,,,
34,,,,,,,,,
35,,,,,,,,,
36,,,,,,,,,
37,,,,,,,,,
38,,,,,,,,,
total,1006.0,0.0,1.0,0.6855863500386474,1.1149944383651018,0.0,25.0,58.4,0.0
