gameweek,minutes,G,A,xG,xA,bonus,points,price,available
2020/21,2426.0,4.0,2.0,3.509381879121065,3.1359253535047174,8.0,97.0,,0.0
1,90.0,0.0,0.0,0.0710291638970375,0.0207067839801311,0.0,2.0,5.5,1.0
2,90.0,0.0,0.0,0.0,0.0913029685616493,0.0,2.0,5.5,1.0
3,90.0,0.0,0.0,0.0,0.0,0.0,2.0,5.4,1.0
4,90.0,0.0,0.0,0.0113467946648597,0.0068150064907968,0.0,2.0,5.4,1.0
5,65.0,0.0,0.0,0.1802196353673935,0.5388690829277039,0.0,1.0,5.4,1.0
6,83.0,0.0,0.0,0.0555436909198761,0.0258006565272808,0.0,2.0,5.4,1.0
7,80.0,0.0,0.0,0.0,0.0,0.0,2.0,5.4,1.0
8,0.0,0.0,0.0,0.0,0.0,0.0,0.0,5.3,1.0
9,22.0,0.0,0.0,0.0,0.0117081627249717,0.0,1.0,5.3,1.0
10,20.0,0.0,0.0,0.0101144164800643,0.0,0.0,1.0,5.3,1.0
11,77.0,0.0,0.0,0.0,0.0396049618721008,0.0,2.0,5.2,1.0
12,0.0,0.0,0.0,0.0,0.0,0.0,0.0,5.2,1.0
13,19.0,0.0,0.0,0.0,0.0224141012877225,0.0,1.0,5.2,1.0
14,11.0,0.0,0.0,0.0,0.0,0.0,1.0,5.2,1.0
15,89.0,0.0,0.0,0.4052698314189911,0.0,0.0,3.0,5.2,1.0
16,64.0,0.0,0.0,0.048754908144474,0.0,0.0,2.0,5.1,1.0
17,0.0,0.0,0.0,0.0,0.0,0.0,0.0,5.1,1.0
18,81.0,0.0,0.0,0.0,0.0,0.0,2.0,5.1,1.0
19,10.0,0.0,0.0,0.039326515048742294,0.0,0.0,1.0,5.1,1.0
20,,,,,,,,,
21,,,,,,,,,
22,,,,,,,,,
23,,,,,,,,,
24,,,,,,,,,
25,,,,,,,,,
26,,,,,,,,,
27,,,,,,,,,
28,,,,,,,,,
29,,,,,,,,,
30,,,,,,,,,
31,,,,,,,,,
32,,,,,,,,,
33,,,,,,,,,
34,,,,,,,,,
35,,,,,,,,,
36,,,,,,,,,
37,,,,,,,,,
38,,,,,,,,,
total,981.0,0.0,0.0,0.8216049559414385,0.757221724372357,0.0,27.0,84.69999999999999,0.0
