gameweek,minutes,G,A,xG,xA,bonus,points,price,available
2020/21,1417.0,0.0,1.0,0.1774021964520216,0.9561843797564508,1.0,47.0,,0.0
1,0.0,0.0,0.0,0.0,0.0,0.0,0.0,5.0,1.0
2,0.0,0.0,0.0,0.0,0.0,0.0,0.0,5.0,1.0
3,0.0,0.0,0.0,0.0,0.0,0.0,0.0,4.9,1.0
4,0.0,0.0,0.0,0.0,0.0,0.0,0.0,4.9,1.0
5,7.0,0.0,0.0,0.0130245517939329,0.0,0.0,1.0,4.9,1.0
6,5.0,0.0,0.0,0.0311106238514184,0.0,0.0,1.0,4.9,1.0
7,17.0,0.0,0.0,0.0,0.0,0.0,1.0,4.9,1.0
8,0.0,0.0,0.0,0.0,0.0,0.0,0.0,4.9,1.0
9,90.0,1.0,0.0,0.8717240691184998,0.0,0.0,7.0,4.9,1.0
10,0.0,0.0,0.0,0.0,0.0,0.0,0.0,4.9,1.0
11,29.0,0.0,0.0,0.0909883230924606,0.0,0.0,1.0,4.9,1.0
12,0.0,0.0,0.0,0.0,0.0,0.0,0.0,4.9,0.0
13,0.0,0.0,0.0,0.0,0.0,0.0,0.0,4.9,0.0
14,0.0,0.0,0.0,0.0,0.0,0.0,0.0,4.9,0.0
15,0.0,0.0,0.0,0.0,0.0,0.0,0.0,4.8,0.0
16,0.0,0.0,0.0,0.0,0.0,0.0,0.0,4.8,0.0
17,0.0,0.0,0.0,0.0,0.0,0.0,0.0,4.8,0.0
18,,,,,,,,,
19,,,,,,,,,
20,,,,,,,,,
21,,,,,,,,,
22,,,,,,,,,
23,,,,,,,,,
24,,,,,,,,,
25,,,,,,,,,
26,,,,,,,,,
27,,,,,,,,,
28,,,,,,,,,
29,,,,,,,,,
30,,,,,,,,,
31,,,,,,,,,
32,,,,,,,,,
33,,,,,,,,,
34,,,,,,,,,
35,,,,,,,,,
36,,,,,,,,,
37,,,,,,,,,
38,,,,,,,,,
total,148.0,1.0,0.0,1.0068475678563118,0.0,0.0,11.0,24.5,0.0
