gameweek,minutes,G,A,xG,xA,bonus,points,price,available
2020/21,0.0,0.0,0.0,0.0,0.0,0.0,0.0,,0.0
1,26.0,0.0,0.0,0.0,0.0,0.0,1.0,5.0,1.0
2,5.0,0.0,0.0,0.0,0.0,0.0,1.0,5.0,1.0
3,0.0,0.0,0.0,0.0,0.0,0.0,0.0,4.9,1.0
4,0.0,0.0,0.0,0.0,0.0,0.0,0.0,4.9,1.0
5,77.0,0.0,0.0,0.0322624333202838,0.0,0.0,2.0,4.9,1.0
6,66.0,0.0,0.0,0.1081049367785453,0.0934126004576683,0.0,2.0,4.8,1.0
7,28.0,0.0,0.0,0.0,0.0,0.0,1.0,4.8,1.0
8,90.0,0.0,0.0,0.0,0.0,0.0,2.0,4.8,1.0
9,90.0,0.0,0.0,0.0439927540719509,0.0,0.0,2.0,4.8,1.0
10,90.0,0.0,0.0,0.0,0.0,0.0,2.0,4.8,1.0
11,90.0,0.0,1.0,0.0237288661301136,0.075253702700138,1.0,6.0,4.8,1.0
12,77.0,0.0,0.0,0.0,0.0,0.0,2.0,4.8,1.0
13,90.0,0.0,0.0,0.0,0.0461644530296325,0.0,2.0,4.8,1.0
14,47.0,0.0,0.0,0.0,0.0,0.0,1.0,4.8,1.0
15,0.0,0.0,0.0,0.0,0.0,0.0,0.0,4.8,1.0
16,85.0,0.0,0.0,0.0,0.0,0.0,3.0,4.8,1.0
17,,,,,,,,,
18,,,,,,,,,
19,0.0,0.0,0.0,0.0,0.0,0.0,0.0,4.8,1.0
20,,,,,,,,,
21,,,,,,,,,
22,,,,,,,,,
23,,,,,,,,,
24,,,,,,,,,
25,,,,,,,,,
26,,,,,,,,,
27,,,,,,,,,
28,,,,,,,,,
29,,,,,,,,,
30,,,,,,,,,
31,,,,,,,,,
32,,,,,,,,,
33,,,,,,,,,
34,,,,,,,,,
35,,,,,,,,,
36,,,,,,,,,
37,,,,,,,,,
38,,,,,,,,,
total,861.0,0.0,1.0,0.2080889903008937,0.2148307561874389,1.0,27.0,62.9,0.0
