gameweek,minutes,G,A,xG,xA,bonus,points,price,available
2020/21,511.0,1.0,2.0,0.2947287252172827,1.0433875694870949,0.0,32.0,,0.0
1,0.0,0.0,0.0,0.0,0.0,0.0,0.0,5.9,1.0
2,0.0,0.0,0.0,0.0,0.0,0.0,0.0,5.9,1.0
3,0.0,0.0,0.0,0.0,0.0,0.0,0.0,5.8,1.0
4,2.0,0.0,0.0,0.0,0.0,0.0,1.0,5.8,1.0
5,0.0,0.0,0.0,0.0,0.0,0.0,0.0,5.8,1.0
6,0.0,0.0,0.0,0.0,0.0,0.0,0.0,5.8,1.0
7,0.0,0.0,0.0,0.0,0.0,0.0,0.0,5.7,1.0
8,0.0,0.0,0.0,0.0,0.0,0.0,0.0,5.7,1.0
9,0.0,0.0,0.0,0.0,0.0,0.0,0.0,5.7,1.0
10,0.0,0.0,0.0,0.0,0.0,0.0,0.0,5.7,1.0
11,9.0,0.0,0.0,0.0,0.0,0.0,1.0,5.7,1.0
12,41.0,1.0,0.0,0.6744329929351807,0.3933870494365692,1.0,7.0,5.7,1.0
13,1.0,0.0,0.0,0.0,0.0,0.0,1.0,5.7,1.0
14,1.0,0.0,0.0,0.0,0.0,0.0,1.0,5.7,1.0
15,3.0,0.0,0.0,0.0,0.0,0.0,1.0,5.7,1.0
16,1.0,0.0,0.0,0.0,0.0,0.0,1.0,5.7,1.0
17,,,,,,,,,
18,,,,,,,,,
19,0.0,0.0,0.0,0.0,0.0,0.0,0.0,5.7,1.0
20,,,,,,,,,
21,,,,,,,,,
22,,,,,,,,,
23,,,,,,,,,
24,,,,,,,,,
25,,,,,,,,,
26,,,,,,,,,
27,,,,,,,,,
28,,,,,,,,,
29,,,,,,,,,
30,,,,,,,,,
31,,,,,,,,,
32,,,,,,,,,
33,,,,,,,,,
34,,,,,,,,,
35,,,,,,,,,
36,,,,,,,,,
37,,,,,,,,,
38,,,,,,,,,
total,58.0,1.0,0.0,0.6744329929351807,0.3933870494365692,1.0,13.0,40.00000000000001,0.0
