gameweek,minutes,G,A,xG,xA,bonus,points,price,available
2020/21,2602.0,5.0,6.0,5.412756389006972,5.398416234180331,15.0,132.0,,0.0
1,79.0,0.0,0.0,0.0763241872191429,0.0,0.0,2.0,6.5,1.0
2,74.0,0.0,0.0,0.0567237176001071,0.0,0.0,3.0,6.4,1.0
3,90.0,0.0,0.0,0.2413157969713211,0.0214244723320007,0.0,2.0,6.4,1.0
4,90.0,1.0,0.0,0.0933308899402618,0.1678348183631897,3.0,11.0,6.4,1.0
5,90.0,0.0,1.0,0.0624527744948864,0.1411315351724624,0.0,5.0,6.4,1.0
6,90.0,0.0,0.0,0.0891196206212043,0.0,0.0,1.0,6.4,1.0
7,90.0,0.0,0.0,0.2566887438297272,0.1323109865188598,0.0,3.0,6.4,1.0
8,90.0,0.0,0.0,0.1908468455076217,0.0,0.0,3.0,6.4,1.0
9,90.0,0.0,0.0,0.1624640822410583,0.1332586407661438,0.0,2.0,6.4,1.0
10,90.0,1.0,0.0,0.5377334952354431,0.3054345250129699,2.0,9.0,6.4,1.0
11,90.0,1.0,0.0,0.9400849342346193,0.1783642023801803,3.0,10.0,6.5,1.0
12,90.0,0.0,0.0,0.1549500524997711,0.3916531205177307,0.0,2.0,6.5,1.0
13,90.0,0.0,0.0,0.2355687916278839,0.1002568900585174,0.0,3.0,6.5,1.0
14,90.0,0.0,0.0,0.0472902581095695,0.0847313776612281,0.0,2.0,6.5,1.0
15,90.0,0.0,0.0,0.0241976827383041,0.0641102865338325,0.0,2.0,6.4,1.0
16,,,,,,,,,
17,90.0,0.0,0.0,0.1132301837205886,0.0201549082994461,0.0,2.0,6.3,1.0
18,,,,,,,,,
19,50.0,1.0,0.0,0.3428947627544403,0.0,0.0,6.0,6.2,1.0
20,,,,,,,,,
21,,,,,,,,,
22,,,,,,,,,
23,,,,,,,,,
24,,,,,,,,,
25,,,,,,,,,
26,,,,,,,,,
27,,,,,,,,,
28,,,,,,,,,
29,,,,,,,,,
30,,,,,,,,,
31,,,,,,,,,
32,,,,,,,,,
33,,,,,,,,,
34,,,,,,,,,
35,,,,,,,,,
36,,,,,,,,,
37,,,,,,,,,
38,,,,,,,,,
total,1463.0,4.0,1.0,3.625216819345951,1.740665763616562,8.0,68.0,109.0,0.0
