gameweek,minutes,G,A,xG,xA,bonus,points,price,available
2020/21,2729.0,1.0,1.0,1.3567862249910831,0.4516803417354822,7.0,93.0,,0.0
1,32.0,0.0,0.0,0.0,0.0,0.0,1.0,4.5,1.0
2,90.0,0.0,0.0,0.0618524551391601,0.0,0.0,5.0,4.5,1.0
3,90.0,0.0,0.0,0.0,0.0125257326290011,0.0,1.0,4.5,1.0
4,90.0,0.0,0.0,0.0,0.0,1.0,7.0,4.5,1.0
5,90.0,0.0,0.0,0.0,0.0,0.0,1.0,4.5,1.0
6,90.0,0.0,0.0,0.0,0.0585113503038883,0.0,2.0,4.5,1.0
7,90.0,0.0,0.0,0.0,0.0173954553902149,0.0,0.0,4.5,1.0
8,90.0,0.0,0.0,0.0,0.0,0.0,1.0,4.5,1.0
9,90.0,0.0,0.0,0.0,0.0,0.0,1.0,4.5,1.0
10,90.0,0.0,0.0,0.0,0.0,0.0,6.0,4.5,1.0
11,90.0,0.0,0.0,0.0,0.0,0.0,6.0,4.5,1.0
12,90.0,0.0,1.0,0.1196019202470779,0.0982624813914299,2.0,9.0,4.5,1.0
13,0.0,0.0,0.0,0.0,0.0,0.0,0.0,4.5,0.0
14,0.0,0.0,0.0,0.0,0.0,0.0,0.0,4.5,0.0
15,0.0,0.0,0.0,0.0,0.0,0.0,0.0,4.5,0.0
16,0.0,0.0,0.0,0.0,0.0,0.0,0.0,4.5,0.0
17,7.0,0.0,0.0,0.0,0.0,0.0,1.0,4.5,1.0
18,,,,,,,,,
19,90.0,0.0,0.0,0.0,0.0,0.0,1.0,4.5,1.0
20,,,,,,,,,
21,,,,,,,,,
22,,,,,,,,,
23,,,,,,,,,
24,,,,,,,,,
25,,,,,,,,,
26,,,,,,,,,
27,,,,,,,,,
28,,,,,,,,,
29,,,,,,,,,
30,,,,,,,,,
31,,,,,,,,,
32,,,,,,,,,
33,,,,,,,,,
34,,,,,,,,,
35,,,,,,,,,
36,,,,,,,,,
37,,,,,,,,,
38,,,,,,,,,
total,1119.0,0.0,1.0,0.181454375386238,0.1866950197145342,3.0,42.0,63.0,0.0
