gameweek,minutes,G,A,xG,xA,bonus,points,price,available
2020/21,1486.0,0.0,0.0,0.8006941750645638,0.0205302126705646,3.0,43.0,,0.0
1,90.0,0.0,0.0,0.0543193370103836,0.0,0.0,5.0,4.5,1.0
2,90.0,0.0,0.0,0.0,0.0,2.0,8.0,4.5,1.0
3,90.0,0.0,0.0,0.103381872177124,0.0,0.0,6.0,4.5,1.0
4,0.0,0.0,0.0,0.0,0.0,0.0,0.0,4.5,0.0
5,6.0,0.0,0.0,0.0,0.0,0.0,1.0,4.5,1.0
6,90.0,0.0,0.0,0.0,0.0,0.0,1.0,4.5,1.0
7,0.0,0.0,0.0,0.0,0.0,0.0,0.0,4.5,0.0
8,0.0,0.0,0.0,0.0,0.0,0.0,0.0,4.5,1.0
9,0.0,0.0,0.0,0.0,0.0,0.0,0.0,4.5,1.0
10,0.0,0.0,0.0,0.0,0.0,0.0,0.0,4.5,1.0
11,0.0,0.0,0.0,0.0,0.0,0.0,0.0,4.5,1.0
12,20.0,0.0,0.0,0.0,0.0261756051331758,0.0,1.0,4.5,1.0
13,,,,,,,,,
14,90.0,0.0,0.0,0.0902751311659812,0.0,0.0,6.0,4.5,1.0
15,90.0,1.0,0.0,0.5610527396202087,0.0,0.0,12.0,4.5,1.0
16,,,,,,,,,
17,,,,,,,,,
18,90.0,0.0,0.0,0.0876248404383659,0.0,0.0,1.0,4.5,1.0
19,90.0,0.0,0.0,0.12210647761821747,0.0,0.0,5.0,4.5,1.0
20,,,,,,,,,
21,,,,,,,,,
22,,,,,,,,,
23,,,,,,,,,
24,,,,,,,,,
25,,,,,,,,,
26,,,,,,,,,
27,,,,,,,,,
28,,,,,,,,,
29,,,,,,,,,
30,,,,,,,,,
31,,,,,,,,,
32,,,,,,,,,
33,,,,,,,,,
34,,,,,,,,,
35,,,,,,,,,
36,,,,,,,,,
37,,,,,,,,,
38,,,,,,,,,
total,746.0,1.0,0.0,1.018760398030281,0.0261756051331758,2.0,46.0,45.0,0.0
