gameweek,minutes,G,A,xG,xA,bonus,points,price,available
2020/21,0.0,0.0,0.0,0.0,0.0,0.0,0.0,,0.0
1,90.0,0.0,0.0,0.0,0.0,0.0,6.0,4.5,1.0
2,90.0,0.0,0.0,0.0,0.0176037773489952,3.0,9.0,4.5,1.0
3,90.0,0.0,1.0,0.0,0.4390892684459686,2.0,7.0,4.6,1.0
4,90.0,0.0,0.0,0.0,0.0,0.0,2.0,4.6,1.0
5,85.0,0.0,0.0,0.0,0.0,0.0,5.0,4.6,1.0
6,90.0,0.0,0.0,0.4049310386180877,0.0,0.0,4.0,4.6,1.0
7,90.0,0.0,0.0,0.0162728168070316,0.0,0.0,5.0,4.6,1.0
8,90.0,0.0,0.0,0.5463746786117554,0.0,0.0,2.0,4.7,1.0
9,90.0,0.0,0.0,0.5262444019317627,0.0,0.0,1.0,4.7,1.0
10,90.0,0.0,0.0,0.0,0.0,0.0,1.0,4.7,1.0
11,90.0,0.0,0.0,0.0886306539177894,0.0,0.0,1.0,4.7,1.0
12,90.0,0.0,0.0,0.0,0.0,0.0,1.0,4.7,1.0
13,90.0,0.0,0.0,0.0,0.0,0.0,5.0,4.7,1.0
14,90.0,0.0,0.0,0.0299288630485534,0.0375369638204574,0.0,1.0,4.6,1.0
15,90.0,0.0,0.0,0.0,0.0,0.0,1.0,4.6,1.0
16,90.0,1.0,0.0,0.4433455765247345,0.0,1.0,8.0,4.6,1.0
17,,,,,,,,,
18,,,,,,,,,
19,90.0,0.0,0.0,0.09035878628492355,0.0,0.0,1.0,4.6,1.0
20,,,,,,,,,
21,,,,,,,,,
22,,,,,,,,,
23,,,,,,,,,
24,,,,,,,,,
25,,,,,,,,,
26,,,,,,,,,
27,,,,,,,,,
28,,,,,,,,,
29,,,,,,,,,
30,,,,,,,,,
31,,,,,,,,,
32,,,,,,,,,
33,,,,,,,,,
34,,,,,,,,,
35,,,,,,,,,
36,,,,,,,,,
37,,,,,,,,,
38,,,,,,,,,
total,1525.0,1.0,1.0,2.1460868157446384,0.4942300096154212,6.0,60.0,78.6,0.0
