gameweek,minutes,saves,bonus,points,price,available
2020/21,0.0,0.0,0.0,0.0,,0.0
1,0.0,0.0,0.0,0.0,4.0,1.0
2,0.0,0.0,0.0,0.0,4.0,1.0
3,0.0,0.0,0.0,0.0,4.0,0.0
4,0.0,0.0,0.0,0.0,4.0,1.0
5,90.0,4.0,0.0,3.0,4.0,1.0
6,90.0,5.0,0.0,3.0,4.0,1.0
7,90.0,2.0,0.0,2.0,4.0,1.0
8,90.0,4.0,0.0,1.0,4.0,1.0
9,90.0,2.0,0.0,1.0,4.0,1.0
10,90.0,0.0,0.0,2.0,4.1,1.0
11,90.0,5.0,3.0,11.0,4.1,1.0
12,90.0,2.0,0.0,5.0,4.1,1.0
13,0.0,0.0,0.0,0.0,4.1,0.0
14,0.0,0.0,0.0,0.0,4.1,0.0
15,0.0,0.0,0.0,0.0,4.1,0.0
16,0.0,0.0,0.0,0.0,4.1,0.0
17,,,,,,
18,,,,,,
19,,,,,,
20,,,,,,
21,,,,,,
22,,,,,,
23,,,,,,
24,,,,,,
25,,,,,,
26,,,,,,
27,,,,,,
28,,,,,,
29,,,,,,
30,,,,,,
31,,,,,,
32,,,,,,
33,,,,,,
34,,,,,,
35,,,,,,
36,,,,,,
37,,,,,,
38,,,,,,
total,720.0,24.0,3.0,28.0,32.300000000000004,0.0
