gameweek,minutes,G,A,xG,xA,bonus,points,price,available
2020/21,1538.0,1.0,0.0,0.4756157984957099,0.2569417227059603,3.0,50.0,,0.0
1,0.0,0.0,0.0,0.0,0.0,0.0,0.0,4.5,1.0
2,0.0,0.0,0.0,0.0,0.0,0.0,0.0,4.5,1.0
3,41.0,0.0,0.0,0.0,0.0,0.0,1.0,4.5,1.0
4,0.0,0.0,0.0,0.0,0.0,0.0,0.0,4.5,0.0
5,0.0,0.0,0.0,0.0,0.0,0.0,0.0,4.5,1.0
6,0.0,0.0,0.0,0.0,0.0,0.0,0.0,4.5,1.0
7,0.0,0.0,0.0,0.0,0.0,0.0,0.0,4.5,1.0
8,0.0,0.0,0.0,0.0,0.0,0.0,0.0,4.5,1.0
9,0.0,0.0,0.0,0.0,0.0,0.0,0.0,4.5,1.0
10,0.0,0.0,0.0,0.0,0.0,0.0,0.0,4.5,1.0
11,1.0,0.0,0.0,0.0,0.0509671941399574,0.0,1.0,4.5,1.0
12,5.0,0.0,0.0,0.0,0.0,0.0,1.0,4.4,1.0
13,1.0,0.0,0.0,0.0,0.0287253726273775,0.0,1.0,4.4,1.0
14,90.0,0.0,1.0,0.0155661171302199,0.0145748984068632,0.0,5.0,4.4,1.0
15,0.0,0.0,0.0,0.0,0.0,0.0,0.0,4.4,1.0
16,0.0,0.0,0.0,0.0,0.0,0.0,0.0,4.4,1.0
17,0.0,0.0,0.0,0.0,0.0,0.0,0.0,4.4,1.0
18,0.0,0.0,0.0,0.0,0.0,0.0,0.0,4.4,1.0
19,13.0,0.0,0.0,0.0,0.0,0.0,1.0,4.4,1.0
20,,,,,,,,,
21,,,,,,,,,
22,,,,,,,,,
23,,,,,,,,,
24,,,,,,,,,
25,,,,,,,,,
26,,,,,,,,,
27,,,,,,,,,
28,,,,,,,,,
29,,,,,,,,,
30,,,,,,,,,
31,,,,,,,,,
32,,,,,,,,,
33,,,,,,,,,
34,,,,,,,,,
35,,,,,,,,,
36,,,,,,,,,
37,,,,,,,,,
38,,,,,,,,,
total,151.0,0.0,1.0,0.0155661171302199,0.0942674651741981,0.0,10.0,26.6,0.0
