gameweek,minutes,G,A,xG,xA,bonus,points,price,available
2020/21,2585.0,1.0,1.0,0.7988894507288933,0.4023786187171936,3.0,102.0,,0.0
1,90.0,0.0,1.0,0.0,0.3619175851345062,0.0,5.0,5.0,1.0
2,90.0,0.0,0.0,0.0,0.0,0.0,2.0,5.0,1.0
3,0.0,0.0,0.0,0.0,0.0,0.0,0.0,5.0,1.0
4,0.0,0.0,0.0,0.0,0.0,0.0,0.0,4.9,1.0
5,0.0,0.0,0.0,0.0,0.0,0.0,0.0,4.9,1.0
6,19.0,0.0,0.0,0.0,0.0,0.0,1.0,4.8,1.0
7,90.0,0.0,0.0,0.0,0.0,0.0,2.0,4.8,1.0
8,90.0,0.0,1.0,0.0,0.2509621381759643,0.0,2.0,4.8,1.0
9,90.0,0.0,0.0,0.0,0.0,0.0,0.0,4.8,1.0
10,90.0,0.0,0.0,0.0,0.0,0.0,6.0,4.8,1.0
11,90.0,0.0,0.0,0.0,0.0,0.0,1.0,4.8,1.0
12,90.0,0.0,0.0,0.0,0.0,0.0,0.0,4.8,1.0
13,90.0,0.0,0.0,0.0,0.0,0.0,2.0,4.8,1.0
14,90.0,0.0,0.0,0.0127791939303278,0.0,0.0,1.0,4.8,1.0
15,90.0,0.0,0.0,0.0,0.0,0.0,5.0,4.8,1.0
16,75.0,0.0,0.0,0.0,0.0,1.0,7.0,4.8,1.0
17,,,,,,,,,
18,,,,,,,,,
19,0.0,0.0,0.0,0.0,0.0,0.0,0.0,4.8,0.0
20,,,,,,,,,
21,,,,,,,,,
22,,,,,,,,,
23,,,,,,,,,
24,,,,,,,,,
25,,,,,,,,,
26,,,,,,,,,
27,,,,,,,,,
28,,,,,,,,,
29,,,,,,,,,
30,,,,,,,,,
31,,,,,,,,,
32,,,,,,,,,
33,,,,,,,,,
34,,,,,,,,,
35,,,,,,,,,
36,,,,,,,,,
37,,,,,,,,,
38,,,,,,,,,
total,1084.0,0.0,2.0,0.0127791939303278,0.6128797233104706,1.0,34.0,62.8,0.0
