gameweek,minutes,G,A,xG,xA,bonus,points,price,available
2020/21,0.0,0.0,0.0,0.0,0.0,0.0,0.0,,0.0
1,81.0,0.0,0.0,0.053464014083147,0.0657062008976936,0.0,3.0,5.0,1.0
2,73.0,0.0,0.0,0.0663852617144584,0.0335344560444355,0.0,3.0,5.0,1.0
3,0.0,0.0,0.0,0.0,0.0,0.0,0.0,5.0,1.0
4,10.0,0.0,0.0,0.0,0.0,0.0,1.0,4.9,1.0
5,19.0,0.0,0.0,0.0387298502027988,0.0,0.0,1.0,4.9,1.0
6,71.0,0.0,0.0,0.1238945201039314,0.0,0.0,1.0,4.9,1.0
7,87.0,0.0,0.0,0.0,0.0,0.0,2.0,4.9,1.0
8,70.0,0.0,0.0,0.0,0.0,0.0,2.0,4.9,1.0
9,78.0,0.0,0.0,0.0523532517254352,0.0509445630013942,0.0,2.0,4.9,1.0
10,60.0,0.0,0.0,0.0103452708572149,0.0,0.0,1.0,4.9,1.0
11,0.0,0.0,0.0,0.0,0.0,0.0,0.0,4.9,1.0
12,28.0,0.0,0.0,0.0442984141409397,0.0,0.0,4.0,4.9,1.0
13,90.0,0.0,0.0,0.0,0.0,0.0,5.0,4.9,1.0
14,58.0,0.0,0.0,0.0,0.0,0.0,1.0,4.9,1.0
15,18.0,0.0,0.0,0.0,0.0,0.0,1.0,4.9,1.0
16,12.0,0.0,0.0,0.0706314817070961,0.0,0.0,0.0,4.9,1.0
17,,,,,,,,,
18,,,,,,,,,
19,40.0,0.0,0.0,0.0,0.013330291025340557,0.0,1.0,4.9,1.0
20,,,,,,,,,
21,,,,,,,,,
22,,,,,,,,,
23,,,,,,,,,
24,,,,,,,,,
25,,,,,,,,,
26,,,,,,,,,
27,,,,,,,,,
28,,,,,,,,,
29,,,,,,,,,
30,,,,,,,,,
31,,,,,,,,,
32,,,,,,,,,
33,,,,,,,,,
34,,,,,,,,,
35,,,,,,,,,
36,,,,,,,,,
37,,,,,,,,,
38,,,,,,,,,
total,795.0,0.0,0.0,0.4601020645350216,0.16351551096886385,0.0,28.0,73.7,0.0
