gameweek,minutes,G,A,xG,xA,bonus,points,price,available
2020/21,1210.0,8.0,0.0,5.088089782744646,0.7337011601775885,5.0,79.0,,0.0
1,0.0,0.0,0.0,0.0,0.0,0.0,0.0,6.0,1.0
2,90.0,0.0,0.0,0.0,0.0136938337236642,0.0,2.0,6.0,1.0
3,85.0,0.0,0.0,0.0,0.0,0.0,2.0,6.0,1.0
4,89.0,0.0,0.0,0.0812262743711471,0.0,0.0,2.0,6.0,1.0
5,90.0,0.0,0.0,0.0246872659772634,0.0375666432082653,0.0,2.0,5.9,1.0
6,87.0,0.0,0.0,0.4961428344249725,0.111705794930458,0.0,2.0,5.9,1.0
7,35.0,0.0,0.0,0.0,0.0,0.0,1.0,5.9,1.0
8,85.0,0.0,0.0,0.0,0.0,0.0,2.0,5.9,1.0
9,22.0,0.0,0.0,0.0,0.0,0.0,1.0,5.8,1.0
10,21.0,0.0,0.0,0.0,0.0,0.0,1.0,5.8,1.0
11,0.0,0.0,0.0,0.0,0.0,0.0,0.0,5.8,1.0
12,74.0,0.0,0.0,0.0,0.097211830317974,0.0,2.0,5.8,1.0
13,90.0,0.0,0.0,0.0246059335768222,0.0,0.0,2.0,5.7,1.0
14,75.0,0.0,0.0,0.0,0.1082895174622535,0.0,3.0,5.7,1.0
15,90.0,0.0,0.0,0.5831185579299927,0.1609673947095871,0.0,3.0,5.7,1.0
16,90.0,0.0,0.0,0.0701546370983123,0.0362237952649593,0.0,2.0,5.7,1.0
17,1.0,0.0,0.0,0.0,0.0,0.0,1.0,5.7,1.0
18,47.0,0.0,0.0,0.0,0.0,0.0,1.0,5.7,1.0
19,0.0,0.0,0.0,0.0,0.0,0.0,0.0,5.7,0.0
20,,,,,,,,,
21,,,,,,,,,
22,,,,,,,,,
23,,,,,,,,,
24,,,,,,,,,
25,,,,,,,,,
26,,,,,,,,,
27,,,,,,,,,
28,,,,,,,,,
29,,,,,,,,,
30,,,,,,,,,
31,,,,,,,,,
32,,,,,,,,,
33,,,,,,,,,
34,,,,,,,,,
35,,,,,,,,,
36,,,,,,,,,
37,,,,,,,,,
38,,,,,,,,,
total,1071.0,0.0,0.0,1.2799355033785105,0.5656588096171615,0.0,29.0,93.20000000000002,0.0
