gameweek,minutes,G,A,xG,xA,bonus,points,price,available
2020/21,288.0,0.0,0.0,0.0263571375980973,0.108452171087265,0.0,10.0,,0.0
1,0.0,0.0,0.0,0.0,0.0,0.0,0.0,5.0,0.0
2,0.0,0.0,0.0,0.0,0.0,0.0,0.0,5.0,0.0
3,0.0,0.0,0.0,0.0,0.0,0.0,0.0,5.0,1.0
4,0.0,0.0,0.0,0.0,0.0,0.0,0.0,5.0,1.0
5,0.0,0.0,0.0,0.0,0.0,0.0,0.0,5.0,0.0
6,0.0,0.0,0.0,0.0,0.0,0.0,0.0,5.0,0.0
7,0.0,0.0,0.0,0.0,0.0,0.0,0.0,5.0,0.0
8,0.0,0.0,0.0,0.0,0.0,0.0,0.0,5.0,1.0
9,0.0,0.0,0.0,0.0,0.0,0.0,0.0,5.0,0.0
10,0.0,0.0,0.0,0.0,0.0,0.0,0.0,5.0,1.0
11,0.0,0.0,0.0,0.0,0.0,0.0,0.0,5.0,0.0
12,0.0,0.0,0.0,0.0,0.0,0.0,0.0,5.0,1.0
13,0.0,0.0,0.0,0.0,0.0,0.0,0.0,5.0,1.0
14,11.0,0.0,0.0,0.0,0.0,0.0,1.0,5.0,1.0
15,10.0,0.0,0.0,0.0,0.0,0.0,1.0,5.0,1.0
16,30.0,0.0,0.0,0.0,0.0,0.0,1.0,5.0,1.0
17,0.0,0.0,0.0,0.0,0.0,0.0,0.0,5.0,0.0
18,,,,,,,,,
19,77.0,0.0,0.0,0.011810557916760445,0.0,0.0,2.0,5.0,1.0
20,,,,,,,,,
21,,,,,,,,,
22,,,,,,,,,
23,,,,,,,,,
24,,,,,,,,,
25,,,,,,,,,
26,,,,,,,,,
27,,,,,,,,,
28,,,,,,,,,
29,,,,,,,,,
30,,,,,,,,,
31,,,,,,,,,
32,,,,,,,,,
33,,,,,,,,,
34,,,,,,,,,
35,,,,,,,,,
36,,,,,,,,,
37,,,,,,,,,
38,,,,,,,,,
total,128.0,0.0,0.0,0.011810557916760445,0.0,0.0,5.0,20.0,0.0
