gameweek,minutes,G,A,xG,xA,bonus,points,price,available
2020/21,2087.0,0.0,0.0,0.1944530010223388,0.9830160085111856,4.0,44.0,,0.0
1,0.0,0.0,0.0,0.0,0.0,0.0,0.0,4.5,1.0
2,0.0,0.0,0.0,0.0,0.0,0.0,0.0,4.5,1.0
3,0.0,0.0,0.0,0.0,0.0,0.0,0.0,4.5,0.0
4,0.0,0.0,0.0,0.0,0.0,0.0,0.0,4.5,0.0
5,0.0,0.0,0.0,0.0,0.0,0.0,0.0,4.5,0.0
6,0.0,0.0,0.0,0.0,0.0,0.0,0.0,4.5,0.0
7,0.0,0.0,0.0,0.0,0.0,0.0,0.0,4.5,0.0
8,0.0,0.0,0.0,0.0,0.0,0.0,0.0,4.5,0.0
9,0.0,0.0,0.0,0.0,0.0,0.0,0.0,4.5,0.0
10,0.0,0.0,0.0,0.0,0.0,0.0,0.0,4.5,0.0
11,0.0,0.0,0.0,0.0,0.0,0.0,0.0,4.5,0.0
12,0.0,0.0,0.0,0.0,0.0,0.0,0.0,4.5,0.0
13,0.0,0.0,0.0,0.0,0.0,0.0,0.0,4.5,0.0
14,0.0,0.0,0.0,0.0,0.0,0.0,0.0,4.5,0.0
15,0.0,0.0,0.0,0.0,0.0,0.0,0.0,4.5,0.0
16,0.0,0.0,0.0,0.0,0.0,0.0,0.0,4.5,0.0
17,0.0,0.0,0.0,0.0,0.0,0.0,0.0,4.5,0.0
18,0.0,0.0,0.0,0.0,0.0,0.0,0.0,4.5,0.0
19,0.0,0.0,0.0,0.0,0.0,0.0,0.0,4.5,0.0
20,,,,,,,,,
21,,,,,,,,,
22,,,,,,,,,
23,,,,,,,,,
24,,,,,,,,,
25,,,,,,,,,
26,,,,,,,,,
27,,,,,,,,,
28,,,,,,,,,
29,,,,,,,,,
30,,,,,,,,,
31,,,,,,,,,
32,,,,,,,,,
33,,,,,,,,,
34,,,,,,,,,
35,,,,,,,,,
36,,,,,,,,,
37,,,,,,,,,
38,,,,,,,,,
total,0.0,0.0,0.0,0.0,0.0,0.0,0.0,0.0,0.0
