fantasy_id,20,21,22,23,24,mean
1,,0.10138372889583241,,,,0.10138372889583241
2,,,,,,
3,,,,,,
4,,,,,,
5,,,,,,
6,,,0.15949654819732204,,,0.15949654819732204
7,,,,,,
8,,,,,,
9,,,,,,
10,,,,,,
11,,,,,,
12,,0.3453458983705608,0.27654572243562975,,,0.31094581040309527
13,,,,,,
14,,,,,,
15,,,,,,
16,,,,,,
17,,,,,,
18,,,,,,
19,,,,,,
20,,,,,,
