gameweek,minutes,G,A,xG,xA,bonus,points,price,available
2020/21,1625.0,2.0,0.0,0.7653548326343298,0.0668827779591083,3.0,44.0,,0.0
1,0.0,0.0,0.0,0.0,0.0,0.0,0.0,4.5,1.0
2,90.0,0.0,0.0,0.020486868917942,0.0,0.0,1.0,4.5,1.0
3,90.0,0.0,0.0,0.015427934937179,0.0,0.0,0.0,4.5,1.0
4,90.0,0.0,0.0,0.0,0.0,0.0,0.0,4.4,1.0
5,90.0,0.0,0.0,0.0948637127876281,0.0,0.0,2.0,4.4,1.0
6,0.0,0.0,0.0,0.0,0.0,0.0,0.0,4.4,0.0
7,0.0,0.0,0.0,0.0,0.0,0.0,0.0,4.4,1.0
8,90.0,0.0,0.0,0.0221415609121322,0.0243067778646945,0.0,1.0,4.4,1.0
9,90.0,0.0,0.0,0.0359853357076644,0.0854672044515609,0.0,1.0,4.4,1.0
10,90.0,0.0,0.0,0.0659327134490013,0.0,0.0,0.0,4.4,1.0
11,90.0,0.0,0.0,0.0,0.0280514061450958,0.0,1.0,4.4,1.0
12,90.0,1.0,0.0,0.5882076621055603,0.0,0.0,5.0,4.4,1.0
13,90.0,0.0,0.0,0.0,0.0,0.0,0.0,4.4,1.0
14,0.0,0.0,0.0,0.0,0.0,0.0,0.0,4.4,1.0
15,90.0,0.0,0.0,0.0281093884259462,0.0,1.0,7.0,4.4,1.0
16,90.0,0.0,0.0,0.0,0.0,0.0,0.0,4.4,1.0
17,90.0,0.0,0.0,0.0,0.0,0.0,1.0,4.4,1.0
18,90.0,0.0,0.0,0.0,0.0,0.0,0.0,4.4,1.0
19,90.0,0.0,0.0,0.0,0.0,0.0,2.0,4.4,1.0
20,,,,,,,,,
21,,,,,,,,,
22,,,,,,,,,
23,,,,,,,,,
24,,,,,,,,,
25,,,,,,,,,
26,,,,,,,,,
27,,,,,,,,,
28,,,,,,,,,
29,,,,,,,,,
30,,,,,,,,,
31,,,,,,,,,
32,,,,,,,,,
33,,,,,,,,,
34,,,,,,,,,
35,,,,,,,,,
36,,,,,,,,,
37,,,,,,,,,
38,,,,,,,,,
total,1350.0,1.0,0.0,0.8711551772430535,0.1378253884613512,1.0,21.0,66.2,0.0
