gameweek,minutes,G,A,xG,xA,bonus,points,price,available
2020/21,1559.0,0.0,1.0,0.4271286996081471,1.0544508751481771,0.0,48.0,,0.0
1,0.0,0.0,0.0,0.0,0.0,0.0,0.0,5.0,1.0
2,0.0,0.0,0.0,0.0,0.0,0.0,0.0,5.0,1.0
3,6.0,0.0,0.0,0.0752448365092277,0.0,0.0,1.0,4.9,1.0
4,28.0,0.0,0.0,0.5934218168258667,0.081578716635704,0.0,1.0,4.9,1.0
5,25.0,0.0,0.0,0.0483526848256588,0.0,0.0,1.0,4.9,1.0
6,0.0,0.0,0.0,0.0,0.0,0.0,0.0,4.9,0.0
7,0.0,0.0,0.0,0.0,0.0,0.0,0.0,4.9,0.0
8,0.0,0.0,0.0,0.0,0.0,0.0,0.0,4.9,0.0
9,0.0,0.0,0.0,0.0,0.0,0.0,0.0,4.9,0.0
10,0.0,0.0,0.0,0.0,0.0,0.0,0.0,4.9,0.0
11,0.0,0.0,0.0,0.0,0.0,0.0,0.0,4.9,0.0
12,0.0,0.0,0.0,0.0,0.0,0.0,0.0,4.9,0.0
13,0.0,0.0,0.0,0.0,0.0,0.0,0.0,4.9,0.0
14,0.0,0.0,0.0,0.0,0.0,0.0,0.0,4.9,1.0
15,21.0,0.0,1.0,0.0459466762840747,0.0240917317569255,0.0,4.0,4.9,1.0
16,90.0,0.0,0.0,0.1048274412751197,0.0131496330723166,0.0,2.0,4.9,1.0
17,72.0,0.0,0.0,0.014555222354829311,0.0,0.0,1.0,4.9,1.0
18,,,,,,,,,
19,,,,,,,,,
20,,,,,,,,,
21,,,,,,,,,
22,,,,,,,,,
23,,,,,,,,,
24,,,,,,,,,
25,,,,,,,,,
26,,,,,,,,,
27,,,,,,,,,
28,,,,,,,,,
29,,,,,,,,,
30,,,,,,,,,
31,,,,,,,,,
32,,,,,,,,,
33,,,,,,,,,
34,,,,,,,,,
35,,,,,,,,,
36,,,,,,,,,
37,,,,,,,,,
38,,,,,,,,,
total,242.0,0.0,1.0,0.8823486780747771,0.1188200814649461,0.0,10.0,29.4,0.0
