gameweek,minutes,G,A,xG,xA,bonus,points,price,available
2020/21,887.0,1.0,3.0,0.7030039094388485,0.8089809715747833,2.0,35.0,,0.0
1,0.0,0.0,0.0,0.0,0.0,0.0,0.0,4.5,0.0
2,0.0,0.0,0.0,0.0,0.0,0.0,0.0,4.5,0.0
3,0.0,0.0,0.0,0.0,0.0,0.0,0.0,4.5,0.0
4,0.0,0.0,0.0,0.0,0.0,0.0,0.0,4.4,0.0
5,0.0,0.0,0.0,0.0,0.0,0.0,0.0,4.4,1.0
6,0.0,0.0,0.0,0.0,0.0,0.0,0.0,4.4,1.0
7,0.0,0.0,0.0,0.0,0.0,0.0,0.0,4.4,1.0
8,28.0,0.0,0.0,0.0,0.0,0.0,1.0,4.4,1.0
9,31.0,0.0,0.0,0.0420312993228435,0.0110979806631803,0.0,1.0,4.4,1.0
10,22.0,0.0,0.0,0.0,0.0,0.0,0.0,4.4,1.0
11,78.0,0.0,0.0,0.1430339515209198,0.1184686049818992,0.0,2.0,4.4,1.0
12,81.0,0.0,0.0,0.3463757336139679,0.0,0.0,6.0,4.4,1.0
13,78.0,0.0,0.0,0.0,0.7277860045433044,2.0,8.0,4.4,1.0
14,16.0,0.0,1.0,0.0,0.1114965081214904,0.0,4.0,4.4,1.0
15,64.0,0.0,0.0,0.0,0.0241976827383041,0.0,2.0,4.5,1.0
16,,,,,,,,,
17,90.0,0.0,0.0,0.0433388799428939,0.0,0.0,2.0,4.5,1.0
18,,,,,,,,,
19,90.0,0.0,0.0,0.0,0.0,0.0,6.0,4.5,1.0
20,,,,,,,,,
21,,,,,,,,,
22,,,,,,,,,
23,,,,,,,,,
24,,,,,,,,,
25,,,,,,,,,
26,,,,,,,,,
27,,,,,,,,,
28,,,,,,,,,
29,,,,,,,,,
30,,,,,,,,,
31,,,,,,,,,
32,,,,,,,,,
33,,,,,,,,,
34,,,,,,,,,
35,,,,,,,,,
36,,,,,,,,,
37,,,,,,,,,
38,,,,,,,,,
total,578.0,0.0,1.0,0.5747798644006252,0.9930467810481786,2.0,32.0,44.3,0.0
