gameweek,minutes,G,A,xG,xA,bonus,points,price,available
2020/21,0.0,0.0,0.0,0.0,0.0,0.0,0.0,,0.0
1,0.0,0.0,0.0,0.0,0.0,0.0,0.0,5.4,1.0
2,0.0,0.0,0.0,0.0,0.0,0.0,0.0,5.3,1.0
3,0.0,0.0,0.0,0.0,0.0,0.0,0.0,5.2,1.0
4,0.0,0.0,0.0,0.0,0.0,0.0,0.0,5.2,1.0
5,90.0,0.0,0.0,0.0,0.0,0.0,6.0,5.2,1.0
6,0.0,0.0,0.0,0.0,0.0,0.0,0.0,5.2,1.0
7,0.0,0.0,0.0,0.0,0.0,0.0,0.0,5.2,1.0
8,0.0,0.0,0.0,0.0,0.0,0.0,0.0,5.1,1.0
9,90.0,0.0,0.0,0.0,0.0,0.0,6.0,5.1,1.0
10,90.0,0.0,0.0,0.0,0.0,0.0,1.0,5.1,1.0
11,0.0,0.0,0.0,0.0,0.0,0.0,0.0,5.1,1.0
12,0.0,0.0,0.0,0.0,0.0,0.0,0.0,5.1,1.0
13,90.0,0.0,0.0,0.0,0.0,0.0,6.0,5.1,1.0
14,0.0,0.0,0.0,0.0,0.0,0.0,0.0,5.1,1.0
15,0.0,0.0,0.0,0.0,0.0,0.0,0.0,5.1,1.0
16,0.0,0.0,0.0,0.0,0.0,0.0,0.0,5.1,1.0
17,90.0,0.0,0.0,0.020871702581644,0.0,0.0,2.0,5.1,1.0
18,90.0,0.0,0.0,0.0,0.0,0.0,0.0,5.1,1.0
19,,,,,,,,,
20,,,,,,,,,
21,,,,,,,,,
22,,,,,,,,,
23,,,,,,,,,
24,,,,,,,,,
25,,,,,,,,,
26,,,,,,,,,
27,,,,,,,,,
28,,,,,,,,,
29,,,,,,,,,
30,,,,,,,,,
31,,,,,,,,,
32,,,,,,,,,
33,,,,,,,,,
34,,,,,,,,,
35,,,,,,,,,
36,,,,,,,,,
37,,,,,,,,,
38,,,,,,,,,
total,540.0,0.0,0.0,0.020871702581644,0.0,0.0,21.0,30.700000000000003,0.0
