week,G,GA,xG,xGA,H/A
2020/21,1.7894736842105263,1.3157894736842106,1.5473684210526315,1.2386842105263158,
1,1.0,0.0,0.668081521987915,1.3271402791142464,H
2,1.0,4.0,0.6573105715215206,2.286128227598965,A
3,2.0,1.0,1.2737146690487862,1.4419705588370562,A
4,0.0,1.0,0.8000997826457024,2.782220032066107,H
5,1.0,2.0,1.2537260577082634,1.4743784852325916,A
6,2.0,2.0,2.1623251009732485,0.4288658816367388,H
7,2.0,2.0,1.0432175658643246,1.182183988392353,A
8,4.0,2.0,3.064918428659439,1.0249442318454385,H
9,2.0,1.0,1.002538064494729,1.1678923219442368,A
10,0.0,2.0,2.056999472901225,1.1028847955167294,H
11,1.0,1.0,0.7952924929559231,2.07517209649086,A
12,0.0,3.0,0.4995041927322745,2.5867390763014555,H
13,4.0,2.0,2.4183215610682964,2.385257935151458,H
14,2.0,2.0,1.4639389924705029,1.971112985163927,A
15,1.0,2.0,0.9826135560870172,1.8481804430484767,A
16,4.0,0.0,2.0577127765864134,0.5119336992502213,H
17,,,,,
18,,,,,
19,3.0,6.0,2.447646629065275,3.9033881928771734,A
20,,,,,
21,,,,,
22,,,,,
23,,,,,
24,,,,,
25,,,,,
26,,,,,
27,,,,,
28,,,,,
29,,,,,
30,,,,,
31,,,,,
32,,,,,
33,,,,,
34,,,,,
35,,,,,
36,,,,,
37,,,,,
38,,,,,
