gameweek,minutes,G,A,xG,xA,bonus,points,price,available
2020/21,2670.0,5.0,1.0,4.744082774966955,2.061172847636044,10.0,104.0,,0.0
1,90.0,0.0,0.0,0.0127817541360855,0.1025155186653137,0.0,2.0,5.5,1.0
2,90.0,0.0,0.0,0.1026712879538536,0.6829051971435547,0.0,2.0,5.5,1.0
3,90.0,0.0,0.0,0.0546248443424701,0.0147093217819929,0.0,1.0,5.5,1.0
4,90.0,0.0,0.0,0.0370494127273559,0.0340780541300773,0.0,3.0,5.5,1.0
5,90.0,0.0,0.0,0.012908668257296,0.0233918987214565,0.0,1.0,5.4,1.0
6,1.0,0.0,0.0,0.0,0.0,0.0,1.0,5.4,1.0
7,90.0,0.0,0.0,0.0,0.0300538130104541,0.0,2.0,5.4,1.0
8,90.0,1.0,0.0,0.0582961365580558,0.0,2.0,8.0,5.4,1.0
9,1.0,0.0,0.0,0.0,0.0,0.0,1.0,5.4,1.0
10,90.0,0.0,0.0,0.0746480673551559,0.0,0.0,2.0,5.4,1.0
11,90.0,0.0,0.0,0.0158464722335338,0.0,0.0,2.0,5.3,1.0
12,90.0,0.0,0.0,0.1211083009839057,0.3214673399925232,0.0,2.0,5.3,1.0
13,90.0,0.0,0.0,0.0,0.0,0.0,2.0,5.3,1.0
14,0.0,0.0,0.0,0.0,0.0,0.0,0.0,5.3,1.0
15,90.0,0.0,0.0,0.0,0.0,0.0,2.0,5.3,1.0
16,89.0,0.0,0.0,0.0,0.0,0.0,1.0,5.3,1.0
17,90.0,0.0,1.0,0.0138355726376175,0.3276154398918152,0.0,6.0,5.3,1.0
18,90.0,0.0,0.0,0.0,0.0,0.0,3.0,5.3,1.0
19,,,,,,,,,
20,,,,,,,,,
21,,,,,,,,,
22,,,,,,,,,
23,,,,,,,,,
24,,,,,,,,,
25,,,,,,,,,
26,,,,,,,,,
27,,,,,,,,,
28,,,,,,,,,
29,,,,,,,,,
30,,,,,,,,,
31,,,,,,,,,
32,,,,,,,,,
33,,,,,,,,,
34,,,,,,,,,
35,,,,,,,,,
36,,,,,,,,,
37,,,,,,,,,
38,,,,,,,,,
total,1351.0,1.0,1.0,0.5037705171853302,1.5367365833371878,2.0,41.0,91.49999999999999,0.0
