gameweek,minutes,G,A,xG,xA,bonus,points,price,available
2020/21,18.0,0.0,0.0,0.056043904274702,0.0,0.0,2.0,,0.0
1,0.0,0.0,0.0,0.0,0.0,0.0,0.0,4.5,1.0
2,0.0,0.0,0.0,0.0,0.0,0.0,0.0,4.5,1.0
3,64.0,0.0,0.0,0.0,0.0,0.0,2.0,4.5,1.0
4,0.0,0.0,0.0,0.0,0.0,0.0,0.0,4.5,0.0
5,0.0,0.0,0.0,0.0,0.0,0.0,0.0,4.5,1.0
6,0.0,0.0,0.0,0.0,0.0,0.0,0.0,4.5,1.0
7,0.0,0.0,0.0,0.0,0.0,0.0,0.0,4.5,1.0
8,0.0,0.0,0.0,0.0,0.0,0.0,0.0,4.5,1.0
9,0.0,0.0,0.0,0.0,0.0,0.0,0.0,4.5,1.0
10,0.0,0.0,0.0,0.0,0.0,0.0,0.0,4.5,1.0
11,0.0,0.0,0.0,0.0,0.0,0.0,0.0,4.5,1.0
12,0.0,0.0,0.0,0.0,0.0,0.0,0.0,4.5,1.0
13,0.0,0.0,0.0,0.0,0.0,0.0,0.0,4.5,1.0
14,21.0,0.0,0.0,0.4084951281547546,0.0,0.0,1.0,4.5,1.0
15,9.0,0.0,0.0,0.0,0.055809661746025,0.0,1.0,4.5,1.0
16,0.0,0.0,0.0,0.0,0.0,0.0,0.0,4.5,1.0
17,3.0,0.0,1.0,0.0,0.9319692254066468,0.0,4.0,4.5,1.0
18,,,,,,,,,
19,15.0,0.0,0.0,0.06809588521718979,0.0,0.0,1.0,4.5,1.0
20,,,,,,,,,
21,,,,,,,,,
22,,,,,,,,,
23,,,,,,,,,
24,,,,,,,,,
25,,,,,,,,,
26,,,,,,,,,
27,,,,,,,,,
28,,,,,,,,,
29,,,,,,,,,
30,,,,,,,,,
31,,,,,,,,,
32,,,,,,,,,
33,,,,,,,,,
34,,,,,,,,,
35,,,,,,,,,
36,,,,,,,,,
37,,,,,,,,,
38,,,,,,,,,
total,112.0,0.0,1.0,0.47659101337194437,0.9877788871526716,0.0,9.0,22.5,0.0
