gameweek,minutes,G,A,xG,xA,bonus,points,price,available
2020/21,0.0,0.0,0.0,0.0,0.0,0.0,0.0,,0.0
1,0.0,0.0,0.0,0.0,0.0,0.0,0.0,4.5,1.0
2,0.0,0.0,0.0,0.0,0.0,0.0,0.0,4.5,1.0
3,38.0,0.0,0.0,0.0,0.0,0.0,1.0,4.4,1.0
4,90.0,0.0,0.0,0.0,0.0,0.0,1.0,4.4,1.0
5,29.0,0.0,0.0,0.0182889942079782,0.0,0.0,1.0,4.4,1.0
6,19.0,0.0,0.0,0.0,0.0,0.0,1.0,4.4,1.0
7,0.0,0.0,0.0,0.0,0.0,0.0,0.0,4.4,1.0
8,33.0,0.0,0.0,0.0,0.1035380437970161,0.0,1.0,4.4,1.0
9,80.0,0.0,0.0,0.0,0.0,0.0,1.0,4.4,1.0
10,84.0,0.0,0.0,0.0,0.0,0.0,2.0,4.3,1.0
11,0.0,0.0,0.0,0.0,0.0,0.0,0.0,4.3,1.0
12,0.0,0.0,0.0,0.0,0.0,0.0,0.0,4.3,1.0
13,0.0,0.0,0.0,0.0,0.0,0.0,0.0,4.3,1.0
14,1.0,0.0,0.0,0.0,0.0,0.0,1.0,4.3,1.0
15,17.0,0.0,0.0,0.0262894574552774,0.0,0.0,1.0,4.3,1.0
16,90.0,0.0,0.0,0.0,0.0,0.0,1.0,4.3,1.0
17,,,,,,,,,
18,,,,,,,,,
19,,,,,,,,,
20,,,,,,,,,
21,,,,,,,,,
22,,,,,,,,,
23,,,,,,,,,
24,,,,,,,,,
25,,,,,,,,,
26,,,,,,,,,
27,,,,,,,,,
28,,,,,,,,,
29,,,,,,,,,
30,,,,,,,,,
31,,,,,,,,,
32,,,,,,,,,
33,,,,,,,,,
34,,,,,,,,,
35,,,,,,,,,
36,,,,,,,,,
37,,,,,,,,,
38,,,,,,,,,
total,481.0,0.0,0.0,0.0445784516632556,0.1035380437970161,0.0,11.0,43.599999999999994,0.0
