gameweek,minutes,G,A,xG,xA,bonus,points,price,available
2020/21,517.0,0.0,0.0,0.3932588808238506,0.9129509925842284,0.0,15.0,,0.0
1,84.0,0.0,0.0,0.0,0.2218256145715713,0.0,3.0,5.0,1.0
2,83.0,0.0,0.0,0.0207949578762054,0.0,0.0,3.0,5.0,1.0
3,0.0,0.0,0.0,0.0,0.0,0.0,0.0,5.0,1.0
4,1.0,0.0,0.0,0.0,0.0,0.0,1.0,5.0,1.0
5,27.0,1.0,0.0,0.059391189366579,0.0,0.0,6.0,5.0,1.0
6,0.0,0.0,0.0,0.0,0.0,0.0,0.0,5.0,1.0
7,0.0,0.0,0.0,0.0,0.0,0.0,0.0,5.0,1.0
8,90.0,0.0,0.0,0.1148046851158142,0.0,0.0,3.0,5.0,1.0
9,69.0,1.0,1.0,0.373807817697525,0.8063186407089233,2.0,13.0,5.0,1.0
10,19.0,0.0,0.0,0.0,0.0,0.0,1.0,5.0,1.0
11,0.0,0.0,0.0,0.0,0.0,0.0,0.0,5.0,0.0
12,0.0,0.0,0.0,0.0,0.0,0.0,0.0,5.0,0.0
13,0.0,0.0,0.0,0.0,0.0,0.0,0.0,5.0,0.0
14,0.0,0.0,0.0,0.0,0.0,0.0,0.0,5.0,0.0
15,0.0,0.0,0.0,0.0,0.0,0.0,0.0,5.0,1.0
16,0.0,0.0,0.0,0.0,0.0,0.0,0.0,5.0,1.0
17,14.0,0.0,0.0,0.0955541580915451,0.0,0.0,1.0,5.0,1.0
18,90.0,0.0,0.0,0.10275547951459885,0.04070955142378807,0.0,1.0,5.0,1.0
19,,,,,,,,,
20,,,,,,,,,
21,,,,,,,,,
22,,,,,,,,,
23,,,,,,,,,
24,,,,,,,,,
25,,,,,,,,,
26,,,,,,,,,
27,,,,,,,,,
28,,,,,,,,,
29,,,,,,,,,
30,,,,,,,,,
31,,,,,,,,,
32,,,,,,,,,
33,,,,,,,,,
34,,,,,,,,,
35,,,,,,,,,
36,,,,,,,,,
37,,,,,,,,,
38,,,,,,,,,
total,477.0,2.0,1.0,0.7671082876622676,1.0688538067042828,2.0,32.0,45.0,0.0
