week,G,GA,xG,xGA,H/A
2020/21,1.0789473684210529,1.605263157894737,1.1842105263157894,1.7105263157894737,
1,0.0,3.0,1.4147306522354484,1.7893776092678308,H
2,0.0,5.0,0.0250088218599557,2.4407474249601364,A
3,1.0,2.0,1.4419705588370562,1.2737146690487862,H
4,0.0,1.0,0.5772923221811652,2.7192357424646616,A
5,1.0,3.0,0.7826649509370327,2.567013932392001,H
6,0.0,2.0,0.8009026357904077,2.278378814458847,A
7,0.0,0.0,0.6797412894666195,0.5847250632941723,A
8,0.0,0.0,1.161312323063612,1.1757166627794504,H
9,0.0,7.0,0.2674286849796772,3.1050940547138453,A
10,1.0,2.0,0.6618869993835688,1.1685475334525108,H
11,2.0,1.0,1.1579690985381603,2.8423506431281567,A
12,2.0,1.0,0.4377803076058626,1.1358816837891936,H
13,0.0,0.0,1.4046996738761663,0.2971572838723659,H
14,1.0,1.0,1.511984433978796,1.1563558634370563,A
15,0.0,3.0,1.1095405891537666,2.013220898807049,A
16,0.0,1.0,0.9888611007481812,2.098167850635946,H
17,0.0,2.0,0.511195020750165,1.9636682588607075,H
18,,,,,
19,0.0,5.0,0.15421240590512753,2.9314599111676216,H
20,,,,,
21,,,,,
22,,,,,
23,,,,,
24,,,,,
25,,,,,
26,,,,,
27,,,,,
28,,,,,
29,,,,,
30,,,,,
31,,,,,
32,,,,,
33,,,,,
34,,,,,
35,,,,,
36,,,,,
37,,,,,
38,,,,,
