gameweek,minutes,G,A,xG,xA,bonus,points,price,available
2020/21,2846.0,8.0,10.0,6.254042700864375,7.5230593085289,15.0,160.0,,0.0
1,70.0,0.0,0.0,0.0178305264562368,0.0585186295211315,0.0,2.0,6.0,1.0
2,90.0,0.0,0.0,0.0152567811310291,0.155997022986412,0.0,2.0,6.0,1.0
3,90.0,0.0,0.0,0.0279249772429466,0.126573234796524,0.0,2.0,5.9,1.0
4,70.0,0.0,0.0,0.0,0.1948440819978714,0.0,2.0,5.8,1.0
5,0.0,0.0,0.0,0.0,0.0,0.0,0.0,5.8,0.0
6,40.0,0.0,0.0,0.1016565710306167,0.0,0.0,1.0,5.8,1.0
7,0.0,0.0,0.0,0.0,0.0,0.0,0.0,5.8,1.0
8,90.0,0.0,0.0,0.0898209735751152,0.0,0.0,2.0,5.7,1.0
9,47.0,0.0,0.0,0.0365778282284736,0.0190881956368684,0.0,1.0,5.7,1.0
10,90.0,0.0,0.0,0.0731254816055297,0.1450966149568557,0.0,1.0,5.7,1.0
11,85.0,0.0,0.0,0.953314483165741,0.0223364178091287,0.0,2.0,5.6,1.0
12,90.0,0.0,1.0,0.0,0.7460536360740662,0.0,5.0,5.6,1.0
13,65.0,0.0,0.0,0.0557547658681869,0.0126041248440742,0.0,3.0,5.6,1.0
14,0.0,0.0,0.0,0.0,0.0,0.0,0.0,5.6,1.0
15,76.0,0.0,0.0,0.0,0.0152932573109865,0.0,1.0,5.6,1.0
16,90.0,0.0,0.0,0.0707026869058609,0.0,0.0,2.0,5.6,1.0
17,90.0,0.0,0.0,0.1218823045492172,0.0135580692440271,0.0,2.0,5.6,1.0
18,30.0,0.0,0.0,0.0,0.0,0.0,1.0,5.6,1.0
19,,,,,,,,,
20,,,,,,,,,
21,,,,,,,,,
22,,,,,,,,,
23,,,,,,,,,
24,,,,,,,,,
25,,,,,,,,,
26,,,,,,,,,
27,,,,,,,,,
28,,,,,,,,,
29,,,,,,,,,
30,,,,,,,,,
31,,,,,,,,,
32,,,,,,,,,
33,,,,,,,,,
34,,,,,,,,,
35,,,,,,,,,
36,,,,,,,,,
37,,,,,,,,,
38,,,,,,,,,
total,1113.0,0.0,1.0,1.5638473797589538,1.509963285177946,0.0,29.0,85.8,0.0
