gameweek,minutes,G,A,xG,xA,bonus,points,price,available
2020/21,1833.0,0.0,1.0,0.1195766255259513,0.9897835236042738,3.0,44.0,,0.0
1,0.0,0.0,0.0,0.0,0.0,0.0,0.0,4.5,1.0
2,0.0,0.0,0.0,0.0,0.0,0.0,0.0,4.5,1.0
3,0.0,0.0,0.0,0.0,0.0,0.0,0.0,4.4,1.0
4,3.0,0.0,0.0,0.0,0.0,0.0,1.0,4.4,1.0
5,0.0,0.0,0.0,0.0,0.0,0.0,0.0,4.4,1.0
6,0.0,0.0,0.0,0.0,0.0,0.0,0.0,4.3,1.0
7,0.0,0.0,0.0,0.0,0.0,0.0,0.0,4.3,1.0
8,0.0,0.0,0.0,0.0,0.0,0.0,0.0,4.3,1.0
9,0.0,0.0,0.0,0.0,0.0,0.0,0.0,4.3,1.0
10,0.0,0.0,0.0,0.0,0.0,0.0,0.0,4.3,1.0
11,0.0,0.0,0.0,0.0,0.0,0.0,0.0,4.3,1.0
12,0.0,0.0,0.0,0.0,0.0,0.0,0.0,4.3,1.0
13,0.0,0.0,0.0,0.0,0.0,0.0,0.0,4.2,1.0
14,90.0,0.0,0.0,0.0,0.0,0.0,2.0,4.2,1.0
15,90.0,0.0,0.0,0.0,0.0,0.0,6.0,4.2,1.0
16,64.0,0.0,0.0,0.0,0.0268902331590652,0.0,0.0,4.2,1.0
17,14.0,0.0,0.0,0.0,0.0,0.0,1.0,4.2,1.0
18,0.0,0.0,0.0,0.0,0.0,0.0,0.0,4.2,0.0
19,0.0,0.0,0.0,0.0,0.0,0.0,0.0,4.2,0.0
20,,,,,,,,,
21,,,,,,,,,
22,,,,,,,,,
23,,,,,,,,,
24,,,,,,,,,
25,,,,,,,,,
26,,,,,,,,,
27,,,,,,,,,
28,,,,,,,,,
29,,,,,,,,,
30,,,,,,,,,
31,,,,,,,,,
32,,,,,,,,,
33,,,,,,,,,
34,,,,,,,,,
35,,,,,,,,,
36,,,,,,,,,
37,,,,,,,,,
38,,,,,,,,,
total,261.0,0.0,0.0,0.0,0.0268902331590652,0.0,10.0,21.2,0.0
