gameweek,minutes,G,A,xG,xA,bonus,points,price,available
2020/21,2172.0,12.0,4.0,8.276573244482279,2.3112305803224444,21.0,131.0,,0.0
1,90.0,1.0,0.0,0.7611688375473022,0.0,1.0,7.0,8.0,1.0
2,90.0,1.0,0.0,0.1154161319136619,0.0,2.0,8.0,8.1,1.0
3,90.0,0.0,1.0,0.1278825849294662,0.0630958676338195,0.0,4.0,8.0,1.0
4,71.0,0.0,0.0,0.0564933903515338,0.0,0.0,2.0,8.0,1.0
5,90.0,0.0,1.0,0.0726279839873313,0.099727563560009,0.0,5.0,7.9,1.0
6,82.0,0.0,0.0,0.0,0.0,0.0,2.0,7.9,1.0
7,90.0,0.0,0.0,0.060704156756401,0.0,0.0,2.0,7.8,1.0
8,90.0,1.0,0.0,0.7112874388694763,0.0,1.0,7.0,7.8,1.0
9,83.0,0.0,0.0,0.1121911630034446,0.0,0.0,2.0,7.8,1.0
10,0.0,0.0,0.0,0.0,0.0,0.0,0.0,7.8,0.0
11,0.0,0.0,0.0,0.0,0.0,0.0,0.0,7.7,1.0
12,68.0,0.0,0.0,0.0,0.0,0.0,2.0,7.7,1.0
13,0.0,0.0,0.0,0.0,0.0,0.0,0.0,7.7,0.0
14,0.0,0.0,0.0,0.0,0.0,0.0,0.0,7.7,0.0
15,0.0,0.0,0.0,0.0,0.0,0.0,0.0,7.7,1.0
16,13.0,0.0,0.0,0.057709090411663,0.0,0.0,1.0,7.7,1.0
17,26.0,0.0,0.0,0.0,0.0,0.0,1.0,7.7,1.0
18,,,,,,,,,
19,74.0,0.0,0.0,0.17330801486968994,0.0,0.0,2.0,7.7,1.0
20,,,,,,,,,
21,,,,,,,,,
22,,,,,,,,,
23,,,,,,,,,
24,,,,,,,,,
25,,,,,,,,,
26,,,,,,,,,
27,,,,,,,,,
28,,,,,,,,,
29,,,,,,,,,
30,,,,,,,,,
31,,,,,,,,,
32,,,,,,,,,
33,,,,,,,,,
34,,,,,,,,,
35,,,,,,,,,
36,,,,,,,,,
37,,,,,,,,,
38,,,,,,,,,
total,957.0,3.0,2.0,2.248788792639971,0.1628234311938285,4.0,45.0,102.10000000000001,0.0
