{
    "name": "Tome of Disappointment",
    "title": "Tome of Disappointment",
    "description": "Open the tome of disappointment and find out just how badly you roll.",
    "author": "Darth_Apples",
    "version": "0.1.1",
    "minimumCoreVersion": "0.7.9",
    "esmodules": [ 
        "ToDMain.js"
    ],
    "url":"https://gitlab.com/mcarthur.alford/foundrystats",
    "manifest":"https://gitlab.com/mcarthur.alford/foundrystats/-/raw/master/module.json",
    "download":"https://gitlab.com/mcarthur.alford/foundrystats/-/archive/master/foundrystats-master.zip"
  }
