{
    "_id": "Tqyybb0eKpwRHYwj",
    "content": "<p>You studied magic at the prestigious Magaambya academy in Nantambu, learning magical traditions dating back to Old-Mage Jatembe and earning a pedigree respected by magical scholars almost everywhere.</p>\n<p>Choose two ability boosts. One must be to <strong>Intelligence</strong>  or <strong>Charisma</strong>, and one is a free ability boost.</p>\n<p>You're trained in your choice of either the Arcana or Nature skill, as well as the Academia Lore skill. You gain the @Compendium[pf2e.feats-srd.Recognize Spell]{Recognize Spell} skill feat.</p>",
    "flags": {},
    "name": "Magaambya Academic",
    "permission": {
        "default": 0
    }
}
