{
    "_id": "9chVicXrB0pvpUjH",
    "data": {
        "actionCategory": {
            "value": ""
        },
        "actionType": {
            "value": "passive"
        },
        "actions": {
            "value": ""
        },
        "description": {
            "chat": "",
            "unidentified": "",
            "value": "<p>You command superlative spellcasting ability. Your proficiency ranks for arcane spell attack rolls and spell DCs increase to master.</p>"
        },
        "featType": {
            "value": "classfeature"
        },
        "level": {
            "value": "15"
        },
        "prerequisites": {
            "value": ""
        },
        "rarity": {
            "value": "common"
        },
        "source": {
            "value": ""
        },
        "traits": {
            "custom": "",
            "value": [
                "wizard"
            ]
        }
    },
    "flags": {},
    "img": "systems/pf2e/icons/features/classes/master-spellcaster.jpg",
    "name": "Master Spellcaster (Wizard)",
    "permission": {
        "default": 0
    },
    "type": "feat"
}
