{
    "_id": "JV5GjNjPuFWyTbw0",
    "content": "<p>Having once sampled Numerian fluids, you've tasted knowledge beyond comprehension. You are driven to recapture that astounding experience.</p>\n<p>Choose two ability boosts. One must be to<strong> Intelligence</strong>  or <strong>Constitution</strong>, and one is a free ability boost.</p>\n<p>You're trained in the Crafting skill and the Alchemical Lore skill. You gain the @Compendium[pf2e.feats-srd.Alchemical Crafting]{Alchemical Crafting} skill feat.</p>",
    "flags": {},
    "name": "Wonder Taster",
    "permission": {
        "default": 0
    }
}
