{
    "_id": "VOI91rOapoBqgUv7",
    "content": "<p>You know how to work the less-than-legal side of the region's markets and know how to slip contraband past the authorities.</p>\n<p>Choose two ability boosts. One must be to <strong>Wisdom</strong> or <strong>Charisma</strong>, and one is a free ability boost.</p>\n<p>You're trained in the Stealth skill and the Underworld Lore skill. You gain the @Compendium[pf2e.feats-srd.Experienced Smuggler]{Experienced Smuggler} skill feat.</p>",
    "flags": {},
    "name": "Black Market Smuggler",
    "permission": {
        "default": 0
    }
}
