{
    "_id": "ZZ85PGb2REtS1qFg",
    "data": {
        "actionCategory": {
            "value": ""
        },
        "actionType": {
            "value": "passive"
        },
        "actions": {
            "value": ""
        },
        "description": {
            "chat": "",
            "unidentified": "",
            "value": "<p>Through your adventures, you've developed keen awareness and attention to detail. Your proficiency rank in Perception increases to master.</p>"
        },
        "featType": {
            "value": "classfeature"
        },
        "level": {
            "value": "7"
        },
        "prerequisites": {
            "value": ""
        },
        "rarity": {
            "value": "common"
        },
        "source": {
            "value": ""
        },
        "traits": {
            "custom": "",
            "rarity": {
                "value": "common"
            },
            "value": [
                "investigator"
            ]
        }
    },
    "flags": {},
    "img": "systems/pf2e/icons/features/classes/vigilant-senses.jpg",
    "name": "Vigilant Senses (Investigator)",
    "permission": {
        "default": 0
    },
    "type": "feat"
}
