{
    "_id": "7dLsA9PAb5ij7Bc6",
    "data": {
        "description": {
            "chat": "",
            "unidentified": "",
            "value": "<p>Granted by using @Compendium[pf2e.equipment-srd.Dueling Cape]{Dueling Cape}</p>\n<hr />\n<p>Automatically applied effects:</p>\n<ul>\n<li>+1 circumstance bonus to Feint</li>\n<li>+1 circumstance bonus to AC</li>\n</ul>\n<p></p>"
        },
        "duration": {
            "expiry": "turn-start",
            "sustained": false,
            "unit": "rounds",
            "value": 0
        },
        "level": {
            "value": 0
        },
        "rarity": {
            "value": "common"
        },
        "rules": [
            {
                "key": "PF2E.RuleElement.FlatModifier",
                "label": "Dueling Cape (Feint)",
                "predicate": {
                    "all": [
                        "feint"
                    ]
                },
                "selector": "deception",
                "type": "circumstance",
                "value": 1
            },
            {
                "key": "PF2E.RuleElement.FlatModifier",
                "selector": "ac",
                "type": "circumstance",
                "value": 1
            },
            {
                "key": "PF2E.RuleElement.TokenEffectIcon"
            }
        ],
        "source": {
            "value": ""
        },
        "start": {
            "initiative": null,
            "value": 0
        },
        "traits": {
            "value": []
        }
    },
    "effects": [],
    "flags": {},
    "img": "systems/pf2e/icons/equipment/adventuring-gear/dueling-cape.jpg",
    "name": "Effect: Dueling Cape",
    "permission": {
        "default": 0
    },
    "type": "effect"
}
