{
    "_id": "76WshSVCoyTq3SRF",
    "content": "<p><span id=\"docs-internal-guid-9f5a66a5-7fff-f53e-616f-716c331994d8\">You were (or still are) a member of a cult whose rites may involve sacred dances to ensure a strong harvest or dire rituals that call upon dark powers. You might have taken up adventuring to further your cult's aims, to initiate yourself into the world's grander mysteries, or to flee unsavory practices or strictures. </span></p>\n<p><span id=\"docs-internal-guid-9f5a66a5-7fff-f53e-616f-716c331994d8\">Choose two ability boosts. One must be to <strong>Intelligence</strong> or <strong>Charisma</strong>, and one is a free ability boost. </span></p>\n<p><span id=\"docs-internal-guid-9f5a66a5-7fff-f53e-616f-716c331994d8\">You're trained in the Occultism skill and the Lore skill related to your deity or cult. You gain the @Compendium[pf2e.feats-srd.Schooled In Secrets]{Schooled In Secrets} skill feat (page 208).</span></p>",
    "flags": {},
    "name": "Cultist",
    "permission": {
        "default": 0
    }
}
