{
    "_id": "G2o8mCXdYKl1tbXP",
    "content": "<p>You're at home blazing trails in the burning sands, and you made a living guiding or following creatures in the desert. You might be a native nomad, an experienced desert guide, a naturalist, a bandit driven into the dunes by the law-or all of the above.</p>\n<p>Choose two ability boosts. One must be to <strong>Constitution</strong>  or <strong>Wisdom</strong>, and one is a free ability boost.</p>\n<p>You're trained in the Survival skill and the Desert Lore skill. You gain the @Compendium[pf2e.feats-srd.Experienced Tracker]{Experienced Tracker} skill feat.</p>",
    "flags": {},
    "name": "Desert Tracker",
    "permission": {
        "default": 0
    }
}
