{
    "_id": "3NrNkKwAwnHT0zJE",
    "data": {
        "actionCategory": {
            "value": ""
        },
        "actionType": {
            "value": "passive"
        },
        "actions": {
            "value": ""
        },
        "description": {
            "chat": "",
            "unidentified": "",
            "value": "<p>You've perfected your command of the magic your patron provides. Your proficiency ranks for spell attacks and spell DCs for your witch spellcasting increase to legendary.</p>"
        },
        "featType": {
            "value": "classfeature"
        },
        "level": {
            "value": "19"
        },
        "prerequisites": {
            "value": ""
        },
        "rarity": {
            "value": "common"
        },
        "source": {
            "value": ""
        },
        "traits": {
            "custom": "",
            "rarity": {
                "value": "common"
            },
            "value": [
                "witch"
            ]
        }
    },
    "flags": {},
    "img": "systems/pf2e/icons/features/classes/legendary-spellcaster.jpg",
    "name": "Legendary Spellcaster (Witch)",
    "permission": {
        "default": 0
    },
    "type": "feat"
}
