{
    "_id": "YYGaSpcfC3XBnyg1",
    "content": "<p>You know that the only way your homeland of Vidrian can remain free from outside conquerors is by forging a strong and unified government. As such, you seek to bind your fellow citizens together through careful diplomacy and force of personality-or, if necessary, subterfuge and intrigue.</p>\n<p>Choose two ability boosts. One must be to <strong>Dexterity</strong>  or <strong>Charisma</strong>, and one is a free ability boost.</p>\n<p>You're trained in the Diplomacy skill and the Politics Lore skill. You gain the @Compendium[pf2e.feats-srd.Hobnobber]{Hobnobber} skill feat</p>",
    "flags": {},
    "name": "Vidrian Reformer",
    "permission": {
        "default": 0
    }
}
