{
    "_id": "pi2azTcLFMq8IWo8",
    "content": "<p><strong>[Rare]</strong></p>\n<p><span id=\"docs-internal-guid-c860c3f1-7fff-7b18-cbc5-1d801395efd0\">You spent your youth in the wilderness, living close to or perhaps raised by animals. You have a close, mystical connection with these animals and gained certain abilities from them, though this limited your well-roundedness in mental pursuits. </span></p>\n<p><span id=\"docs-internal-guid-c860c3f1-7fff-7b18-cbc5-1d801395efd0\">Choose one ability boost. It must be <strong>Strength</strong>, <strong>Dexterity</strong>, or <strong>Constitution</strong>. </span></p>\n<p><span id=\"docs-internal-guid-c860c3f1-7fff-7b18-cbc5-1d801395efd0\">You are trained in Nature and Survival. You gain @Compendium[pf2e.ancestryfeatures.Low-Light Vision]{Low-Light Vision} (or @Compendium[pf2e.ancestryfeatures.Darkvision]{Darkvision} if you already had @Compendium[pf2e.ancestryfeatures.Low-Light Vision]{Low-Light Vision}), imprecise scent with a range of 30 feet, and the @Compendium[pf2e.feats-srd.Forager]{Forager} skill feat.</span></p>",
    "flags": {},
    "name": "Feral Child",
    "permission": {
        "default": 0
    }
}
