{
    "_id": "OoUqJJB77VfWbWRM",
    "data": {
        "actionCategory": {
            "value": ""
        },
        "actionType": {
            "value": "passive"
        },
        "actions": {
            "value": null
        },
        "description": {
            "chat": "",
            "unidentified": "",
            "value": "<p>Your toes are adapted for gripping and climbing. You gain the @Compendium[pf2e.feats-srd.Combat Climber]{Combat Climber} feat as a bonus feat, and as long as you aren't wearing footwear, you can use the sticky pads on your feet to climb, leaving your hands free. Additionally, if you roll a success on an Athletics check to climb, you get a critical success instead.</p>"
        },
        "featType": {
            "value": "ancestryfeature"
        },
        "level": {
            "value": "1"
        },
        "prerequisites": {
            "value": null
        },
        "rarity": {
            "value": "common"
        },
        "rules": [],
        "source": {
            "value": ""
        },
        "traits": {
            "custom": "",
            "rarity": {
                "value": "common"
            },
            "value": [
                "lizardfolk"
            ]
        }
    },
    "effects": [],
    "flags": {},
    "img": "systems/pf2e/icons/features/ancestry/cliifscale-lizardfolk.jpg",
    "name": "Cliffscale Lizardfolk",
    "permission": {
        "default": 0
    },
    "type": "feat"
}
