{
    "_id": "bTLmJMATrrtq8NuT",
    "data": {
        "brokenThreshold": {
            "value": 0
        },
        "bulkCapacity": {
            "value": ""
        },
        "collapsed": {
            "value": false
        },
        "containerId": {
            "value": ""
        },
        "description": {
            "chat": "",
            "unidentified": "",
            "value": "<p><span>This amulet is made from the scales of five ancient dragons. You gain resistance 5 to acid, cold, electricity, fire, and poison. If you take damage of one of these types from a dragon's Breath Weapon, the amulet begins to glow brightly; for the next 10 minutes, your resistance against that type of damage increases to 20. If you are subjected to a dragon's frightful presence, you can roll your saving throw twice and use the higher result to determine the aura's effects. This is a fortune effect.<br /></span></p>\n<p><span><strong>Activate</strong> <span style=\"font-family: 'Pathfinder2eActions'; font-size: 1.8em; display: inline;\">D</span> command; <strong>Frequency</strong> once per day; <strong>Effect</strong> You exude an aura that terrifies all foes in a 60-foot radius, as the frightful presence ability with a DC 34 Will save.</span></p>"
        },
        "equipped": {
            "value": false
        },
        "equippedBulk": {
            "value": ""
        },
        "hardness": {
            "value": 0
        },
        "hp": {
            "value": 0
        },
        "identified": {
            "value": true
        },
        "invested": {
            "value": false
        },
        "level": {
            "value": "15"
        },
        "maxHp": {
            "value": 0
        },
        "negateBulk": {
            "value": ""
        },
        "preciousMaterial": {
            "value": ""
        },
        "preciousMaterialGrade": {
            "value": ""
        },
        "price": {
            "value": "5,800 gp"
        },
        "quantity": {
            "value": "1"
        },
        "rarity": {
            "value": "common"
        },
        "source": {
            "value": ""
        },
        "stackGroup": {
            "value": ""
        },
        "traits": {
            "custom": "",
            "rarity": {
                "value": "rare"
            },
            "usage": {
                "value": "worn"
            },
            "value": [
                "enchantment",
                "invested",
                "magical"
            ]
        },
        "usage": {
            "value": "held-in-one-hand"
        },
        "weight": {
            "value": "-"
        }
    },
    "flags": {},
    "img": "systems/pf2e/icons/equipment/worn-items/other-worn-items/dragonscale-amulet.jpg",
    "name": "Dragonscale Amulet",
    "permission": {
        "default": 0
    },
    "type": "equipment"
}
