{
    "ContractDetails": {
        "ContractsHeader": {
            "global_contract_id_xml_id": "ca58c596-0000-4002-967f-6e1b179c0c29",
            "product_offering": 2808
        },
        "ContractLineItemDetails": [
            {
                "ContractLineItemHeader": {
                    "line_item_id_xml_id": "dc1b7510-0000-400b-8616-421c03fbe906",
                    "billing_start_date": "2015-08-01 10:15:00",
                    "billing_end_date": "2019-12-31 15:00:00"
                }
            }
        ]
    },
    "Accounts": {
        "Billing": {
            "country_code_numeric": 392
        }
    }
}