{
    "ContractDetails": {
        "ContractsHeader": {
            "global_contract_id_xml_id": "013722a8-0000-4004-9961-db1ed08d3018",
            "lock_version": "1"
        },
        "ContractLineItemDetails": [
            {
                "ContractLineItemHeader": {
                    "line_item_id_xml_id": "209bd038-0000-4005-a719-3ecf6232aa11"
                }
            }
        ]
    },
    "Accounts": {
        "Billing": {
            "country_code_numeric": 840
        }
    }
}