Testcase ID,Account Type,Date After(YYYY-MM-DD),Date Before(YYYY-MM-DD),Execution(Y/N)
TC-1,billing,2016-08-01,2017-12-01,y
TC-2,contract,2016-12-15,2017-02-01,y
TC-3,contract,2016-11-07,2017-03-07,y
TC-4,billing,2016-01-15,2017-08-25,y
TC-5,contract,2016-10-15,2017-10-15,y
TC-6,billing,2016-02-20,2017-12-01,y
TC-7,billing,2016-06-11,2017-04-30,y
TC-8,contract,2016-10-01,2016-10-01,y
TC-9,billing,2016-08-01,2016-12-01,y
TC-10,contract,2016-11-11,2016-11-11,y
TC-11,billing,2016-09-09,2017-09-09,y
TC-12,contract,2016-10-28,2016-12-30,y
TC-13,billing,2016-01-05,2017-01-07,y
TC-14,billing,2016-03-01,2017-05-01,y
TC-15,contract,2016-09-01,2016-12-01,y
TC-16,contract,2016-02-22,2016-12-19,y
TC-17,billing,2016-09-16,2017-12-13,y
TC-18,contract,2016-10-21,2017-09-23,y
TC-19,contract,2016-05-05,2016-09-09,y
TC-20,billing,2016-08-08,2016-12-12,y
TC-21,billing,2016-10-27,2017-03-21,y
TC-22,contract,2016-06-30,2017-03-21,y
TC-23,contract,2016-07-07,2016-07-07,y
TC-24,billing,2016-07-28,2016-12-28,y
TC-25,contract,2016-07-13,2017-09-20,y
TC-26,,2016-07-13,2017-09-20,y
TC-27,contract,,2017-09-20,y
TC-28,contract,2016-07-13,,y
TC-29,billing,,,y
TC-30,billing,2016-09-13,2016-09-12,y
TC-31,billing,2017-09-16,2016-12-13,y
TC-32,contract,17-09-16,2016-1-13,y
TC-33,contract,2017-09-6,216-1-3,y
TC-34,conract,2017-09-6,216-1-3,y
TC-35,biling,2017-09-6,216-1-3,y