{
    "ContractDetails": {
        "ContractsHeader": {
            "global_contract_id_xml_id": "ca58c596-0000-4002-967f-6e1b179c0c29",
            "lock_version": "1"
        },
        "ContractLineItemDetails": [
            {
                "ContractLineItemHeader": {
                    "line_item_id_xml_id": "dc1b7510-0000-400b-8616-421c03fbe906"
                }
            }
        ]
    },
    "Accounts": {
        "Billing": {
            "country_code_numeric": 840
        }
    }
}