{
    "ContractDetails": {
        "ContractsHeader": {
            "global_contract_id_xml_id": "169fe0c3-0000-400a-9933-077ebac40db8",
            "product_offering": 2808
        },
        "ContractLineItemDetails": [
            {
                "ContractLineItemHeader": {
                    "line_item_id_xml_id": "cb2edccd-0000-4004-8225-5267d3eb43ac",
                    "billing_start_date": "2015-08-01 10:15:00",
                    "billing_end_date": "2019-12-31 15:00:00",
                    "payment_type": 60
                }
            }
        ]
    }
}