{
    "ContractDetails": {
        "ContractsHeader": {
            "global_contract_id_xml_id": "prodCntrct01",
            "product_offering": 3075
        },
        "ContractLineItemDetails": [{
            "ContractLineItemHeader": {
                "line_item_id_xml_id": "prodCntrctItem01",
                "billing_end_date": "2019-12-31 15:00:00"
            }
        }]
    },
    "Accounts": {
        "Billing": {
            "country_code_numeric": 392
        }
    }
}