{
    "ContractDetails": {
        "ContractsHeader": {
            "global_contract_id_xml_id": "b6193b6a-4dee-11e8-a43b-02003a350025",
            "lock_version": "1"
        },
        "ContractLineItemDetails": [
            {
                "ContractLineItemHeader": {
                    "line_item_id_xml_id": "b6514f3c-4dee-11e8-a1b5-02003a350025",
                    "customer_billing_method": "GBS_Billing",
                    "billing_start_date": "2015-08-01 10:15:00",
                    "billing_end_date": "2019-12-31 15:00:00",
                    "payment_type": 60
                }
            }
        ]
    },
    "Accounts": {
        "Billing": {
            "country_code_numeric": 840
        }
    }
}