{
    "ContractDetails": {
        "ContractsHeader": {
            "global_contract_id_xml_id": "f5550a72-4df1-11e8-960c-02003a350025",
            "product_offering": 3075
        },
        "ContractLineItemDetails": [{
            "ContractLineItemHeader": {
                "line_item_id_xml_id": "prodCntrctItem01"
            }
        }]
    },
    "Accounts": {
        "Billing": {
            "country_code_numeric": 392
        }
    }
}