{
    "ContractDetails": {
        "ContractsHeader": {
            "global_contract_id_xml_id": "fd32fee2-0000-400a-9285-4afefa520ce6",
            "product_offering": 2808
        },
        "ContractLineItemDetails": [
            {
                "ContractLineItemHeader": {
                    "line_item_id_xml_id": "46549773-0000-400b-875f-7f02b69b47bf"
                }
            }
        ]
    },
    "Accounts": {
        "Billing": {
            "country_code_numeric": 392
        }
    }
}