{
    "ContractDetails": {
        "ContractsHeader": {
            "global_contract_id_xml_id": "prodCntrct01",
            "product_offering": 2808
        },
        "ContractLineItemDetails": [{
            "ContractLineItemHeader": {
                "line_item_id_xml_id": "prodCntrctItem01",
                "customer_billing_method": "GBS_Billing",
                "billing_start_date": "2015-08-01 10:15:00",
                "billing_end_date": "2019-12-31 15:00:00"
            }
        }]
    },
    "Accounts": {
        "Billing": {
            "country_code_numeric": 840
        }
    }
}