{
    "ContractDetails": {
        "ContractsHeader": {
            "global_contract_id_xml_id": "f6e4767a-0000-400c-9a4b-3f1af7349964",
            "lock_version": "1"
        },
        "ContractLineItemDetails": [
            {
                "ContractLineItemHeader": {
                    "line_item_id_xml_id": "c1294b1e-0000-400a-9b11-7d46daf2398d",
                    "billing_start_date": "2015-08-01 10:15:00",
                    "payment_type": 60
                }
            }
        ]
    },
    "Accounts": {
        "Billing": {
            "country_code_numeric": 392
        }
    }
}