{
    "ContractDetails": {
        "ContractsHeader": {
            "global_contract_id_xml_id": "f5550a72-4df1-11e8-960c-02003a350025",
            "product_offering": 2808
        },
        "ContractLineItemDetails": [{
            "ContractLineItemHeader": {
                "line_item_id_xml_id": "f58fab46-4df1-11e8-b85c-02003a350025",
                "customer_billing_method": "GBS_Billing",
                "billing_start_date": "2015-08-01 10:15:00",
                "payment_type": 60
            }
        }, {
            "ContractLineItemHeader": {
                "line_item_id_xml_id": "df7bf6ea-4df4-11e8-aadf-02003a350025",
                "customer_billing_method": "GBS_Billing",
                "payment_type": 60
            }
        }]
    },
    "Accounts": {
        "Billing": {
            "country_code_numeric": 392
        }
    }
}