{
  "astro:sun:local": {
    "class": "org.eclipse.smarthome.config.discovery.internal.DiscoveryResultImpl",
    "value": {
      "thingUID": {
        "segments": [
          "astro",
          "sun",
          "local"
        ]
      },
      "thingTypeUID": {
        "segments": [
          "astro",
          "sun"
        ]
      },
      "properties": {
        "useMeteorologicalSeason": false,
        "geolocation": "43.580807799999995,7.124096499999999,0"
      },
      "representationProperty": "geolocation",
      "flag": "IGNORED",
      "label": "Local Sun",
      "timestamp": 1600412468015,
      "timeToLive": -1
    }
  },
  "astro:moon:local": {
    "class": "org.eclipse.smarthome.config.discovery.internal.DiscoveryResultImpl",
    "value": {
      "thingUID": {
        "segments": [
          "astro",
          "moon",
          "local"
        ]
      },
      "thingTypeUID": {
        "segments": [
          "astro",
          "moon"
        ]
      },
      "properties": {
        "geolocation": "43.580807799999995,7.124096499999999,0"
      },
      "representationProperty": "geolocation",
      "flag": "IGNORED",
      "label": "Local Moon",
      "timestamp": 1600412468020,
      "timeToLive": -1
    }
  },
  "ntp:ntp:local": {
    "class": "org.eclipse.smarthome.config.discovery.internal.DiscoveryResultImpl",
    "value": {
      "thingUID": {
        "segments": [
          "ntp",
          "ntp",
          "local"
        ]
      },
      "thingTypeUID": {
        "segments": [
          "ntp",
          "ntp"
        ]
      },
      "properties": {
        "timeZone": "Europe/Paris"
      },
      "flag": "IGNORED",
      "label": "Heure locale",
      "timestamp": 1600198099969,
      "timeToLive": -1
    }
  }
}