{
  "autoupdate:prise_connectee": {
    "class": "org.eclipse.smarthome.core.items.Metadata",
    "value": {
      "key": {
        "segments": [
          "autoupdate",
          "prise_connectee"
        ]
      },
      "value": "false",
      "configuration": {}
    }
  }
}