{
  "amazonechocontrol:account:06258711": {
    "class": "org.eclipse.smarthome.core.thing.internal.BridgeImpl",
    "value": {
      "label": "Amazon Account",
      "channels": [
        {
          "acceptedItemType": "String",
          "kind": "STATE",
          "uid": {
            "segments": [
              "amazonechocontrol",
              "account",
              "06258711",
              "sendMessage"
            ]
          },
          "channelTypeUID": {
            "segments": [
              "amazonechocontrol",
              "sendMessage"
            ]
          },
          "label": "Send Message",
          "description": "Sends a message to the Echo devices (Write only).",
          "configuration": {
            "properties": {}
          },
          "properties": {},
          "defaultTags": []
        }
      ],
      "configuration": {
        "properties": {}
      },
      "properties": {},
      "uid": {
        "segments": [
          "amazonechocontrol",
          "account",
          "06258711"
        ]
      },
      "thingTypeUID": {
        "segments": [
          "amazonechocontrol",
          "account"
        ]
      }
    }
  }
}