{
  "amazonechocontrol:flashbriefingprofile:06258711:1": {
    "class": "org.eclipse.smarthome.config.discovery.internal.DiscoveryResultImpl",
    "value": {
      "bridgeUID": {
        "segments": [
          "amazonechocontrol",
          "account",
          "06258711"
        ]
      },
      "thingUID": {
        "segments": [
          "amazonechocontrol",
          "flashbriefingprofile",
          "06258711",
          "1"
        ]
      },
      "thingTypeUID": {
        "segments": [
          "amazonechocontrol",
          "flashbriefingprofile"
        ]
      },
      "properties": {
        "configurationJson": "[{\"feedId\":{\"value\":\"ec718ee6-b85f-4905-aaab-cfb9e86541fe\"},\"skillId\":\"amzn1.ask.skill.317aa3bc-e02b-4ac6-b7e5-57f3b2eb67b0\"},{\"feedId\":{\"value\":\"f32ea66b-d015-4730-8dd5-02f016f839ec\"},\"skillId\":\"amzn1.ask.skill.45add699-04af-4216-aeb1-ffb20a9ec650\"}]"
      },
      "flag": "NEW",
      "label": "FlashBriefing 1",
      "timestamp": 1585052466659,
      "timeToLive": -1
    }
  },
  "network:pingdevice:192_168_43_168": {
    "class": "org.eclipse.smarthome.config.discovery.internal.DiscoveryResultImpl",
    "value": {
      "thingUID": {
        "segments": [
          "network",
          "pingdevice",
          "192_168_43_168"
        ]
      },
      "thingTypeUID": {
        "segments": [
          "network",
          "pingdevice"
        ]
      },
      "properties": {
        "hostname": "192.168.43.168"
      },
      "flag": "NEW",
      "label": "Network Device (192.168.43.168)",
      "timestamp": 1585166493725,
      "timeToLive": 600
    }
  },
  "amazonechocontrol:echo:06258711:G090XG09949409CK": {
    "class": "org.eclipse.smarthome.config.discovery.internal.DiscoveryResultImpl",
    "value": {
      "bridgeUID": {
        "segments": [
          "amazonechocontrol",
          "account",
          "06258711"
        ]
      },
      "thingUID": {
        "segments": [
          "amazonechocontrol",
          "echo",
          "06258711",
          "G090XG09949409CK"
        ]
      },
      "thingTypeUID": {
        "segments": [
          "amazonechocontrol",
          "echo"
        ]
      },
      "properties": {
        "serialNumber": "G090XG09949409CK",
        "deviceFamily": "ECHO"
      },
      "representationProperty": "serialNumber",
      "flag": "NEW",
      "label": "Boukadida - Echo Dot",
      "timestamp": 1585052466654,
      "timeToLive": -1
    }
  },
  "network:servicedevice:192_168_43_168_80": {
    "class": "org.eclipse.smarthome.config.discovery.internal.DiscoveryResultImpl",
    "value": {
      "thingUID": {
        "segments": [
          "network",
          "servicedevice",
          "192_168_43_168_80"
        ]
      },
      "thingTypeUID": {
        "segments": [
          "network",
          "servicedevice"
        ]
      },
      "properties": {
        "port": 80,
        "hostname": "192.168.43.168"
      },
      "flag": "NEW",
      "label": "Device providing a Webserver (192.168.43.168:80)",
      "timestamp": 1585166493652,
      "timeToLive": 600
    }
  }
}