<?xml version="1.0" encoding="UTF-8" standalone="no"?>
<!-- Created with Inkscape (http://www.inkscape.org/) -->

<svg
   xmlns:dc="http://purl.org/dc/elements/1.1/"
   xmlns:cc="http://creativecommons.org/ns#"
   xmlns:rdf="http://www.w3.org/1999/02/22-rdf-syntax-ns#"
   xmlns:svg="http://www.w3.org/2000/svg"
   xmlns="http://www.w3.org/2000/svg"
   xmlns:sodipodi="http://sodipodi.sourceforge.net/DTD/sodipodi-0.dtd"
   xmlns:inkscape="http://www.inkscape.org/namespaces/inkscape"
   width="1000"
   height="1000"
   viewBox="0 0 1000 1000"
   id="svg2"
   version="1.1"
   inkscape:version="0.92.1 r15371"
   sodipodi:docname="logo_lighter_outlined.svg">
  <defs
     id="defs4" />
  <sodipodi:namedview
     id="base"
     pagecolor="#ffffff"
     bordercolor="#666666"
     borderopacity="1.0"
     inkscape:pageopacity="0.0"
     inkscape:pageshadow="2"
     inkscape:zoom="0.3535534"
     inkscape:cx="352.18533"
     inkscape:cy="438.10731"
     inkscape:document-units="px"
     inkscape:current-layer="layer1"
     showgrid="true"
     showguides="true"
     units="px"
     inkscape:window-width="1366"
     inkscape:window-height="738"
     inkscape:window-x="0"
     inkscape:window-y="30"
     inkscape:window-maximized="0"
     inkscape:guide-bbox="true">
    <inkscape:grid
       type="xygrid"
       id="grid4136" />
    <sodipodi:guide
       position="530,740"
       orientation="0,1"
       id="guide1549"
       inkscape:locked="false" />
    <sodipodi:guide
       position="860,260"
       orientation="0,1"
       id="guide1551"
       inkscape:locked="false" />
    <sodipodi:guide
       position="310,900"
       orientation="0,1"
       id="guide1553"
       inkscape:locked="false" />
    <sodipodi:guide
       position="530,100"
       orientation="0,1"
       id="guide1555"
       inkscape:locked="false" />
    <sodipodi:guide
       position="670,950"
       orientation="0,1"
       id="guide1557"
       inkscape:locked="false" />
    <sodipodi:guide
       position="620,50"
       orientation="0,1"
       id="guide1559"
       inkscape:locked="false" />
    <sodipodi:guide
       position="500,1310"
       orientation="1,0"
       id="guide1561"
       inkscape:locked="false" />
  </sodipodi:namedview>
  <metadata
     id="metadata7">
    <rdf:RDF>
      <cc:Work
         rdf:about="">
        <dc:format>image/svg+xml</dc:format>
        <dc:type
           rdf:resource="http://purl.org/dc/dcmitype/StillImage" />
        <dc:title></dc:title>
      </cc:Work>
    </rdf:RDF>
  </metadata>
  <g
     inkscape:groupmode="layer"
     id="layer2"
     inkscape:label="Layer 2"
     style="display:inline">
    <rect
       transform="translate(0,-52.36214)"
       style="fill:#000000;fill-opacity:0.44769874;stroke:none;stroke-width:40;stroke-miterlimit:4;stroke-dasharray:none;stroke-opacity:1"
       id="rect5788"
       width="1720"
       height="1360"
       x="-320"
       y="-107.63786" />
  </g>
  <g
     inkscape:label="Layer 1"
     inkscape:groupmode="layer"
     id="layer1"
     transform="translate(0,-52.36214)">
    <g
       id="g19341"
       transform="matrix(1.8593812,0,0,1.8593812,-432.68348,-472.65331)">
      <path
         inkscape:export-ydpi="40.634918"
         inkscape:export-xdpi="40.634918"
         inkscape:export-filename="/home/pfm/sources/inforshop/logo/logo_full_outlined.png"
         inkscape:connector-curvature="0"
         id="path825-4-9-5-3"
         d="m 528.0534,326.67411 c -16.88852,0.36714 -33.68525,3.0292 -50.39021,7.98561 -16.70495,4.77285 -31.75804,11.74826 -45.15872,20.92681 -13.40067,9.17855 -24.23108,20.46816 -32.49177,33.86883 -8.26069,13.40068 -12.39104,28.91214 -12.39104,46.53495 0,16.88852 4.13035,30.47332 12.39104,40.75329 8.26069,10.0964 20.28486,15.14433 36.07196,15.14433 12.11568,0 22.30386,-3.85499 30.56455,-11.56497 6.54126,-6.10517 10.48925,-13.59314 11.85079,-22.46082 h -18.54277 c -1.06061,3.96975 -3.04952,7.41942 -5.97496,10.34486 -4.4057,4.4057 -10.3712,6.60855 -17.89761,6.60855 -8.99497,0 -16.33809,-3.39578 -22.02879,-10.18791 -5.50712,-6.79212 -8.26069,-16.5211 -8.26069,-29.18749 0,-13.95139 3.12044,-26.43476 9.36184,-37.44902 6.42499,-11.19782 14.86952,-20.55994 25.33306,-28.08635 10.64711,-7.5264 22.48744,-13.40039 35.52097,-17.62253 13.21711,-4.4057 26.61806,-7.15926 40.20231,-8.26069 -7.52641,13.9514 -12.85052,31.20733 -15.97122,51.76727 -2.93714,20.37637 -4.40543,47.26896 -4.40543,80.67886 0,23.68065 0.4592,47.45363 1.37706,71.31785 1.10143,23.86422 1.65214,45.80039 1.65214,65.80962 0,18.35709 -1.19376,36.43909 -3.58019,54.24547 -2.20285,17.62281 -6.79157,33.40964 -13.76726,47.36102 -6.9757,13.76782 -17.16388,24.96592 -30.56456,33.59375 -13.2171,8.44426 -30.93225,12.66612 -53.14433,12.66612 -9.36212,0 -19.73332,-1.65214 -31.11471,-4.95641 -11.19783,-3.48785 -21.84522,-9.178 -31.94162,-17.07155 -9.91283,-7.89355 -18.17352,-18.35709 -24.78207,-31.39062 -6.42498,-13.03353 -9.63775,-29.09654 -9.63775,-48.18792 0,-16.15424 2.29519,-29.82972 6.88446,-41.02754 4.77285,-11.3814 10.9222,-20.652 18.44861,-27.81127 7.5264,-7.15926 16.06244,-12.29953 25.60813,-15.42023 9.54569,-3.30428 19.45852,-4.95641 29.73849,-4.95641 18.72424,0 34.14419,5.41561 46.25987,16.2463 8.39987,7.27153 13.92856,16.42792 16.5916,27.46679 h 18.31395 c -0.95624,-4.49683 -2.30853,-8.88061 -4.06591,-13.14854 -3.67142,-9.36211 -8.99471,-17.62281 -15.9704,-24.78207 -6.9757,-7.15927 -15.69559,-12.66639 -26.15913,-16.52138 -10.27997,-4.03856 -21.93645,-6.05757 -34.96998,-6.05757 -10.64711,0 -21.75288,1.9275 -33.31784,5.78249 -11.3814,3.67142 -21.93728,9.72926 -31.66653,18.17352 -9.72926,8.44426 -17.80611,19.45851 -24.23109,33.04276 -6.42498,13.40068 -9.63774,29.73821 -9.63774,49.01315 0,17.62281 2.75356,33.68582 8.26069,48.18792 5.50712,14.5021 13.2171,26.89314 23.12993,37.1731 9.91283,10.27998 21.937,18.35682 36.07196,24.23109 14.13496,5.87427 29.83027,8.81168 47.08593,8.81168 49.56415,0 85.36048,-16.15452 107.38898,-48.46299 22.02851,-32.30848 33.04277,-78.20148 33.04277,-137.67846 0,-29.37135 -0.55072,-56.17242 -1.65214,-80.40378 -1.10143,-24.23136 -1.65214,-47.63665 -1.65214,-70.21587 0,-23.68064 0.82607,-43.23095 2.4782,-58.6509 1.65214,-15.41996 5.14027,-28.17786 10.46382,-38.27426 13.76782,1.10143 26.70957,3.85499 38.82525,8.26069 12.11568,4.22213 22.57922,10.09613 31.39062,17.62253 8.8114,7.52641 15.60298,17.07237 20.37582,28.63734 4.95641,11.3814 7.43462,24.78152 7.43462,40.20148 0,27.90277 -7.34228,50.20664 -22.02795,66.91159 -14.68567,16.70495 -34.97053,25.241 -60.85403,25.60814 v 16.79729 h 11.28988 c 17.98996,0 31.84928,2.84507 41.57854,8.53577 9.91283,5.6907 17.1636,13.49219 21.75287,23.40501 4.77285,9.91283 7.52641,21.937 8.26069,36.07196 0.73429,14.13496 1.10198,29.64643 1.10198,46.53495 0,17.25566 1.10143,32.95098 3.30428,47.08594 2.38642,14.13496 6.05756,26.34297 11.01397,36.62294 5.13999,10.0964 11.93239,17.80638 20.37665,23.12994 8.4443,5.50712 18.9078,8.26069 31.39063,8.26069 2.00012,0 3.93857,-0.0649 5.81883,-0.19 v -16.71055 c -4.84271,-0.40133 -9.07849,-2.01634 -12.70331,-4.85315 -4.03856,-3.48785 -7.34283,-9.178 -9.91283,-17.07155 -2.38644,-7.89355 -4.13008,-18.44943 -5.23148,-31.66653 -1.10144,-13.21711 -1.65212,-29.55464 -1.65212,-49.01315 0,-13.58425 -0.64225,-27.07671 -1.92724,-40.47739 -1.10142,-13.58424 -4.49803,-25.88377 -10.18873,-36.89802 -5.50713,-11.19783 -14.31853,-20.55995 -26.43421,-28.08635 -11.93211,-7.52641 -28.82036,-12.02362 -50.6653,-13.49219 v -5.78248 c 16.88852,-0.36715 30.9317,-3.76293 42.12953,-10.18791 11.38139,-6.42498 20.46815,-14.31881 27.26027,-23.68092 6.79213,-9.36212 11.5647,-19.64182 14.31826,-30.83964 2.93714,-11.3814 4.40625,-22.12029 4.40625,-32.21669 0,-16.15424 -3.02892,-30.56511 -9.08676,-43.2315 -6.05783,-12.84997 -14.77773,-23.86422 -26.15913,-33.04277 -11.19782,-9.36211 -24.78179,-16.7044 -40.75246,-22.02795 -15.97067,-5.50713 -33.68581,-9.1791 -53.14433,-11.01481 -17.89461,-1.02703 -13.66486,-1.02675 -30.01357,-1.10115 z"
         style="font-style:normal;font-variant:normal;font-weight:normal;font-stretch:normal;font-size:1333.33337402px;line-height:1.25;font-family:Sevillana;-inkscape-font-specification:Sevillana;letter-spacing:0px;word-spacing:0px;fill:#fffffd;fill-opacity:1;stroke:#f5ffff;stroke-width:50.13600159;stroke-miterlimit:4;stroke-dasharray:none;stroke-opacity:1" />
      <path
         inkscape:export-ydpi="40.634918"
         inkscape:export-xdpi="40.634918"
         inkscape:export-filename="/home/pfm/sources/inforshop/logo/logo_full_outlined.png"
         inkscape:connector-curvature="0"
         id="path825-4-9-5"
         d="m 528.06817,326.57021 c -16.88852,0.36714 -33.68525,3.0292 -50.39021,7.98561 -16.70495,4.77285 -31.75804,11.74826 -45.15872,20.92681 -13.40067,9.17855 -24.23108,20.46816 -32.49177,33.86883 -8.26069,13.40068 -12.39104,28.91214 -12.39104,46.53495 0,16.88852 4.13035,30.47332 12.39104,40.75329 8.26069,10.0964 20.28486,15.14433 36.07196,15.14433 12.11568,0 22.30386,-3.85499 30.56455,-11.56497 6.54126,-6.10517 10.48925,-13.59314 11.85079,-22.46082 H 459.972 c -1.06061,3.96975 -3.04952,7.41942 -5.97496,10.34486 -4.4057,4.4057 -10.3712,6.60855 -17.89761,6.60855 -8.99497,0 -16.33809,-3.39578 -22.02879,-10.18791 -5.50712,-6.79212 -8.26069,-16.5211 -8.26069,-29.18749 0,-13.95139 3.12044,-26.43476 9.36184,-37.44902 6.42499,-11.19782 14.86952,-20.55994 25.33306,-28.08635 10.64711,-7.5264 22.48744,-13.40039 35.52097,-17.62253 13.21711,-4.4057 26.61806,-7.15926 40.20231,-8.26069 -7.52641,13.9514 -12.85052,31.20733 -15.97122,51.76727 -2.93714,20.37637 -4.40543,47.26896 -4.40543,80.67886 0,23.68065 0.4592,47.45363 1.37706,71.31785 1.10143,23.86422 1.65214,45.80039 1.65214,65.80962 0,18.35709 -1.19376,36.43909 -3.58019,54.24547 -2.20285,17.62281 -6.79157,33.40964 -13.76726,47.36102 -6.9757,13.76782 -17.16388,24.96592 -30.56456,33.59375 -13.2171,8.44426 -30.93225,12.66612 -53.14433,12.66612 -9.36212,0 -19.73332,-1.65214 -31.11471,-4.95641 -11.19783,-3.48785 -21.84522,-9.178 -31.94162,-17.07155 -9.91283,-7.89355 -18.17352,-18.35709 -24.78207,-31.39062 -6.42498,-13.03353 -9.63775,-29.09654 -9.63775,-48.18792 0,-16.15424 2.29519,-29.82972 6.88446,-41.02754 4.77285,-11.3814 10.9222,-20.652 18.44861,-27.81127 7.5264,-7.15926 16.06244,-12.29953 25.60813,-15.42023 9.54569,-3.30428 19.45852,-4.95641 29.73849,-4.95641 18.72424,0 34.14419,5.41561 46.25987,16.2463 8.39987,7.27153 13.92856,16.42792 16.5916,27.46679 h 18.31395 c -0.95624,-4.49683 -2.30853,-8.88061 -4.06591,-13.14854 -3.67142,-9.36211 -8.99471,-17.62281 -15.9704,-24.78207 -6.9757,-7.15927 -15.69559,-12.66639 -26.15913,-16.52138 -10.27997,-4.03856 -21.93645,-6.05757 -34.96998,-6.05757 -10.64711,0 -21.75288,1.9275 -33.31784,5.78249 -11.3814,3.67142 -21.93728,9.72926 -31.66653,18.17352 -9.72926,8.44426 -17.80611,19.45851 -24.23109,33.04276 -6.42498,13.40068 -9.63774,29.73821 -9.63774,49.01315 0,17.62281 2.75356,33.68582 8.26069,48.18792 5.50712,14.5021 13.2171,26.89314 23.12993,37.1731 9.91283,10.27998 21.937,18.35682 36.07196,24.23109 14.13496,5.87427 29.83027,8.81168 47.08593,8.81168 49.56415,0 85.36048,-16.15452 107.38898,-48.46299 22.02851,-32.30848 33.04277,-78.20148 33.04277,-137.67846 0,-29.37135 -0.55072,-56.17242 -1.65214,-80.40378 -1.10143,-24.23136 -1.65214,-47.63665 -1.65214,-70.21587 0,-23.68064 0.82607,-43.23095 2.4782,-58.6509 1.65214,-15.41996 5.14027,-28.17786 10.46382,-38.27426 13.76782,1.10143 26.70957,3.85499 38.82525,8.26069 12.11568,4.22213 22.57922,10.09613 31.39062,17.62253 8.8114,7.52641 15.60298,17.07237 20.37582,28.63734 4.95641,11.3814 7.43462,24.78152 7.43462,40.20148 0,27.90277 -7.34228,50.20664 -22.02795,66.91159 -14.68567,16.70495 -34.97053,25.241 -60.85403,25.60814 v 16.79729 h 11.28988 c 17.98996,0 31.84928,2.84507 41.57854,8.53577 9.91283,5.6907 17.1636,13.49219 21.75287,23.40501 4.77285,9.91283 7.52641,21.937 8.26069,36.07196 0.73429,14.13496 1.10198,29.64643 1.10198,46.53495 0,17.25566 1.10143,32.95098 3.30428,47.08594 2.38642,14.13496 6.05756,26.34297 11.01397,36.62294 5.13999,10.0964 11.93239,17.80638 20.37665,23.12994 8.4443,5.50712 18.9078,8.26069 31.39063,8.26069 2.00012,0 3.93857,-0.0649 5.81883,-0.19 v -16.71055 c -4.84271,-0.40133 -9.07849,-2.01634 -12.70331,-4.85315 -4.03856,-3.48785 -7.34283,-9.178 -9.91283,-17.07155 -2.38644,-7.89355 -4.13008,-18.44943 -5.23148,-31.66653 -1.10144,-13.21711 -1.65212,-29.55464 -1.65212,-49.01315 0,-13.58425 -0.64225,-27.07671 -1.92724,-40.47739 -1.10142,-13.58424 -4.49803,-25.88377 -10.18873,-36.89802 -5.50713,-11.19783 -14.31853,-20.55995 -26.43421,-28.08635 -11.93211,-7.52641 -28.82036,-12.02362 -50.6653,-13.49219 v -5.78248 c 16.88852,-0.36715 30.9317,-3.76293 42.12953,-10.18791 11.38139,-6.42498 20.46815,-14.31881 27.26027,-23.68092 6.79213,-9.36212 11.5647,-19.64182 14.31826,-30.83964 2.93714,-11.3814 4.40625,-22.12029 4.40625,-32.21669 0,-16.15424 -3.02892,-30.56511 -9.08676,-43.2315 -6.05783,-12.84997 -14.77773,-23.86422 -26.15913,-33.04277 -11.19782,-9.36211 -24.78179,-16.7044 -40.75246,-22.02795 -15.97067,-5.50713 -33.68581,-9.1791 -53.14433,-11.01481 -17.89461,-1.02703 -13.66486,-1.02675 -30.01357,-1.10115 z"
         style="font-style:normal;font-variant:normal;font-weight:normal;font-stretch:normal;font-size:1333.33337402px;line-height:1.25;font-family:Sevillana;-inkscape-font-specification:Sevillana;letter-spacing:0px;word-spacing:0px;fill:#090000;fill-opacity:1;stroke:#020004;stroke-width:33.83599854;stroke-miterlimit:4;stroke-dasharray:none;stroke-opacity:1" />
      <g
         inkscape:export-ydpi="40.634918"
         inkscape:export-xdpi="40.634918"
         inkscape:export-filename="/home/pfm/sources/inforshop/logo/logo_full_outlined.png"
         transform="matrix(0.42294736,0,0,0.42294736,288.52632,340.88888)"
         style="display:inline;fill:#b30000;fill-opacity:1"
         inkscape:label="Layer 2"
         id="layer2-0">
        <g
           transform="translate(-54.982422,83.95929)"
           id="text823-4"
           style="font-style:normal;font-variant:normal;font-weight:normal;font-stretch:normal;font-size:40px;line-height:1.25;font-family:VT323;-inkscape-font-specification:VT323;letter-spacing:0px;word-spacing:0px;fill:#b30000;fill-opacity:1;stroke:#ffffff;stroke-width:40;stroke-miterlimit:4;stroke-dasharray:none;stroke-opacity:1"
           aria-label="R">
          <path
             inkscape:connector-curvature="0"
             id="path825-8"
             transform="translate(0,52.36214)"
             d="m 621.3457,-170.17578 c -39.93055,0.86805 -79.64409,7.16211 -119.14062,18.88086 -39.49653,11.28472 -75.08746,27.77712 -106.77149,49.47851 -31.68403,21.701401 -57.29101,48.3941 -76.82226,80.078129 -19.53125,31.6840284 -29.29688,68.35872 -29.29688,110.02539 0,39.930551 9.76563,72.049911 29.29688,96.355471 19.53125,23.87153 47.96072,35.80664 85.28711,35.80664 28.64583,0 52.73437,-9.11458 72.26562,-27.34375 C 491.62994,178.67064 500.96442,160.9664 504.18359,140 H 460.3418 c -2.50767,9.38592 -7.21016,17.54218 -14.12696,24.45898 -10.41667,10.41667 -24.52126,15.625 -42.3164,15.625 -21.26736,0 -38.62913,-8.02886 -52.08399,-24.08789 -13.02083,-16.05903 -19.53125,-39.06184 -19.53125,-69.009762 0,-32.98611 7.37783,-62.501301 22.13477,-88.5429686 15.19097,-26.4756954 35.15689,-48.6111104 59.89648,-66.4062504 25.17361,-17.795139 53.16841,-31.683368 83.98438,-41.666019 31.25,-10.41666 62.93468,-16.92708 95.05273,-19.53125 -17.79514,32.986124 -30.38325,73.785375 -37.76172,122.3964881 C 548.6454,41.413414 545.17383,104.99717 545.17383,183.99023 c 0,55.98958 1.08572,112.19749 3.25586,168.6211 2.60417,56.42361 3.90625,108.28862 3.90625,155.59765 0,43.40278 -2.82248,86.15516 -8.46485,128.25586 -5.20833,41.66667 -16.05773,78.99241 -32.55078,111.97852 -16.49305,32.55208 -40.58159,59.02842 -72.26562,79.42773 -31.25,19.96528 -73.13499,29.94727 -125.65235,29.94727 -22.13542,0 -46.65668,-3.90625 -73.5664,-11.71875 -26.4757,-8.24653 -51.64996,-21.70009 -75.52149,-40.36328 -23.4375,-18.6632 -42.96875,-43.40278 -58.59375,-74.21875 -15.190964,-30.81597 -22.787106,-68.79471 -22.787106,-113.9336 0,-38.19445 5.426646,-70.52821 16.277344,-97.0039 11.284732,-26.90973 25.824002,-48.82878 43.619142,-65.75586 17.79513,-16.92709 37.97742,-29.08052 60.54687,-36.45899 22.56945,-7.8125 46.00695,-11.71875 70.3125,-11.71875 44.27084,0 80.72917,12.80447 109.375,38.41211 19.86033,17.19252 32.93215,38.84153 39.22852,64.94141 h 43.30078 c -2.2609,-10.63213 -5.45819,-20.99696 -9.61328,-31.08789 -8.68056,-22.13542 -21.26672,-41.66667 -37.75977,-58.59375 -16.49306,-16.92709 -37.11003,-29.94792 -61.84961,-39.0625 -24.30556,-9.54861 -51.86567,-14.32227 -82.68164,-14.32227 -25.17361,0 -51.43164,4.5573 -78.77539,13.67188 -26.90972,8.68056 -51.86762,23.00347 -74.87109,42.96875 -23.003478,19.96527 -42.100044,46.00694 -57.291017,78.125 -15.190973,31.68403 -22.787109,70.31184 -22.787109,115.88476 0,41.66667 6.510417,79.64541 19.53125,113.9336 13.020834,34.2882 31.250008,63.58507 54.687496,87.89062 23.4375,24.30556 51.86697,43.40213 85.28711,57.29102 33.42014,13.88889 70.52952,20.83398 111.32813,20.83398 117.18751,0 201.82292,-38.19509 253.90625,-114.58398 52.08333,-76.38889 78.125,-184.89648 78.125,-325.52149 0,-69.44445 -1.30208,-132.81184 -3.90625,-190.10351 -2.60417,-57.29167 -3.90625,-112.63021 -3.90625,-166.01563 0,-55.989573 1.95312,-102.21353775 5.85937,-138.671871 3.90625,-36.458335 12.15343,-66.622609 24.74024,-90.494139 32.55209,2.60417 63.15104,9.11458 91.79687,19.53125 28.64583,9.982633 53.38542,23.870875 74.21875,41.666014 20.83333,17.795139 36.89106,40.365233 48.17578,67.7089841 11.71875,26.9097229 17.57813,58.5924409 17.57813,95.0507809 0,65.972221 -17.3598,118.706591 -52.08203,158.203121 -34.72222,39.49653 -82.68294,59.67883 -143.88086,60.54688 v 39.71484 h 26.69336 c 42.53473,0 75.30317,6.72678 98.30664,20.18164 23.4375,13.45486 40.58095,31.90039 51.43164,55.33789 11.28472,23.4375 17.79514,51.86697 19.53125,85.28711 1.73611,33.42014 2.60547,70.09483 2.60547,110.02539 0,40.79861 2.60417,77.90799 7.8125,111.32813 5.64236,33.42014 14.32226,62.28429 26.04101,86.58984 12.15278,23.87153 28.21246,42.10069 48.17774,54.6875 19.96536,13.02083 44.70486,19.53125 74.21876,19.53125 4.729,0 9.3122,-0.15346 13.7578,-0.44922 v -39.50976 c -11.4499,-0.94889 -21.4648,-4.76736 -30.0352,-11.47461 -9.5486,-8.24653 -17.3611,-21.70009 -23.4375,-40.36328 -5.6424,-18.6632 -9.765,-43.6211 -12.3691,-74.8711 -2.6042,-31.25 -3.9062,-69.87781 -3.9062,-115.88476 0,-32.11805 -1.51851,-64.0191 -4.55669,-95.70313 -2.60417,-32.11805 -10.63498,-61.19856 -24.08984,-87.24023 -13.02083,-26.4757 -33.85417,-48.61112 -62.5,-66.40625 -28.21181,-17.79514 -68.14171,-28.42816 -119.79102,-31.90039 v -13.67188 c 39.93055,-0.86806 73.13368,-8.89692 99.60938,-24.08789 26.90972,-15.19097 48.39409,-33.85481 64.45312,-55.99023 16.05903,-22.13542 27.34311,-46.44033 33.85352,-72.91602 6.94445,-26.90972 10.41797,-52.30034 10.41797,-76.171872 0,-38.19444 -7.16146,-72.266927 -21.48438,-102.214844 -14.32291,-30.381945 -34.93988,-56.423611 -61.84961,-78.125 -26.47569,-22.135414 -58.59309,-39.495224 -96.35351,-52.082034 -37.76041,-13.02083 -79.6454,-21.70269 -125.65235,-26.04297 -42.30931,-2.42827 -32.30865,-2.42762 -70.96289,-2.60351 z"
             style="font-style:normal;font-variant:normal;font-weight:normal;font-stretch:normal;font-size:1333.33337402px;font-family:Sevillana;-inkscape-font-specification:Sevillana;fill:#b30000;fill-opacity:1;stroke:#ffffff;stroke-width:40;stroke-miterlimit:4;stroke-dasharray:none;stroke-opacity:1" />
        </g>
      </g>
      <g
         inkscape:export-ydpi="40.634918"
         inkscape:export-xdpi="40.634918"
         inkscape:export-filename="/home/pfm/sources/inforshop/logo/logo_full_outlined.png"
         transform="matrix(0.42294736,0,0,0.42294736,288.52632,340.88888)"
         style="display:inline;fill:#b30000;fill-opacity:1"
         inkscape:label="Layer 3"
         id="layer3-7">
        <g
           transform="translate(-54.982422,83.95915)"
           id="text823-1-1"
           style="font-style:normal;font-variant:normal;font-weight:normal;font-stretch:normal;font-size:40px;line-height:1.25;font-family:VT323;-inkscape-font-specification:VT323;letter-spacing:0px;word-spacing:0px;fill:#b30000;fill-opacity:1;stroke:none;stroke-width:11.33858299;stroke-miterlimit:4;stroke-dasharray:none;stroke-opacity:1"
           aria-label="R">
          <path
             inkscape:connector-curvature="0"
             id="path825-4-7"
             transform="translate(0,52.36214)"
             d="m 621.3457,-170.17578 c -39.93055,0.86805 -79.64409,7.16211 -119.14062,18.88086 -39.49653,11.28472 -75.08746,27.77712 -106.77149,49.47851 -31.68403,21.701401 -57.29101,48.3941 -76.82226,80.078129 -19.53125,31.6840284 -29.29688,68.35872 -29.29688,110.02539 0,39.930551 9.76563,72.049911 29.29688,96.355471 19.53125,23.87153 47.96072,35.80664 85.28711,35.80664 28.64583,0 52.73437,-9.11458 72.26562,-27.34375 C 491.62994,178.67064 500.96442,160.9664 504.18359,140 H 460.3418 c -2.50767,9.38592 -7.21016,17.54218 -14.12696,24.45898 -10.41667,10.41667 -24.52126,15.625 -42.3164,15.625 -21.26736,0 -38.62913,-8.02886 -52.08399,-24.08789 -13.02083,-16.05903 -19.53125,-39.06184 -19.53125,-69.009762 0,-32.98611 7.37783,-62.501301 22.13477,-88.5429686 15.19097,-26.4756954 35.15689,-48.6111104 59.89648,-66.4062504 25.17361,-17.795139 53.16841,-31.683368 83.98438,-41.666019 31.25,-10.41666 62.93468,-16.92708 95.05273,-19.53125 -17.79514,32.986124 -30.38325,73.785375 -37.76172,122.3964881 C 548.6454,41.413414 545.17383,104.99717 545.17383,183.99023 c 0,55.98958 1.08572,112.19749 3.25586,168.6211 2.60417,56.42361 3.90625,108.28862 3.90625,155.59765 0,43.40278 -2.82248,86.15516 -8.46485,128.25586 -5.20833,41.66667 -16.05773,78.99241 -32.55078,111.97852 -16.49305,32.55208 -40.58159,59.02842 -72.26562,79.42773 -31.25,19.96528 -73.13499,29.94727 -125.65235,29.94727 -22.13542,0 -46.65668,-3.90625 -73.5664,-11.71875 -26.4757,-8.24653 -51.64996,-21.70009 -75.52149,-40.36328 -23.4375,-18.6632 -42.96875,-43.40278 -58.59375,-74.21875 -15.190964,-30.81597 -22.787106,-68.79471 -22.787106,-113.9336 0,-38.19445 5.426646,-70.52821 16.277344,-97.0039 11.284732,-26.90973 25.824002,-48.82878 43.619142,-65.75586 17.79513,-16.92709 37.97742,-29.08052 60.54687,-36.45899 22.56945,-7.8125 46.00695,-11.71875 70.3125,-11.71875 44.27084,0 80.72917,12.80447 109.375,38.41211 19.86033,17.19252 32.93215,38.84153 39.22852,64.94141 h 43.30078 c -2.2609,-10.63213 -5.45819,-20.99696 -9.61328,-31.08789 -8.68056,-22.13542 -21.26672,-41.66667 -37.75977,-58.59375 -16.49306,-16.92709 -37.11003,-29.94792 -61.84961,-39.0625 -24.30556,-9.54861 -51.86567,-14.32227 -82.68164,-14.32227 -25.17361,0 -51.43164,4.5573 -78.77539,13.67188 -26.90972,8.68056 -51.86762,23.00347 -74.87109,42.96875 -23.003478,19.96527 -42.100044,46.00694 -57.291017,78.125 -15.190973,31.68403 -22.787109,70.31184 -22.787109,115.88476 0,41.66667 6.510417,79.64541 19.53125,113.9336 13.020834,34.2882 31.250008,63.58507 54.687496,87.89062 23.4375,24.30556 51.86697,43.40213 85.28711,57.29102 33.42014,13.88889 70.52952,20.83398 111.32813,20.83398 117.18751,0 201.82292,-38.19509 253.90625,-114.58398 52.08333,-76.38889 78.125,-184.89648 78.125,-325.52149 0,-69.44445 -1.30208,-132.81184 -3.90625,-190.10351 -2.60417,-57.29167 -3.90625,-112.63021 -3.90625,-166.01563 0,-55.989573 1.95312,-102.21353775 5.85937,-138.671871 3.90625,-36.458335 12.15343,-66.622609 24.74024,-90.494139 32.55209,2.60417 63.15104,9.11458 91.79687,19.53125 28.64583,9.982633 53.38542,23.870875 74.21875,41.666014 20.83333,17.795139 36.89106,40.365233 48.17578,67.7089841 11.71875,26.9097229 17.57813,58.5924409 17.57813,95.0507809 0,65.972221 -17.3598,118.706591 -52.08203,158.203121 -34.72222,39.49653 -82.68294,59.67883 -143.88086,60.54688 v 39.71484 h 26.69336 c 42.53473,0 75.30317,6.72678 98.30664,20.18164 23.4375,13.45486 40.58095,31.90039 51.43164,55.33789 11.28472,23.4375 17.79514,51.86697 19.53125,85.28711 1.73611,33.42014 2.60547,70.09483 2.60547,110.02539 0,40.79861 2.60417,77.90799 7.8125,111.32813 5.64236,33.42014 14.32226,62.28429 26.04101,86.58984 12.15278,23.87153 28.21246,42.10069 48.17774,54.6875 19.96536,13.02083 44.70486,19.53125 74.21876,19.53125 4.729,0 9.3122,-0.15346 13.7578,-0.44922 v -39.50976 c -11.4499,-0.94889 -21.4648,-4.76736 -30.0352,-11.47461 -9.5486,-8.24653 -17.3611,-21.70009 -23.4375,-40.36328 -5.6424,-18.6632 -9.765,-43.6211 -12.3691,-74.8711 -2.6042,-31.25 -3.9062,-69.87781 -3.9062,-115.88476 0,-32.11805 -1.51851,-64.0191 -4.55669,-95.70313 -2.60417,-32.11805 -10.63498,-61.19856 -24.08984,-87.24023 -13.02083,-26.4757 -33.85417,-48.61112 -62.5,-66.40625 -28.21181,-17.79514 -68.14171,-28.42816 -119.79102,-31.90039 v -13.67188 c 39.93055,-0.86806 73.13368,-8.89692 99.60938,-24.08789 26.90972,-15.19097 48.39409,-33.85481 64.45312,-55.99023 16.05903,-22.13542 27.34311,-46.44033 33.85352,-72.91602 6.94445,-26.90972 10.41797,-52.30034 10.41797,-76.171872 0,-38.19444 -7.16146,-72.266927 -21.48438,-102.214844 -14.32291,-30.381945 -34.93988,-56.423611 -61.84961,-78.125 -26.47569,-22.135414 -58.59309,-39.495224 -96.35351,-52.082034 -37.76041,-13.02083 -79.6454,-21.70269 -125.65235,-26.04297 -42.30931,-2.42827 -32.30865,-2.42762 -70.96289,-2.60351 z"
             style="font-style:normal;font-variant:normal;font-weight:normal;font-stretch:normal;font-size:1333.33337402px;font-family:Sevillana;-inkscape-font-specification:Sevillana;fill:#b30000;fill-opacity:1;stroke:none;stroke-width:11.33858299;stroke-miterlimit:4;stroke-dasharray:none;stroke-opacity:1" />
        </g>
      </g>
    </g>
  </g>
</svg>
