<?xml version="1.0" encoding="UTF-8" standalone="no"?>
<!-- Created with Inkscape (http://www.inkscape.org/) -->

<svg
   xmlns:dc="http://purl.org/dc/elements/1.1/"
   xmlns:cc="http://creativecommons.org/ns#"
   xmlns:rdf="http://www.w3.org/1999/02/22-rdf-syntax-ns#"
   xmlns:svg="http://www.w3.org/2000/svg"
   xmlns="http://www.w3.org/2000/svg"
   xmlns:sodipodi="http://sodipodi.sourceforge.net/DTD/sodipodi-0.dtd"
   xmlns:inkscape="http://www.inkscape.org/namespaces/inkscape"
   width="1000"
   height="1000"
   viewBox="0 0 1000 1000"
   id="svg2"
   version="1.1"
   inkscape:version="0.92.1 r15371"
   sodipodi:docname="arrow_hollow.svg">
  <defs
     id="defs4" />
  <sodipodi:namedview
     id="base"
     pagecolor="#ffffff"
     bordercolor="#666666"
     borderopacity="1.0"
     inkscape:pageopacity="0.0"
     inkscape:pageshadow="2"
     inkscape:zoom="0.7071068"
     inkscape:cx="615.4507"
     inkscape:cy="668.60042"
     inkscape:document-units="px"
     inkscape:current-layer="layer1"
     showgrid="true"
     showguides="true"
     units="px"
     inkscape:window-width="1366"
     inkscape:window-height="738"
     inkscape:window-x="0"
     inkscape:window-y="30"
     inkscape:window-maximized="0"
     inkscape:guide-bbox="true">
    <inkscape:grid
       type="xygrid"
       id="grid4136" />
    <sodipodi:guide
       position="225,500"
       orientation="0,1"
       id="guide4530"
       inkscape:locked="false" />
    <sodipodi:guide
       position="900,740"
       orientation="1,0"
       id="guide4532"
       inkscape:locked="false" />
    <sodipodi:guide
       position="1000,705"
       orientation="1,0"
       id="guide4534"
       inkscape:locked="false" />
    <sodipodi:guide
       position="1000,500"
       orientation="-0.70710678,0.70710678"
       id="guide4536"
       inkscape:locked="false" />
    <sodipodi:guide
       position="900,500"
       orientation="0.70710678,0.70710678"
       id="guide4538"
       inkscape:locked="false" />
    <sodipodi:guide
       position="500,940"
       orientation="1,0"
       id="guide4574"
       inkscape:locked="false" />
  </sodipodi:namedview>
  <metadata
     id="metadata7">
    <rdf:RDF>
      <cc:Work
         rdf:about="">
        <dc:format>image/svg+xml</dc:format>
        <dc:type
           rdf:resource="http://purl.org/dc/dcmitype/StillImage" />
        <dc:title></dc:title>
      </cc:Work>
    </rdf:RDF>
  </metadata>
  <g
     inkscape:label="Layer 1"
     inkscape:groupmode="layer"
     id="layer1"
     transform="translate(0,-52.36214)">
    <path
       style="fill:#000000;stroke:none;stroke-width:1px;stroke-linecap:butt;stroke-linejoin:miter;stroke-opacity:1;fill-opacity:1"
       d="M 500 0 L 531.10156 31.101562 A 470 470 0 0 1 969.58398 490.41602 L 950 510 L 929.46094 489.46094 A 430 430 0 0 0 528.57031 71.429688 L 500 100 A 400 400 0 0 1 900 500 L 928.57031 528.57031 L 950 550 L 968.89844 531.10156 L 1000 500 A 500 500 0 0 0 500 0 z "
       transform="translate(0,52.36214)"
       id="path4542" />
  </g>
</svg>
