<?xml version="1.0" encoding="UTF-8" standalone="no"?>
<!-- Created with Inkscape (http://www.inkscape.org/) -->

<svg
   xmlns:dc="http://purl.org/dc/elements/1.1/"
   xmlns:cc="http://creativecommons.org/ns#"
   xmlns:rdf="http://www.w3.org/1999/02/22-rdf-syntax-ns#"
   xmlns:svg="http://www.w3.org/2000/svg"
   xmlns="http://www.w3.org/2000/svg"
   xmlns:sodipodi="http://sodipodi.sourceforge.net/DTD/sodipodi-0.dtd"
   xmlns:inkscape="http://www.inkscape.org/namespaces/inkscape"
   width="1000"
   height="1000"
   viewBox="0 0 1000 1000"
   id="svg2"
   version="1.1"
   inkscape:version="0.92.2 (5c3e80d, 2017-08-06)"
   sodipodi:docname="processor.svg">
  <defs
     id="defs4" />
  <sodipodi:namedview
     id="base"
     pagecolor="#ffffff"
     bordercolor="#666666"
     borderopacity="1.0"
     inkscape:pageopacity="0.0"
     inkscape:pageshadow="2"
     inkscape:zoom="1.4142136"
     inkscape:cx="402.4298"
     inkscape:cy="458.77269"
     inkscape:document-units="px"
     inkscape:current-layer="layer1"
     showgrid="true"
     showguides="true"
     units="px"
     inkscape:window-width="3840"
     inkscape:window-height="2066"
     inkscape:window-x="-11"
     inkscape:window-y="2149"
     inkscape:window-maximized="1"
     inkscape:guide-bbox="true">
    <inkscape:grid
       type="xygrid"
       id="grid4136" />
    <sodipodi:guide
       position="930,220"
       orientation="0,1"
       id="guide821"
       inkscape:locked="false" />
    <sodipodi:guide
       position="850,780"
       orientation="0,1"
       id="guide823"
       inkscape:locked="false" />
    <sodipodi:guide
       position="220,990"
       orientation="1,0"
       id="guide825"
       inkscape:locked="false" />
    <sodipodi:guide
       position="780,980"
       orientation="1,0"
       id="guide827"
       inkscape:locked="false" />
    <sodipodi:guide
       position="290,940"
       orientation="1,0"
       id="guide831"
       inkscape:locked="false" />
    <sodipodi:guide
       position="350,890"
       orientation="1,0"
       id="guide833"
       inkscape:locked="false" />
    <sodipodi:guide
       position="410,880"
       orientation="1,0"
       id="guide835"
       inkscape:locked="false" />
    <sodipodi:guide
       position="470,870"
       orientation="1,0"
       id="guide837"
       inkscape:locked="false" />
    <sodipodi:guide
       position="530,870"
       orientation="1,0"
       id="guide841"
       inkscape:locked="false" />
    <sodipodi:guide
       position="590,870"
       orientation="1,0"
       id="guide843"
       inkscape:locked="false" />
    <sodipodi:guide
       position="650,860"
       orientation="1,0"
       id="guide845"
       inkscape:locked="false" />
    <sodipodi:guide
       position="710,860"
       orientation="1,0"
       id="guide847"
       inkscape:locked="false" />
    <sodipodi:guide
       position="770,930"
       orientation="1,0"
       id="guide849"
       inkscape:locked="false" />
    <sodipodi:guide
       position="870,770"
       orientation="0,1"
       id="guide853"
       inkscape:locked="false" />
    <sodipodi:guide
       position="870,710"
       orientation="0,1"
       id="guide855"
       inkscape:locked="false" />
    <sodipodi:guide
       position="140,650"
       orientation="0,1"
       id="guide857"
       inkscape:locked="false" />
    <sodipodi:guide
       position="870,590"
       orientation="0,1"
       id="guide859"
       inkscape:locked="false" />
    <sodipodi:guide
       position="230,910"
       orientation="1,0"
       id="guide861"
       inkscape:locked="false" />
    <sodipodi:guide
       position="910,530"
       orientation="0,1"
       id="guide863"
       inkscape:locked="false" />
    <sodipodi:guide
       position="920,470"
       orientation="0,1"
       id="guide865"
       inkscape:locked="false" />
    <sodipodi:guide
       position="930,410"
       orientation="0,1"
       id="guide867"
       inkscape:locked="false" />
    <sodipodi:guide
       position="940,350"
       orientation="0,1"
       id="guide869"
       inkscape:locked="false" />
    <sodipodi:guide
       position="930,290"
       orientation="0,1"
       id="guide871"
       inkscape:locked="false" />
    <sodipodi:guide
       position="890,230"
       orientation="0,1"
       id="guide873"
       inkscape:locked="false" />
  </sodipodi:namedview>
  <metadata
     id="metadata7">
    <rdf:RDF>
      <cc:Work
         rdf:about="">
        <dc:format>image/svg+xml</dc:format>
        <dc:type
           rdf:resource="http://purl.org/dc/dcmitype/StillImage" />
        <dc:title></dc:title>
      </cc:Work>
    </rdf:RDF>
  </metadata>
  <g
     inkscape:label="Layer 1"
     inkscape:groupmode="layer"
     id="layer1"
     transform="translate(0,-52.36214)">
    <rect
       style="fill:#040000;fill-opacity:1;stroke:#000000;stroke-width:37.79527559;stroke-linecap:square;stroke-linejoin:round;stroke-miterlimit:4;stroke-dasharray:none;stroke-dashoffset:0;stroke-opacity:0.99365079"
       id="rect829"
       width="600"
       height="600"
       x="200"
       y="252.36214" />
    <g
       id="g1029"
       style="fill:#040000;fill-opacity:1">
      <rect
         y="52.362141"
         x="230"
         height="199.99998"
         width="60"
         id="rect829-3"
         style="fill:#040000;fill-opacity:1;stroke:#000000;stroke-width:37.79527559;stroke-linecap:square;stroke-linejoin:round;stroke-miterlimit:4;stroke-dasharray:none;stroke-dashoffset:0;stroke-opacity:0.99365079" />
      <rect
         y="52.362152"
         x="350"
         height="199.99998"
         width="60"
         id="rect829-3-3"
         style="fill:#040000;fill-opacity:1;stroke:#000000;stroke-width:37.79527664;stroke-linecap:square;stroke-linejoin:round;stroke-miterlimit:4;stroke-dasharray:none;stroke-dashoffset:0;stroke-opacity:0.99365079" />
      <rect
         y="52.362133"
         x="470"
         height="199.99998"
         width="60"
         id="rect829-3-2"
         style="fill:#040000;fill-opacity:1;stroke:#000000;stroke-width:37.79527664;stroke-linecap:square;stroke-linejoin:round;stroke-miterlimit:4;stroke-dasharray:none;stroke-dashoffset:0;stroke-opacity:0.99365079" />
      <rect
         y="52.362141"
         x="590"
         height="199.99998"
         width="60"
         id="rect829-3-3-6"
         style="fill:#040000;fill-opacity:1;stroke:#000000;stroke-width:37.79527664;stroke-linecap:square;stroke-linejoin:round;stroke-miterlimit:4;stroke-dasharray:none;stroke-dashoffset:0;stroke-opacity:0.99365079" />
      <rect
         y="52.362141"
         x="710"
         height="199.99998"
         width="60"
         id="rect829-3-3-6-3"
         style="fill:#040000;fill-opacity:1;stroke:#000000;stroke-width:37.79527664;stroke-linecap:square;stroke-linejoin:round;stroke-miterlimit:4;stroke-dasharray:none;stroke-dashoffset:0;stroke-opacity:0.99365079" />
      <rect
         y="852.36212"
         x="230"
         height="199.99998"
         width="60"
         id="rect829-3-7"
         style="fill:#040000;fill-opacity:1;stroke:#000000;stroke-width:37.79527664;stroke-linecap:square;stroke-linejoin:round;stroke-miterlimit:4;stroke-dasharray:none;stroke-dashoffset:0;stroke-opacity:0.99365079" />
      <rect
         y="852.36212"
         x="350"
         height="199.99998"
         width="60"
         id="rect829-3-3-2"
         style="fill:#040000;fill-opacity:1;stroke:#000000;stroke-width:37.79527664;stroke-linecap:square;stroke-linejoin:round;stroke-miterlimit:4;stroke-dasharray:none;stroke-dashoffset:0;stroke-opacity:0.99365079" />
      <rect
         y="852.36212"
         x="470"
         height="199.99998"
         width="60"
         id="rect829-3-2-4"
         style="fill:#040000;fill-opacity:1;stroke:#000000;stroke-width:37.79527664;stroke-linecap:square;stroke-linejoin:round;stroke-miterlimit:4;stroke-dasharray:none;stroke-dashoffset:0;stroke-opacity:0.99365079" />
      <rect
         y="852.36212"
         x="590"
         height="199.99998"
         width="60"
         id="rect829-3-3-6-33"
         style="fill:#040000;fill-opacity:1;stroke:#000000;stroke-width:37.79527664;stroke-linecap:square;stroke-linejoin:round;stroke-miterlimit:4;stroke-dasharray:none;stroke-dashoffset:0;stroke-opacity:0.99365079" />
      <rect
         y="852.36212"
         x="710"
         height="199.99998"
         width="60"
         id="rect829-3-3-6-3-5"
         style="fill:#040000;fill-opacity:1;stroke:#000000;stroke-width:37.79527664;stroke-linecap:square;stroke-linejoin:round;stroke-miterlimit:4;stroke-dasharray:none;stroke-dashoffset:0;stroke-opacity:0.99365079" />
    </g>
    <g
       id="g1017"
       transform="rotate(90,495.00001,437.36215)"
       style="fill:#040000;fill-opacity:1">
      <rect
         y="-67.637833"
         x="340"
         height="199.99998"
         width="60"
         id="rect829-3-4"
         style="fill:#040000;fill-opacity:1;stroke:#000000;stroke-width:37.79527664;stroke-linecap:square;stroke-linejoin:round;stroke-miterlimit:4;stroke-dasharray:none;stroke-dashoffset:0;stroke-opacity:0.99365079" />
      <rect
         y="-67.637833"
         x="460"
         height="199.99998"
         width="60"
         id="rect829-3-3-4"
         style="fill:#040000;fill-opacity:1;stroke:#000000;stroke-width:37.79527664;stroke-linecap:square;stroke-linejoin:round;stroke-miterlimit:4;stroke-dasharray:none;stroke-dashoffset:0;stroke-opacity:0.99365079" />
      <rect
         y="-67.637833"
         x="580"
         height="199.99998"
         width="60"
         id="rect829-3-2-8"
         style="fill:#040000;fill-opacity:1;stroke:#000000;stroke-width:37.79527664;stroke-linecap:square;stroke-linejoin:round;stroke-miterlimit:4;stroke-dasharray:none;stroke-dashoffset:0;stroke-opacity:0.99365079" />
      <rect
         y="-67.637833"
         x="700"
         height="199.99998"
         width="60"
         id="rect829-3-3-6-6"
         style="fill:#040000;fill-opacity:1;stroke:#000000;stroke-width:37.79527664;stroke-linecap:square;stroke-linejoin:round;stroke-miterlimit:4;stroke-dasharray:none;stroke-dashoffset:0;stroke-opacity:0.99365079" />
      <rect
         y="-67.637833"
         x="820"
         height="199.99998"
         width="60"
         id="rect829-3-3-6-3-8"
         style="fill:#040000;fill-opacity:1;stroke:#000000;stroke-width:37.79527664;stroke-linecap:square;stroke-linejoin:round;stroke-miterlimit:4;stroke-dasharray:none;stroke-dashoffset:0;stroke-opacity:0.99365079" />
      <rect
         y="732.36212"
         x="340"
         height="199.99998"
         width="60"
         id="rect829-3-7-6"
         style="fill:#040000;fill-opacity:1;stroke:#000000;stroke-width:37.79527664;stroke-linecap:square;stroke-linejoin:round;stroke-miterlimit:4;stroke-dasharray:none;stroke-dashoffset:0;stroke-opacity:0.99365079" />
      <rect
         y="732.36212"
         x="460"
         height="199.99998"
         width="60"
         id="rect829-3-3-2-5"
         style="fill:#040000;fill-opacity:1;stroke:#000000;stroke-width:37.79527664;stroke-linecap:square;stroke-linejoin:round;stroke-miterlimit:4;stroke-dasharray:none;stroke-dashoffset:0;stroke-opacity:0.99365079" />
      <rect
         y="732.36212"
         x="580"
         height="199.99998"
         width="60"
         id="rect829-3-2-4-9"
         style="fill:#040000;fill-opacity:1;stroke:#000000;stroke-width:37.79527664;stroke-linecap:square;stroke-linejoin:round;stroke-miterlimit:4;stroke-dasharray:none;stroke-dashoffset:0;stroke-opacity:0.99365079" />
      <rect
         y="732.36212"
         x="700"
         height="199.99998"
         width="60"
         id="rect829-3-3-6-33-0"
         style="fill:#040000;fill-opacity:1;stroke:#000000;stroke-width:37.79527664;stroke-linecap:square;stroke-linejoin:round;stroke-miterlimit:4;stroke-dasharray:none;stroke-dashoffset:0;stroke-opacity:0.99365079" />
      <rect
         y="732.36212"
         x="820"
         height="199.99998"
         width="60"
         id="rect829-3-3-6-3-5-3"
         style="fill:#040000;fill-opacity:1;stroke:#000000;stroke-width:37.79527664;stroke-linecap:square;stroke-linejoin:round;stroke-miterlimit:4;stroke-dasharray:none;stroke-dashoffset:0;stroke-opacity:0.99365079" />
    </g>
  </g>
</svg>
