/
- client/
    - reset.css              
- imports/
    - api/                      // everything api related
    - ui/                       // GUI
        - mainMenu/
            - style/
            - templates/
                - mainMenu.html
            - mainMenu.js       // imports templates style and initialize vars
            - mainMenu.events.js
            - mainMenu.helpers.js
            - mainMenu.routes.js
        - articles/
        - categories/
        - cart/
        - order/
        - body.html             // master page
        - body.js

    - startup/                  // contains startup configuration
- public/                       // contains static assets
- server/
