<?xml version="1.0" encoding="UTF-8" standalone="no"?>
<!-- Created with Inkscape (http://www.inkscape.org/) -->

<svg
   xmlns:dc="http://purl.org/dc/elements/1.1/"
   xmlns:cc="http://creativecommons.org/ns#"
   xmlns:rdf="http://www.w3.org/1999/02/22-rdf-syntax-ns#"
   xmlns:svg="http://www.w3.org/2000/svg"
   xmlns="http://www.w3.org/2000/svg"
   xmlns:sodipodi="http://sodipodi.sourceforge.net/DTD/sodipodi-0.dtd"
   xmlns:inkscape="http://www.inkscape.org/namespaces/inkscape"
   width="1000"
   height="1000"
   viewBox="0 0 1000 1000"
   id="svg2"
   version="1.1"
   inkscape:version="0.92.2 (5c3e80d, 2017-08-06)"
   sodipodi:docname="arrow_all_shapes.svg">
  <defs
     id="defs4" />
  <sodipodi:namedview
     id="base"
     pagecolor="#ffffff"
     bordercolor="#666666"
     borderopacity="1.0"
     inkscape:pageopacity="0.0"
     inkscape:pageshadow="2"
     inkscape:zoom="1.4142136"
     inkscape:cx="506.78848"
     inkscape:cy="507.48087"
     inkscape:document-units="px"
     inkscape:current-layer="layer1"
     showgrid="true"
     showguides="true"
     units="px"
     inkscape:window-width="3840"
     inkscape:window-height="2066"
     inkscape:window-x="-11"
     inkscape:window-y="2149"
     inkscape:window-maximized="1"
     inkscape:guide-bbox="true">
    <inkscape:grid
       type="xygrid"
       id="grid4136" />
    <sodipodi:guide
       position="225,500"
       orientation="0,1"
       id="guide4530"
       inkscape:locked="false" />
    <sodipodi:guide
       position="900,740"
       orientation="1,0"
       id="guide4532"
       inkscape:locked="false" />
    <sodipodi:guide
       position="1000,705"
       orientation="1,0"
       id="guide4534"
       inkscape:locked="false" />
    <sodipodi:guide
       position="1000,500"
       orientation="-0.70710678,0.70710678"
       id="guide4536"
       inkscape:locked="false" />
    <sodipodi:guide
       position="900,500"
       orientation="0.70710678,0.70710678"
       id="guide4538"
       inkscape:locked="false" />
    <sodipodi:guide
       position="500,940"
       orientation="1,0"
       id="guide4574"
       inkscape:locked="false" />
  </sodipodi:namedview>
  <metadata
     id="metadata7">
    <rdf:RDF>
      <cc:Work
         rdf:about="">
        <dc:format>image/svg+xml</dc:format>
        <dc:type
           rdf:resource="http://purl.org/dc/dcmitype/StillImage" />
        <dc:title></dc:title>
      </cc:Work>
    </rdf:RDF>
  </metadata>
  <g
     inkscape:label="Layer 1"
     inkscape:groupmode="layer"
     id="layer1"
     transform="translate(0,-52.36214)">
    <rect
       style="fill:#0000ff;fill-opacity:0.48677248;stroke:none;stroke-width:17.01034546;stroke-linecap:square;stroke-linejoin:miter;stroke-miterlimit:10;stroke-dasharray:none;stroke-dashoffset:0;stroke-opacity:1"
       id="rect4510"
       width="500"
       height="500"
       x="0"
       y="552.36212" />
    <path
       style="fill:#0000ff;fill-opacity:0.48677248;stroke:none;stroke-width:25.33473015;stroke-linecap:square;stroke-linejoin:miter;stroke-miterlimit:10;stroke-dasharray:none;stroke-dashoffset:0;stroke-opacity:1"
       d="M 500 0 A 500 500 0 0 0 0 500 A 500 500 0 0 0 500 1000 A 500 500 0 0 0 1000 500 A 500 500 0 0 0 500 0 z M 500 100 A 400 400 0 0 1 900 500 A 400 400 0 0 1 500 900 A 400 400 0 0 1 100 500 A 400 400 0 0 1 500 100 z "
       transform="translate(0,52.36214)"
       id="path4512" />
    <path
       style="fill:#0000ff;stroke:none;stroke-width:1px;stroke-linecap:butt;stroke-linejoin:miter;stroke-opacity:1;fill-opacity:0.48677248"
       d="m 900,552.36214 50,50 50,-50 z"
       id="path4542"
       inkscape:connector-curvature="0" />
    <path
       style="fill:#0000ff;fill-opacity:0.48677248;stroke:none;stroke-width:1px;stroke-linecap:butt;stroke-linejoin:miter;stroke-opacity:1"
       d="m 500,152.36214 50,-50 -50,-50 z"
       id="path4542-4"
       inkscape:connector-curvature="0" />
    <rect
       style="fill:#0000ff;fill-opacity:0.48677248;stroke:none;stroke-width:17.01034546;stroke-linecap:square;stroke-linejoin:miter;stroke-miterlimit:10;stroke-dasharray:none;stroke-dashoffset:0;stroke-opacity:1"
       id="rect4510-1"
       width="500"
       height="500"
       x="500"
       y="552.36212" />
    <rect
       style="fill:#0000ff;fill-opacity:0.48677248;stroke:none;stroke-width:17.01034546;stroke-linecap:square;stroke-linejoin:miter;stroke-miterlimit:10;stroke-dasharray:none;stroke-dashoffset:0;stroke-opacity:1"
       id="rect4510-13"
       width="500"
       height="500"
       x="0"
       y="52.362141" />
  </g>
</svg>
