<?xml version="1.0" encoding="UTF-8" standalone="no"?>
<!-- Created with Inkscape (http://www.inkscape.org/) -->

<svg
   xmlns:dc="http://purl.org/dc/elements/1.1/"
   xmlns:cc="http://creativecommons.org/ns#"
   xmlns:rdf="http://www.w3.org/1999/02/22-rdf-syntax-ns#"
   xmlns:svg="http://www.w3.org/2000/svg"
   xmlns="http://www.w3.org/2000/svg"
   xmlns:sodipodi="http://sodipodi.sourceforge.net/DTD/sodipodi-0.dtd"
   xmlns:inkscape="http://www.inkscape.org/namespaces/inkscape"
   width="5000"
   height="1000"
   viewBox="0 0 5000 1000"
   id="svg2"
   version="1.1"
   inkscape:version="0.92.2 (5c3e80d, 2017-08-06)"
   sodipodi:docname="CORDIAS-2.svg"
   inkscape:export-filename="C:\Users\pfm\Source\Repos\cordias\logo\CORDIAS-logo-500x131.png"
   inkscape:export-xdpi="12.576847"
   inkscape:export-ydpi="12.576847">
  <defs
     id="defs4" />
  <sodipodi:namedview
     id="base"
     pagecolor="#ffffff"
     bordercolor="#666666"
     borderopacity="1.0"
     inkscape:pageopacity="0.0"
     inkscape:pageshadow="2"
     inkscape:zoom="0.7071068"
     inkscape:cx="1757.0509"
     inkscape:cy="523.89801"
     inkscape:document-units="px"
     inkscape:current-layer="layer1"
     showgrid="true"
     showguides="true"
     units="px"
     inkscape:window-width="3840"
     inkscape:window-height="2081"
     inkscape:window-x="3831"
     inkscape:window-y="-9"
     inkscape:window-maximized="1"
     inkscape:guide-bbox="true">
    <inkscape:grid
       type="xygrid"
       id="grid4136" />
    <sodipodi:guide
       position="320,500"
       orientation="0,1"
       id="guide5199"
       inkscape:locked="false" />
    <sodipodi:guide
       position="100,500"
       orientation="-0.70710678,0.70710678"
       id="guide5201"
       inkscape:locked="false" />
    <sodipodi:guide
       position="100,500"
       orientation="0.70710678,0.70710678"
       id="guide5203"
       inkscape:locked="false" />
    <sodipodi:guide
       position="500,840"
       orientation="1,0"
       id="guide5205"
       inkscape:locked="false" />
    <sodipodi:guide
       position="700,1130"
       orientation="1,0"
       id="guide5212"
       inkscape:locked="false" />
    <sodipodi:guide
       position="300,820"
       orientation="1,0"
       id="guide5915"
       inkscape:locked="false" />
    <sodipodi:guide
       position="200,1240"
       orientation="1,0"
       id="guide5917"
       inkscape:locked="false" />
    <sodipodi:guide
       position="800,1120"
       orientation="1,0"
       id="guide5919"
       inkscape:locked="false" />
    <sodipodi:guide
       position="280,800"
       orientation="0,1"
       id="guide5921"
       inkscape:locked="false" />
    <sodipodi:guide
       position="340,200"
       orientation="0,1"
       id="guide5923"
       inkscape:locked="false" />
    <sodipodi:guide
       position="1280,350"
       orientation="0,1"
       id="guide5925"
       inkscape:locked="false" />
    <sodipodi:guide
       position="-60,650"
       orientation="0,1"
       id="guide5927"
       inkscape:locked="false" />
  </sodipodi:namedview>
  <metadata
     id="metadata7">
    <rdf:RDF>
      <cc:Work
         rdf:about="">
        <dc:format>image/svg+xml</dc:format>
        <dc:type
           rdf:resource="http://purl.org/dc/dcmitype/StillImage" />
        <dc:title />
      </cc:Work>
    </rdf:RDF>
  </metadata>
  <g
     inkscape:groupmode="layer"
     id="layer2"
     inkscape:label="lines" />
  <g
     inkscape:groupmode="layer"
     id="layer3"
     inkscape:label="exclusion" />
  <g
     inkscape:label="dots"
     inkscape:groupmode="layer"
     id="layer1"
     transform="translate(0,-52.36214)">
    <g
       id="g5960"
       transform="translate(1224.3333,-24.16666)">
      <path
         inkscape:connector-curvature="0"
         id="path5913"
         d="m 2368.0664,128.48454 c -61.9667,-0.15808 -114.0983,16.1774 -154.6426,44.43555 -60.8759,42.42865 -93.5595,109.20381 -100.7265,176.57422 -7.1671,67.37041 10.1912,136.90397 53.1484,188.82617 42.9572,51.9222 113.5532,83.43184 198.7793,72.06836 64.7739,-8.63652 106.6779,12.35384 135.5957,47.30664 28.9178,34.9528 42.8095,86.66924 37.4766,136.79883 -5.333,50.12958 -28.8994,97.10443 -71.1485,126.55078 -27.0833,18.87622 -62.7139,31.56869 -109.2382,32.15234 a 100,100 0 0 1 2.6894,22.49805 100,100 0 0 1 -11.8711,47.17382 c 63.6378,0.8493 117.0768,-15.5625 158.4473,-44.39648 60.8759,-42.42865 93.5595,-109.2038 100.7265,-176.57422 7.1671,-67.3704 -10.1912,-136.90397 -53.1484,-188.82617 -42.9572,-51.92219 -113.5532,-83.43184 -198.7793,-72.06836 -64.7739,8.63652 -106.6779,-12.35384 -135.5957,-47.30664 -28.9178,-34.9528 -42.8095,-86.66923 -37.4766,-136.79883 5.333,-50.12959 28.8994,-97.10443 71.1485,-126.55078 27.0833,-18.87621 62.7139,-31.57006 109.2383,-32.15429 A 100,100 0 0 1 2360,175.69548 a 100,100 0 0 1 11.8672,-47.16797 c -1.2686,-0.0169 -2.5403,-0.0397 -3.8008,-0.043 z"
         style="color:#000000;font-style:normal;font-variant:normal;font-weight:normal;font-stretch:normal;font-size:medium;line-height:normal;font-family:sans-serif;font-variant-ligatures:normal;font-variant-position:normal;font-variant-caps:normal;font-variant-numeric:normal;font-variant-alternates:normal;font-feature-settings:normal;text-indent:0;text-align:start;text-decoration:none;text-decoration-line:none;text-decoration-style:solid;text-decoration-color:#000000;letter-spacing:normal;word-spacing:normal;text-transform:none;writing-mode:lr-tb;direction:ltr;text-orientation:mixed;dominant-baseline:auto;baseline-shift:baseline;text-anchor:start;white-space:normal;shape-padding:0;clip-rule:nonzero;display:inline;overflow:visible;visibility:visible;opacity:1;isolation:auto;mix-blend-mode:normal;color-interpolation:sRGB;color-interpolation-filters:linearRGB;solid-color:#000000;solid-opacity:1;vector-effect:none;fill:#000000;fill-opacity:1;fill-rule:nonzero;stroke:none;stroke-width:70;stroke-linecap:butt;stroke-linejoin:miter;stroke-miterlimit:4;stroke-dasharray:none;stroke-dashoffset:0;stroke-opacity:1;color-rendering:auto;image-rendering:auto;shape-rendering:auto;text-rendering:auto;enable-background:accumulate" />
      <path
         inkscape:connector-curvature="0"
         id="path5183"
         d="m 2260,892.36214 c -45.8263,0 -83.3333,37.50701 -83.3333,83.33333 0,45.82633 37.507,83.33333 83.3333,83.33333 45.8263,0 83.3333,-37.507 83.3333,-83.33333 0,-45.82632 -37.507,-83.33333 -83.3333,-83.33333 z m 0,33.33333 c 27.8117,0 50,22.18835 50,50 0,27.81163 -22.1883,49.99993 -50,49.99993 -27.8116,0 -50,-22.1883 -50,-49.99993 0,-27.81165 22.1884,-50 50,-50 z"
         style="color:#000000;font-style:normal;font-variant:normal;font-weight:normal;font-stretch:normal;font-size:medium;line-height:normal;font-family:sans-serif;font-variant-ligatures:normal;font-variant-position:normal;font-variant-caps:normal;font-variant-numeric:normal;font-variant-alternates:normal;font-feature-settings:normal;text-indent:0;text-align:start;text-decoration:none;text-decoration-line:none;text-decoration-style:solid;text-decoration-color:#000000;letter-spacing:normal;word-spacing:normal;text-transform:none;writing-mode:lr-tb;direction:ltr;text-orientation:mixed;dominant-baseline:auto;baseline-shift:baseline;text-anchor:start;white-space:normal;shape-padding:0;clip-rule:nonzero;display:inline;overflow:visible;visibility:visible;opacity:1;isolation:auto;mix-blend-mode:normal;color-interpolation:sRGB;color-interpolation-filters:linearRGB;solid-color:#000000;solid-opacity:1;vector-effect:none;fill:#000000;fill-opacity:1;fill-rule:nonzero;stroke:none;stroke-width:33.33333206;stroke-linecap:butt;stroke-linejoin:miter;stroke-miterlimit:4;stroke-dasharray:none;stroke-dashoffset:0;stroke-opacity:1;paint-order:stroke fill markers;color-rendering:auto;image-rendering:auto;shape-rendering:auto;text-rendering:auto;enable-background:accumulate" />
      <path
         inkscape:connector-curvature="0"
         id="path5183-4"
         d="m 2460,92.36214 c -45.8263,0 -83.3333,37.50701 -83.3333,83.33333 0,45.82632 37.507,83.33333 83.3333,83.33333 45.8263,0 83.3333,-37.50701 83.3333,-83.33333 0,-45.82632 -37.507,-83.33333 -83.3333,-83.33333 z m 0,33.33333 c 27.8117,0 50,22.18835 50,50 0,27.81165 -22.1883,50 -50,50 -27.8116,0 -50,-22.18835 -50,-50 0,-27.81165 22.1884,-50 50,-50 z"
         style="color:#000000;font-style:normal;font-variant:normal;font-weight:normal;font-stretch:normal;font-size:medium;line-height:normal;font-family:sans-serif;font-variant-ligatures:normal;font-variant-position:normal;font-variant-caps:normal;font-variant-numeric:normal;font-variant-alternates:normal;font-feature-settings:normal;text-indent:0;text-align:start;text-decoration:none;text-decoration-line:none;text-decoration-style:solid;text-decoration-color:#000000;letter-spacing:normal;word-spacing:normal;text-transform:none;writing-mode:lr-tb;direction:ltr;text-orientation:mixed;dominant-baseline:auto;baseline-shift:baseline;text-anchor:start;white-space:normal;shape-padding:0;clip-rule:nonzero;display:inline;overflow:visible;visibility:visible;opacity:1;isolation:auto;mix-blend-mode:normal;color-interpolation:sRGB;color-interpolation-filters:linearRGB;solid-color:#000000;solid-opacity:1;vector-effect:none;fill:#000000;fill-opacity:1;fill-rule:nonzero;stroke:none;stroke-width:33.33333206;stroke-linecap:butt;stroke-linejoin:miter;stroke-miterlimit:4;stroke-dasharray:none;stroke-dashoffset:0;stroke-opacity:1;paint-order:stroke fill markers;color-rendering:auto;image-rendering:auto;shape-rendering:auto;text-rendering:auto;enable-background:accumulate" />
    </g>
    <g
       id="layer2-4"
       inkscape:label="lines"
       transform="translate(480,52.36214)" />
    <g
       id="layer3-4"
       inkscape:label="exclusion"
       transform="translate(480,52.36214)" />
    <path
       style="color:#000000;font-style:normal;font-variant:normal;font-weight:normal;font-stretch:normal;font-size:medium;line-height:normal;font-family:sans-serif;font-variant-ligatures:normal;font-variant-position:normal;font-variant-caps:normal;font-variant-numeric:normal;font-variant-alternates:normal;font-feature-settings:normal;text-indent:0;text-align:start;text-decoration:none;text-decoration-line:none;text-decoration-style:solid;text-decoration-color:#000000;letter-spacing:normal;word-spacing:normal;text-transform:none;writing-mode:lr-tb;direction:ltr;text-orientation:mixed;dominant-baseline:auto;baseline-shift:baseline;text-anchor:start;white-space:normal;shape-padding:0;clip-rule:nonzero;display:inline;overflow:visible;visibility:visible;opacity:1;isolation:auto;mix-blend-mode:normal;color-interpolation:sRGB;color-interpolation-filters:linearRGB;solid-color:#000000;solid-opacity:1;vector-effect:none;fill:#000000;fill-opacity:1;fill-rule:nonzero;stroke:none;stroke-width:200.00001526;stroke-linecap:butt;stroke-linejoin:miter;stroke-miterlimit:4;stroke-dasharray:none;stroke-dashoffset:0;stroke-opacity:1;paint-order:stroke fill markers;color-rendering:auto;image-rendering:auto;shape-rendering:auto;text-rendering:auto;enable-background:accumulate"
       d="M 980 0 C 705.04209 0 480 225.04205 480 500 C 480 774.95795 705.04209 1000 980 1000 C 1254.9579 1000 1480 774.95795 1480 500 C 1480 464.23705 1476.184 429.32152 1468.9551 395.63281 A 100 100 0 0 1 1406 418 A 100 100 0 0 1 1401.6953 417.78516 A 430 430 0 0 1 1410 500 A 430 430 0 0 1 980 930 A 430 430 0 0 1 550 500 A 430 430 0 0 1 980 70 A 430 430 0 0 1 1298.9805 213.11719 L 1341.6973 213.21289 L 1341.8262 155.8457 C 1250.5827 59.984975 1121.9478 -6.2918521e-014 980 0 z "
       transform="translate(0,52.36214)"
       id="path5183-4-3"
       inkscape:export-xdpi="96"
       inkscape:export-ydpi="96" />
    <g
       id="g6007"
       transform="translate(1533.3333,51.52878)">
      <g
         inkscape:label="lines"
         id="layer2-1">
        <path
           id="path5181"
           d="M 196.32812,73.167969 A 100,100 0 0 1 200,100 a 100,100 0 0 1 -9.96875,43.23633 c 48.57962,9.56014 86.32349,26.67467 113.75781,47.25976 42.51564,31.90123 61.00607,71.18499 61.0293,109.52539 0.0232,38.34041 -18.40531,77.5938 -60.89648,109.48633 -27.42896,20.5873 -65.1983,37.70689 -113.84571,47.26563 A 100,100 0 0 1 200,500 a 100,100 0 0 1 -3.78125,26.86719 c 60.92109,-10.91766 111.0523,-32.35026 149.72266,-61.375 C 403.3745,422.38472 434.85572,361.63811 434.81836,299.97852 434.781,238.31892 403.2397,177.60268 345.80078,134.50391 307.16801,105.51615 257.11678,84.097281 196.32812,73.167969 Z"
           style="color:#000000;font-style:normal;font-variant:normal;font-weight:normal;font-stretch:normal;font-size:medium;line-height:normal;font-family:sans-serif;font-variant-ligatures:normal;font-variant-position:normal;font-variant-caps:normal;font-variant-numeric:normal;font-variant-alternates:normal;font-feature-settings:normal;text-indent:0;text-align:start;text-decoration:none;text-decoration-line:none;text-decoration-style:solid;text-decoration-color:#000000;letter-spacing:normal;word-spacing:normal;text-transform:none;writing-mode:lr-tb;direction:ltr;text-orientation:mixed;dominant-baseline:auto;baseline-shift:baseline;text-anchor:start;white-space:normal;shape-padding:0;clip-rule:nonzero;display:inline;overflow:visible;visibility:visible;opacity:1;isolation:auto;mix-blend-mode:normal;color-interpolation:sRGB;color-interpolation-filters:linearRGB;solid-color:#000000;solid-opacity:1;vector-effect:none;fill:#000000;fill-opacity:1;fill-rule:nonzero;stroke:none;stroke-width:70;stroke-linecap:butt;stroke-linejoin:miter;stroke-miterlimit:4;stroke-dasharray:none;stroke-dashoffset:0;stroke-opacity:1;color-rendering:auto;image-rendering:auto;shape-rendering:auto;text-rendering:auto;enable-background:accumulate"
           inkscape:connector-curvature="0" />
        <path
           id="path5181-6"
           d="M 196.81055,475.2793 A 100,100 0 0 1 200,500 100,100 0 0 1 189.27734,544.79492 c 30.40974,8.63691 46.42323,22.14567 56.38868,37.10742 17.02377,25.55889 19.12204,68.11208 19.15234,118.11914 0.0303,50.00707 -1.99905,107.48157 31.00586,156.91407 21.42287,32.08571 56.47396,55.40301 107.37305,67.82031 A 100,100 0 0 1 400,900 100,100 0 0 1 410.70703,855.23633 c -30.56295,-8.64306 -46.66006,-22.18271 -56.66797,-37.17188 -17.07082,-25.5675 -19.19041,-68.093 -19.2207,-118.08593 -0.0303,-49.99294 2.03821,-107.43975 -30.89258,-156.88086 -21.35901,-32.06767 -56.33233,-55.38619 -107.11523,-67.81836 z"
           style="color:#000000;font-style:normal;font-variant:normal;font-weight:normal;font-stretch:normal;font-size:medium;line-height:normal;font-family:sans-serif;font-variant-ligatures:normal;font-variant-position:normal;font-variant-caps:normal;font-variant-numeric:normal;font-variant-alternates:normal;font-feature-settings:normal;text-indent:0;text-align:start;text-decoration:none;text-decoration-line:none;text-decoration-style:solid;text-decoration-color:#000000;letter-spacing:normal;word-spacing:normal;text-transform:none;writing-mode:lr-tb;direction:ltr;text-orientation:mixed;dominant-baseline:auto;baseline-shift:baseline;text-anchor:start;white-space:normal;shape-padding:0;clip-rule:nonzero;display:inline;overflow:visible;visibility:visible;opacity:1;isolation:auto;mix-blend-mode:normal;color-interpolation:sRGB;color-interpolation-filters:linearRGB;solid-color:#000000;solid-opacity:1;vector-effect:none;fill:#000000;fill-opacity:1;fill-rule:nonzero;stroke:none;stroke-width:70;stroke-linecap:butt;stroke-linejoin:miter;stroke-miterlimit:4;stroke-dasharray:none;stroke-dashoffset:0;stroke-opacity:1;color-rendering:auto;image-rendering:auto;shape-rendering:auto;text-rendering:auto;enable-background:accumulate"
           inkscape:connector-curvature="0" />
      </g>
      <g
         inkscape:label="exclusion"
         id="layer3-0" />
      <g
         transform="translate(0,-52.36214)"
         id="layer1-6"
         inkscape:label="dots">
        <path
           inkscape:connector-curvature="0"
           id="path5183-43"
           d="m 100,469.02878 c -45.826317,0 -83.333333,37.50701 -83.333333,83.33333 0,45.82632 37.507016,83.33333 83.333333,83.33333 45.82632,0 83.33333,-37.50701 83.33333,-83.33333 0,-45.82632 -37.50701,-83.33333 -83.33333,-83.33333 z m 0,33.33333 c 27.81165,0 50,22.18835 50,50 0,27.81165 -22.18835,50 -50,50 -27.81165,0 -50,-22.18835 -50,-50 0,-27.81165 22.18835,-50 50,-50 z"
           style="color:#000000;font-style:normal;font-variant:normal;font-weight:normal;font-stretch:normal;font-size:medium;line-height:normal;font-family:sans-serif;font-variant-ligatures:normal;font-variant-position:normal;font-variant-caps:normal;font-variant-numeric:normal;font-variant-alternates:normal;font-feature-settings:normal;text-indent:0;text-align:start;text-decoration:none;text-decoration-line:none;text-decoration-style:solid;text-decoration-color:#000000;letter-spacing:normal;word-spacing:normal;text-transform:none;writing-mode:lr-tb;direction:ltr;text-orientation:mixed;dominant-baseline:auto;baseline-shift:baseline;text-anchor:start;white-space:normal;shape-padding:0;clip-rule:nonzero;display:inline;overflow:visible;visibility:visible;opacity:1;isolation:auto;mix-blend-mode:normal;color-interpolation:sRGB;color-interpolation-filters:linearRGB;solid-color:#000000;solid-opacity:1;vector-effect:none;fill:#000000;fill-opacity:1;fill-rule:nonzero;stroke:none;stroke-width:33.33333206;stroke-linecap:butt;stroke-linejoin:miter;stroke-miterlimit:4;stroke-dasharray:none;stroke-dashoffset:0;stroke-opacity:1;paint-order:stroke fill markers;color-rendering:auto;image-rendering:auto;shape-rendering:auto;text-rendering:auto;enable-background:accumulate" />
        <path
           inkscape:connector-curvature="0"
           id="path5183-4-6"
           d="m 100,69.0288 c -45.82632,0 -83.33333,37.50701 -83.33333,83.33333 0,45.82632 37.50701,83.33333 83.33333,83.33333 45.82632,0 83.33333,-37.50701 83.33333,-83.33333 0,-45.82632 -37.50701,-83.33333 -83.33333,-83.33333 z m 0,33.33333 c 27.81165,0 50,22.18835 50,50 0,27.81165 -22.18835,50 -50,50 -27.81165,0 -50,-22.18835 -50,-50 0,-27.81165 22.18835,-50 50,-50 z"
           style="color:#000000;font-style:normal;font-variant:normal;font-weight:normal;font-stretch:normal;font-size:medium;line-height:normal;font-family:sans-serif;font-variant-ligatures:normal;font-variant-position:normal;font-variant-caps:normal;font-variant-numeric:normal;font-variant-alternates:normal;font-feature-settings:normal;text-indent:0;text-align:start;text-decoration:none;text-decoration-line:none;text-decoration-style:solid;text-decoration-color:#000000;letter-spacing:normal;word-spacing:normal;text-transform:none;writing-mode:lr-tb;direction:ltr;text-orientation:mixed;dominant-baseline:auto;baseline-shift:baseline;text-anchor:start;white-space:normal;shape-padding:0;clip-rule:nonzero;display:inline;overflow:visible;visibility:visible;opacity:1;isolation:auto;mix-blend-mode:normal;color-interpolation:sRGB;color-interpolation-filters:linearRGB;solid-color:#000000;solid-opacity:1;vector-effect:none;fill:#000000;fill-opacity:1;fill-rule:nonzero;stroke:none;stroke-width:33.33333206;stroke-linecap:butt;stroke-linejoin:miter;stroke-miterlimit:4;stroke-dasharray:none;stroke-dashoffset:0;stroke-opacity:1;paint-order:stroke fill markers;color-rendering:auto;image-rendering:auto;shape-rendering:auto;text-rendering:auto;enable-background:accumulate" />
        <path
           inkscape:connector-curvature="0"
           id="path5183-4-8"
           d="m 500,869.02881 c -45.82632,0 -83.33333,37.50701 -83.33333,83.33333 0,45.82632 37.50701,83.33336 83.33333,83.33336 45.82632,0 83.33333,-37.50704 83.33333,-83.33336 0,-45.82632 -37.50701,-83.33333 -83.33333,-83.33333 z m 0,33.33333 c 27.81165,0 50,22.18835 50,50 0,27.81165 -22.18835,49.99996 -50,49.99996 -27.81165,0 -50,-22.18831 -50,-49.99996 0,-27.81165 22.18835,-50 50,-50 z"
           style="color:#000000;font-style:normal;font-variant:normal;font-weight:normal;font-stretch:normal;font-size:medium;line-height:normal;font-family:sans-serif;font-variant-ligatures:normal;font-variant-position:normal;font-variant-caps:normal;font-variant-numeric:normal;font-variant-alternates:normal;font-feature-settings:normal;text-indent:0;text-align:start;text-decoration:none;text-decoration-line:none;text-decoration-style:solid;text-decoration-color:#000000;letter-spacing:normal;word-spacing:normal;text-transform:none;writing-mode:lr-tb;direction:ltr;text-orientation:mixed;dominant-baseline:auto;baseline-shift:baseline;text-anchor:start;white-space:normal;shape-padding:0;clip-rule:nonzero;display:inline;overflow:visible;visibility:visible;opacity:1;isolation:auto;mix-blend-mode:normal;color-interpolation:sRGB;color-interpolation-filters:linearRGB;solid-color:#000000;solid-opacity:1;vector-effect:none;fill:#000000;fill-opacity:1;fill-rule:nonzero;stroke:none;stroke-width:33.33333206;stroke-linecap:butt;stroke-linejoin:miter;stroke-miterlimit:4;stroke-dasharray:none;stroke-dashoffset:0;stroke-opacity:1;paint-order:stroke fill markers;color-rendering:auto;image-rendering:auto;shape-rendering:auto;text-rendering:auto;enable-background:accumulate" />
      </g>
    </g>
    <g
       id="layer2-43"
       inkscape:label="lines"
       transform="translate(2584.3333,51.52878)" />
    <g
       id="layer3-1"
       inkscape:label="exclusion"
       transform="translate(2584.3333,51.52878)" />
    <path
       style="color:#000000;font-style:normal;font-variant:normal;font-weight:normal;font-stretch:normal;font-size:medium;line-height:normal;font-family:sans-serif;font-variant-ligatures:normal;font-variant-position:normal;font-variant-caps:normal;font-variant-numeric:normal;font-variant-alternates:normal;font-feature-settings:normal;text-indent:0;text-align:start;text-decoration:none;text-decoration-line:none;text-decoration-style:solid;text-decoration-color:#000000;letter-spacing:normal;word-spacing:normal;text-transform:none;writing-mode:lr-tb;direction:ltr;text-orientation:mixed;dominant-baseline:auto;baseline-shift:baseline;text-anchor:start;white-space:normal;shape-padding:0;clip-rule:nonzero;display:inline;overflow:visible;visibility:visible;opacity:1;isolation:auto;mix-blend-mode:normal;color-interpolation:sRGB;color-interpolation-filters:linearRGB;solid-color:#000000;solid-opacity:1;vector-effect:none;fill:#000000;fill-opacity:1;fill-rule:nonzero;stroke:none;stroke-width:70;stroke-linecap:butt;stroke-linejoin:miter;stroke-miterlimit:4;stroke-dasharray:none;stroke-dashoffset:0;stroke-opacity:1;color-rendering:auto;image-rendering:auto;shape-rendering:auto;text-rendering:auto;enable-background:accumulate"
       d="M 3157.4727 167.17969 A 100 100 0 0 1 3094.8672 198.49609 L 3381.9883 772.73828 L 3420 780 L 3432.1328 716.5 L 3157.4727 167.17969 z "
       transform="translate(0,52.36214)"
       id="path5873-2" />
    <path
       id="path5873"
       d="m 3011.177,219.58151 -316.2695,632.53711 a 100,100 0 0 1 62.582,31.35743 l 316.2696,-632.53711 a 100,100 0 0 1 -62.5821,-31.35743 z"
       style="color:#000000;font-style:normal;font-variant:normal;font-weight:normal;font-stretch:normal;font-size:medium;line-height:normal;font-family:sans-serif;font-variant-ligatures:normal;font-variant-position:normal;font-variant-caps:normal;font-variant-numeric:normal;font-variant-alternates:normal;font-feature-settings:normal;text-indent:0;text-align:start;text-decoration:none;text-decoration-line:none;text-decoration-style:solid;text-decoration-color:#000000;letter-spacing:normal;word-spacing:normal;text-transform:none;writing-mode:lr-tb;direction:ltr;text-orientation:mixed;dominant-baseline:auto;baseline-shift:baseline;text-anchor:start;white-space:normal;shape-padding:0;clip-rule:nonzero;display:inline;overflow:visible;visibility:visible;opacity:1;isolation:auto;mix-blend-mode:normal;color-interpolation:sRGB;color-interpolation-filters:linearRGB;solid-color:#000000;solid-opacity:1;vector-effect:none;fill:#000000;fill-opacity:1;fill-rule:nonzero;stroke:none;stroke-width:70;stroke-linecap:butt;stroke-linejoin:miter;stroke-miterlimit:4;stroke-dasharray:none;stroke-dashoffset:0;stroke-opacity:1;color-rendering:auto;image-rendering:auto;shape-rendering:auto;text-rendering:auto;enable-background:accumulate"
       inkscape:connector-curvature="0" />
    <path
       inkscape:connector-curvature="0"
       id="path5183-7"
       d="m 2684.3333,868.19544 c -45.8263,0 -83.3333,37.50701 -83.3333,83.33333 0,45.82632 37.507,83.33333 83.3333,83.33333 45.8263,0 83.3333,-37.50701 83.3333,-83.33333 0,-45.82632 -37.507,-83.33333 -83.3333,-83.33333 z m 0,33.33333 c 27.8116,0 50,22.18835 50,50 0,27.81165 -22.1884,49.99993 -50,49.99993 -27.8117,0 -50,-22.18828 -50,-49.99993 0,-27.81165 22.1883,-50 50,-50 z"
       style="color:#000000;font-style:normal;font-variant:normal;font-weight:normal;font-stretch:normal;font-size:medium;line-height:normal;font-family:sans-serif;font-variant-ligatures:normal;font-variant-position:normal;font-variant-caps:normal;font-variant-numeric:normal;font-variant-alternates:normal;font-feature-settings:normal;text-indent:0;text-align:start;text-decoration:none;text-decoration-line:none;text-decoration-style:solid;text-decoration-color:#000000;letter-spacing:normal;word-spacing:normal;text-transform:none;writing-mode:lr-tb;direction:ltr;text-orientation:mixed;dominant-baseline:auto;baseline-shift:baseline;text-anchor:start;white-space:normal;shape-padding:0;clip-rule:nonzero;display:inline;overflow:visible;visibility:visible;opacity:1;isolation:auto;mix-blend-mode:normal;color-interpolation:sRGB;color-interpolation-filters:linearRGB;solid-color:#000000;solid-opacity:1;vector-effect:none;fill:#000000;fill-opacity:1;fill-rule:nonzero;stroke:none;stroke-width:33.33333206;stroke-linecap:butt;stroke-linejoin:miter;stroke-miterlimit:4;stroke-dasharray:none;stroke-dashoffset:0;stroke-opacity:1;paint-order:stroke fill markers;color-rendering:auto;image-rendering:auto;shape-rendering:auto;text-rendering:auto;enable-background:accumulate" />
    <path
       inkscape:connector-curvature="0"
       id="path5183-4-4"
       d="m 3084.3333,68.19544 c -45.8263,0 -83.3333,37.50701 -83.3333,83.33333 0,45.82632 37.507,83.33333 83.3333,83.33333 45.8263,0 83.3333,-37.50701 83.3333,-83.33333 0,-45.82632 -37.507,-83.33333 -83.3333,-83.33333 z m 0,33.33333 c 27.8116,0 50,22.18835 50,50 0,27.81165 -22.1884,50 -50,50 -27.8117,0 -50,-22.18835 -50,-50 0,-27.81165 22.1883,-50 50,-50 z"
       style="color:#000000;font-style:normal;font-variant:normal;font-weight:normal;font-stretch:normal;font-size:medium;line-height:normal;font-family:sans-serif;font-variant-ligatures:normal;font-variant-position:normal;font-variant-caps:normal;font-variant-numeric:normal;font-variant-alternates:normal;font-feature-settings:normal;text-indent:0;text-align:start;text-decoration:none;text-decoration-line:none;text-decoration-style:solid;text-decoration-color:#000000;letter-spacing:normal;word-spacing:normal;text-transform:none;writing-mode:lr-tb;direction:ltr;text-orientation:mixed;dominant-baseline:auto;baseline-shift:baseline;text-anchor:start;white-space:normal;shape-padding:0;clip-rule:nonzero;display:inline;overflow:visible;visibility:visible;opacity:1;isolation:auto;mix-blend-mode:normal;color-interpolation:sRGB;color-interpolation-filters:linearRGB;solid-color:#000000;solid-opacity:1;vector-effect:none;fill:#000000;fill-opacity:1;fill-rule:nonzero;stroke:none;stroke-width:33.33333206;stroke-linecap:butt;stroke-linejoin:miter;stroke-miterlimit:4;stroke-dasharray:none;stroke-dashoffset:0;stroke-opacity:1;paint-order:stroke fill markers;color-rendering:auto;image-rendering:auto;shape-rendering:auto;text-rendering:auto;enable-background:accumulate" />
    <path
       inkscape:connector-curvature="0"
       id="path5183-4-2"
       d="m 3484.3333,868.19545 c -45.8263,0 -83.3333,37.50701 -83.3333,83.33332 0,45.82632 37.507,83.33333 83.3333,83.33333 45.8263,0 83.3333,-37.50701 83.3333,-83.33333 0,-45.82631 -37.507,-83.33332 -83.3333,-83.33332 z m 0,33.33333 c 27.8116,0 50,22.18835 50,49.99999 0,27.81165 -22.1884,49.99993 -50,49.99993 -27.8117,0 -50,-22.18828 -50,-49.99993 0,-27.81164 22.1883,-49.99999 50,-49.99999 z"
       style="color:#000000;font-style:normal;font-variant:normal;font-weight:normal;font-stretch:normal;font-size:medium;line-height:normal;font-family:sans-serif;font-variant-ligatures:normal;font-variant-position:normal;font-variant-caps:normal;font-variant-numeric:normal;font-variant-alternates:normal;font-feature-settings:normal;text-indent:0;text-align:start;text-decoration:none;text-decoration-line:none;text-decoration-style:solid;text-decoration-color:#000000;letter-spacing:normal;word-spacing:normal;text-transform:none;writing-mode:lr-tb;direction:ltr;text-orientation:mixed;dominant-baseline:auto;baseline-shift:baseline;text-anchor:start;white-space:normal;shape-padding:0;clip-rule:nonzero;display:inline;overflow:visible;visibility:visible;opacity:1;isolation:auto;mix-blend-mode:normal;color-interpolation:sRGB;color-interpolation-filters:linearRGB;solid-color:#000000;solid-opacity:1;vector-effect:none;fill:#000000;fill-opacity:1;fill-rule:nonzero;stroke:none;stroke-width:33.33333206;stroke-linecap:butt;stroke-linejoin:miter;stroke-miterlimit:4;stroke-dasharray:none;stroke-dashoffset:0;stroke-opacity:1;paint-order:stroke fill markers;color-rendering:auto;image-rendering:auto;shape-rendering:auto;text-rendering:auto;enable-background:accumulate" />
    <path
       style="color:#000000;font-style:normal;font-variant:normal;font-weight:normal;font-stretch:normal;font-size:medium;line-height:normal;font-family:sans-serif;font-variant-ligatures:normal;font-variant-position:normal;font-variant-caps:normal;font-variant-numeric:normal;font-variant-alternates:normal;font-feature-settings:normal;text-indent:0;text-align:start;text-decoration:none;text-decoration-line:none;text-decoration-style:solid;text-decoration-color:#000000;letter-spacing:normal;word-spacing:normal;text-transform:none;writing-mode:lr-tb;direction:ltr;text-orientation:mixed;dominant-baseline:auto;baseline-shift:baseline;text-anchor:start;white-space:normal;shape-padding:0;clip-rule:nonzero;display:inline;overflow:visible;visibility:visible;opacity:1;isolation:auto;mix-blend-mode:normal;color-interpolation:sRGB;color-interpolation-filters:linearRGB;solid-color:#000000;solid-opacity:1;vector-effect:none;fill:#000000;fill-opacity:1;fill-rule:nonzero;stroke:none;stroke-width:70;stroke-linecap:butt;stroke-linejoin:miter;stroke-miterlimit:4;stroke-dasharray:none;stroke-dashoffset:0;stroke-opacity:1;color-rendering:auto;image-rendering:auto;shape-rendering:auto;text-rendering:auto;enable-background:accumulate"
       d="M 2127.1309 69.384766 A 100 100 0 0 1 2131.7832 99.166016 A 100 100 0 0 1 2123.4102 139.0957 C 2396.3838 169.60027 2521.7832 336.76616 2521.7832 499.16602 C 2521.7832 648.58417 2415.6249 802.03251 2186.0488 849.36914 L 2167.248 885.24609 L 2219.4902 912.62305 C 2462.3396 852.94306 2591.7832 677.97986 2591.7832 499.16602 C 2591.7832 298.87964 2429.3917 103.41809 2127.1309 69.384766 z "
       transform="translate(0,52.36214)"
       id="path5181-1" />
    <path
       id="path5181-6-1"
       d="m 1996.7826,245.0737 v 612.8418 a 100,100 0 0 1 35,-6.38672 100,100 0 0 1 35,6.45508 v -612.8418 a 100,100 0 0 1 -35,6.38672 100,100 0 0 1 -35,-6.45508 z"
       style="color:#000000;font-style:normal;font-variant:normal;font-weight:normal;font-stretch:normal;font-size:medium;line-height:normal;font-family:sans-serif;font-variant-ligatures:normal;font-variant-position:normal;font-variant-caps:normal;font-variant-numeric:normal;font-variant-alternates:normal;font-feature-settings:normal;text-indent:0;text-align:start;text-decoration:none;text-decoration-line:none;text-decoration-style:solid;text-decoration-color:#000000;letter-spacing:normal;word-spacing:normal;text-transform:none;writing-mode:lr-tb;direction:ltr;text-orientation:mixed;dominant-baseline:auto;baseline-shift:baseline;text-anchor:start;white-space:normal;shape-padding:0;clip-rule:nonzero;display:inline;overflow:visible;visibility:visible;opacity:1;isolation:auto;mix-blend-mode:normal;color-interpolation:sRGB;color-interpolation-filters:linearRGB;solid-color:#000000;solid-opacity:1;vector-effect:none;fill:#000000;fill-opacity:1;fill-rule:nonzero;stroke:none;stroke-width:70;stroke-linecap:butt;stroke-linejoin:miter;stroke-miterlimit:4;stroke-dasharray:none;stroke-dashoffset:0;stroke-opacity:1;color-rendering:auto;image-rendering:auto;shape-rendering:auto;text-rendering:auto;enable-background:accumulate"
       inkscape:connector-curvature="0" />
    <g
       id="layer3-9"
       inkscape:label="exclusion"
       transform="translate(1931.7826,51.52878)" />
    <g
       inkscape:label="dots"
       id="layer1-67"
       transform="translate(1931.7826,-0.83336)">
      <path
         style="color:#000000;font-style:normal;font-variant:normal;font-weight:normal;font-stretch:normal;font-size:medium;line-height:normal;font-family:sans-serif;font-variant-ligatures:normal;font-variant-position:normal;font-variant-caps:normal;font-variant-numeric:normal;font-variant-alternates:normal;font-feature-settings:normal;text-indent:0;text-align:start;text-decoration:none;text-decoration-line:none;text-decoration-style:solid;text-decoration-color:#000000;letter-spacing:normal;word-spacing:normal;text-transform:none;writing-mode:lr-tb;direction:ltr;text-orientation:mixed;dominant-baseline:auto;baseline-shift:baseline;text-anchor:start;white-space:normal;shape-padding:0;clip-rule:nonzero;display:inline;overflow:visible;visibility:visible;opacity:1;isolation:auto;mix-blend-mode:normal;color-interpolation:sRGB;color-interpolation-filters:linearRGB;solid-color:#000000;solid-opacity:1;vector-effect:none;fill:#000000;fill-opacity:1;fill-rule:nonzero;stroke:none;stroke-width:33.33333206;stroke-linecap:butt;stroke-linejoin:miter;stroke-miterlimit:4;stroke-dasharray:none;stroke-dashoffset:0;stroke-opacity:1;paint-order:stroke fill markers;color-rendering:auto;image-rendering:auto;shape-rendering:auto;text-rendering:auto;enable-background:accumulate"
         d="m 100,869.0288 c -45.826317,0 -83.333333,37.50701 -83.333333,83.33333 0,45.82632 37.507016,83.33337 83.333333,83.33337 45.82632,0 83.33333,-37.50705 83.33333,-83.33337 0,-45.82632 -37.50701,-83.33333 -83.33333,-83.33333 z m 0,33.33333 c 27.81165,0 50,22.18835 50,50 0,27.81165 -22.18835,49.99997 -50,49.99997 -27.81165,0 -50,-22.18832 -50,-49.99997 0,-27.81165 22.18835,-50 50,-50 z"
         id="path5183-3"
         inkscape:connector-curvature="0" />
      <path
         style="color:#000000;font-style:normal;font-variant:normal;font-weight:normal;font-stretch:normal;font-size:medium;line-height:normal;font-family:sans-serif;font-variant-ligatures:normal;font-variant-position:normal;font-variant-caps:normal;font-variant-numeric:normal;font-variant-alternates:normal;font-feature-settings:normal;text-indent:0;text-align:start;text-decoration:none;text-decoration-line:none;text-decoration-style:solid;text-decoration-color:#000000;letter-spacing:normal;word-spacing:normal;text-transform:none;writing-mode:lr-tb;direction:ltr;text-orientation:mixed;dominant-baseline:auto;baseline-shift:baseline;text-anchor:start;white-space:normal;shape-padding:0;clip-rule:nonzero;display:inline;overflow:visible;visibility:visible;opacity:1;isolation:auto;mix-blend-mode:normal;color-interpolation:sRGB;color-interpolation-filters:linearRGB;solid-color:#000000;solid-opacity:1;vector-effect:none;fill:#000000;fill-opacity:1;fill-rule:nonzero;stroke:none;stroke-width:33.33333206;stroke-linecap:butt;stroke-linejoin:miter;stroke-miterlimit:4;stroke-dasharray:none;stroke-dashoffset:0;stroke-opacity:1;paint-order:stroke fill markers;color-rendering:auto;image-rendering:auto;shape-rendering:auto;text-rendering:auto;enable-background:accumulate"
         d="m 100,69.0288 c -45.82632,0 -83.33333,37.50701 -83.33333,83.33333 0,45.82632 37.50701,83.33333 83.33333,83.33333 45.82632,0 83.33333,-37.50701 83.33333,-83.33333 0,-45.82632 -37.50701,-83.33333 -83.33333,-83.33333 z m 0,33.33333 c 27.81165,0 50,22.18835 50,50 0,27.81165 -22.18835,50 -50,50 -27.81165,0 -50,-22.18835 -50,-50 0,-27.81165 22.18835,-50 50,-50 z"
         id="path5183-4-1"
         inkscape:connector-curvature="0" />
    </g>
    <g
       id="g6113"
       transform="translate(2583.3333,51.52878)">
      <g
         inkscape:label="lines"
         id="layer2-0">
        <path
           id="path5181-6-4"
           d="m 65,193.54492 v 612.8418 A 100,100 0 0 1 100,800 a 100,100 0 0 1 35,6.45508 V 193.61328 A 100,100 0 0 1 100,200 100,100 0 0 1 65,193.54492 Z"
           style="color:#000000;font-style:normal;font-variant:normal;font-weight:normal;font-stretch:normal;font-size:medium;line-height:normal;font-family:sans-serif;font-variant-ligatures:normal;font-variant-position:normal;font-variant-caps:normal;font-variant-numeric:normal;font-variant-alternates:normal;font-feature-settings:normal;text-indent:0;text-align:start;text-decoration:none;text-decoration-line:none;text-decoration-style:solid;text-decoration-color:#000000;letter-spacing:normal;word-spacing:normal;text-transform:none;writing-mode:lr-tb;direction:ltr;text-orientation:mixed;dominant-baseline:auto;baseline-shift:baseline;text-anchor:start;white-space:normal;shape-padding:0;clip-rule:nonzero;display:inline;overflow:visible;visibility:visible;opacity:1;isolation:auto;mix-blend-mode:normal;color-interpolation:sRGB;color-interpolation-filters:linearRGB;solid-color:#000000;solid-opacity:1;vector-effect:none;fill:#000000;fill-opacity:1;fill-rule:nonzero;stroke:none;stroke-width:70;stroke-linecap:butt;stroke-linejoin:miter;stroke-miterlimit:4;stroke-dasharray:none;stroke-dashoffset:0;stroke-opacity:1;color-rendering:auto;image-rendering:auto;shape-rendering:auto;text-rendering:auto;enable-background:accumulate"
           inkscape:connector-curvature="0" />
      </g>
      <g
         inkscape:label="exclusion"
         id="layer3-8" />
      <g
         transform="translate(0,-52.36214)"
         id="layer1-9"
         inkscape:label="dots">
        <path
           inkscape:connector-curvature="0"
           id="path5183-77"
           d="m 100,869.0288 c -45.826317,0 -83.333333,37.50701 -83.333333,83.33333 0,45.82632 37.507016,83.33337 83.333333,83.33337 45.82632,0 83.33333,-37.50705 83.33333,-83.33337 0,-45.82632 -37.50701,-83.33333 -83.33333,-83.33333 z m 0,33.33333 c 27.81165,0 50,22.18835 50,50 0,27.81165 -22.18835,49.99997 -50,49.99997 -27.81165,0 -50,-22.18832 -50,-49.99997 0,-27.81165 22.18835,-50 50,-50 z"
           style="color:#000000;font-style:normal;font-variant:normal;font-weight:normal;font-stretch:normal;font-size:medium;line-height:normal;font-family:sans-serif;font-variant-ligatures:normal;font-variant-position:normal;font-variant-caps:normal;font-variant-numeric:normal;font-variant-alternates:normal;font-feature-settings:normal;text-indent:0;text-align:start;text-decoration:none;text-decoration-line:none;text-decoration-style:solid;text-decoration-color:#000000;letter-spacing:normal;word-spacing:normal;text-transform:none;writing-mode:lr-tb;direction:ltr;text-orientation:mixed;dominant-baseline:auto;baseline-shift:baseline;text-anchor:start;white-space:normal;shape-padding:0;clip-rule:nonzero;display:inline;overflow:visible;visibility:visible;opacity:1;isolation:auto;mix-blend-mode:normal;color-interpolation:sRGB;color-interpolation-filters:linearRGB;solid-color:#000000;solid-opacity:1;vector-effect:none;fill:#000000;fill-opacity:1;fill-rule:nonzero;stroke:none;stroke-width:33.33333206;stroke-linecap:butt;stroke-linejoin:miter;stroke-miterlimit:4;stroke-dasharray:none;stroke-dashoffset:0;stroke-opacity:1;paint-order:stroke fill markers;color-rendering:auto;image-rendering:auto;shape-rendering:auto;text-rendering:auto;enable-background:accumulate" />
        <path
           inkscape:connector-curvature="0"
           id="path5183-4-5"
           d="m 100,69.0288 c -45.82632,0 -83.33333,37.50701 -83.33333,83.33333 0,45.82632 37.50701,83.33333 83.33333,83.33333 45.82632,0 83.33333,-37.50701 83.33333,-83.33333 0,-45.82632 -37.50701,-83.33333 -83.33333,-83.33333 z m 0,33.33333 c 27.81165,0 50,22.18835 50,50 0,27.81165 -22.18835,50 -50,50 -27.81165,0 -50,-22.18835 -50,-50 0,-27.81165 22.18835,-50 50,-50 z"
           style="color:#000000;font-style:normal;font-variant:normal;font-weight:normal;font-stretch:normal;font-size:medium;line-height:normal;font-family:sans-serif;font-variant-ligatures:normal;font-variant-position:normal;font-variant-caps:normal;font-variant-numeric:normal;font-variant-alternates:normal;font-feature-settings:normal;text-indent:0;text-align:start;text-decoration:none;text-decoration-line:none;text-decoration-style:solid;text-decoration-color:#000000;letter-spacing:normal;word-spacing:normal;text-transform:none;writing-mode:lr-tb;direction:ltr;text-orientation:mixed;dominant-baseline:auto;baseline-shift:baseline;text-anchor:start;white-space:normal;shape-padding:0;clip-rule:nonzero;display:inline;overflow:visible;visibility:visible;opacity:1;isolation:auto;mix-blend-mode:normal;color-interpolation:sRGB;color-interpolation-filters:linearRGB;solid-color:#000000;solid-opacity:1;vector-effect:none;fill:#000000;fill-opacity:1;fill-rule:nonzero;stroke:none;stroke-width:33.33333206;stroke-linecap:butt;stroke-linejoin:miter;stroke-miterlimit:4;stroke-dasharray:none;stroke-dashoffset:0;stroke-opacity:1;paint-order:stroke fill markers;color-rendering:auto;image-rendering:auto;shape-rendering:auto;text-rendering:auto;enable-background:accumulate" />
      </g>
    </g>
    <g
       id="g6140"
       transform="translate(0,51.52878)">
      <g
         inkscape:label="lines"
         id="layer2-29">
        <path
           id="path831"
           d="M 403.97461,72.378906 C 295.66738,89.876843 214.96421,137.3703 160.61133,202.59375 112.28295,260.5878 84.90109,330.78112 72.728516,403.81836 A 100,100 0 0 1 100,400 a 100,100 0 0 1 42.82031,9.76758 c 10.99882,-60.86926 34.00706,-117.28777 71.56836,-162.36133 42.71524,-51.25828 104.35242,-90.057 195.02539,-105.32031 A 100,100 0 0 1 400,100 100,100 0 0 1 403.97461,72.378906 Z"
           style="color:#000000;font-style:normal;font-variant:normal;font-weight:normal;font-stretch:normal;font-size:medium;line-height:normal;font-family:sans-serif;font-variant-ligatures:normal;font-variant-position:normal;font-variant-caps:normal;font-variant-numeric:normal;font-variant-alternates:normal;font-feature-settings:normal;text-indent:0;text-align:start;text-decoration:none;text-decoration-line:none;text-decoration-style:solid;text-decoration-color:#000000;letter-spacing:normal;word-spacing:normal;text-transform:none;writing-mode:lr-tb;direction:ltr;text-orientation:mixed;dominant-baseline:auto;baseline-shift:baseline;text-anchor:start;white-space:normal;shape-padding:0;clip-rule:nonzero;display:inline;overflow:visible;visibility:visible;opacity:1;isolation:auto;mix-blend-mode:normal;color-interpolation:sRGB;color-interpolation-filters:linearRGB;solid-color:#000000;solid-opacity:1;vector-effect:none;fill:#000000;fill-opacity:1;fill-rule:nonzero;stroke:none;stroke-width:70;stroke-linecap:butt;stroke-linejoin:miter;stroke-miterlimit:4;stroke-dasharray:none;stroke-dashoffset:0;stroke-opacity:1;color-rendering:auto;image-rendering:auto;shape-rendering:auto;text-rendering:auto;enable-background:accumulate"
           inkscape:connector-curvature="0" />
        <path
           id="path831-7"
           d="M 142.82422,590.25586 A 100,100 0 0 1 100,600 100,100 0 0 1 72.716797,596.11328 C 84.883662,669.1751 112.26786,739.3941 160.61133,797.40625 214.95707,862.62113 295.6459,910.11171 403.93164,927.61523 A 100,100 0 0 1 400,900 100,100 0 0 1 409.41406,857.91406 C 318.74109,842.65075 257.10391,803.85203 214.38867,752.59375 176.83218,707.52596 153.8247,651.11618 142.82422,590.25586 Z"
           style="color:#000000;font-style:normal;font-variant:normal;font-weight:normal;font-stretch:normal;font-size:medium;line-height:normal;font-family:sans-serif;font-variant-ligatures:normal;font-variant-position:normal;font-variant-caps:normal;font-variant-numeric:normal;font-variant-alternates:normal;font-feature-settings:normal;text-indent:0;text-align:start;text-decoration:none;text-decoration-line:none;text-decoration-style:solid;text-decoration-color:#000000;letter-spacing:normal;word-spacing:normal;text-transform:none;writing-mode:lr-tb;direction:ltr;text-orientation:mixed;dominant-baseline:auto;baseline-shift:baseline;text-anchor:start;white-space:normal;shape-padding:0;clip-rule:nonzero;display:inline;overflow:visible;visibility:visible;opacity:1;isolation:auto;mix-blend-mode:normal;color-interpolation:sRGB;color-interpolation-filters:linearRGB;solid-color:#000000;solid-opacity:1;vector-effect:none;fill:#000000;fill-opacity:1;fill-rule:nonzero;stroke:none;stroke-width:70;stroke-linecap:butt;stroke-linejoin:miter;stroke-miterlimit:4;stroke-dasharray:none;stroke-dashoffset:0;stroke-opacity:1;color-rendering:auto;image-rendering:auto;shape-rendering:auto;text-rendering:auto;enable-background:accumulate"
           inkscape:connector-curvature="0" />
      </g>
      <g
         inkscape:label="exclusion"
         id="layer3-01" />
      <g
         transform="translate(0,-52.36214)"
         id="layer1-99"
         inkscape:label="dots">
        <path
           inkscape:connector-curvature="0"
           id="path5183-45"
           d="m 100,469.02878 c -45.826317,0 -83.333333,37.50701 -83.333333,83.33333 0,45.82632 37.507016,83.33333 83.333333,83.33333 45.82632,0 83.33333,-37.50701 83.33333,-83.33333 0,-45.82632 -37.50701,-83.33333 -83.33333,-83.33333 z m 0,33.33333 c 27.81165,0 50,22.18835 50,50 0,27.81165 -22.18835,50 -50,50 -27.81165,0 -50,-22.18835 -50,-50 0,-27.81165 22.18835,-50 50,-50 z"
           style="color:#000000;font-style:normal;font-variant:normal;font-weight:normal;font-stretch:normal;font-size:medium;line-height:normal;font-family:sans-serif;font-variant-ligatures:normal;font-variant-position:normal;font-variant-caps:normal;font-variant-numeric:normal;font-variant-alternates:normal;font-feature-settings:normal;text-indent:0;text-align:start;text-decoration:none;text-decoration-line:none;text-decoration-style:solid;text-decoration-color:#000000;letter-spacing:normal;word-spacing:normal;text-transform:none;writing-mode:lr-tb;direction:ltr;text-orientation:mixed;dominant-baseline:auto;baseline-shift:baseline;text-anchor:start;white-space:normal;shape-padding:0;clip-rule:nonzero;display:inline;overflow:visible;visibility:visible;opacity:1;isolation:auto;mix-blend-mode:normal;color-interpolation:sRGB;color-interpolation-filters:linearRGB;solid-color:#000000;solid-opacity:1;vector-effect:none;fill:#000000;fill-opacity:1;fill-rule:nonzero;stroke:none;stroke-width:33.33333206;stroke-linecap:butt;stroke-linejoin:miter;stroke-miterlimit:4;stroke-dasharray:none;stroke-dashoffset:0;stroke-opacity:1;paint-order:stroke fill markers;color-rendering:auto;image-rendering:auto;shape-rendering:auto;text-rendering:auto;enable-background:accumulate" />
        <path
           inkscape:connector-curvature="0"
           id="path5183-4-44"
           d="m 500,69.0288 c -45.82632,0 -83.33333,37.50701 -83.33333,83.33333 0,45.82632 37.50701,83.33333 83.33333,83.33333 45.82632,0 83.33333,-37.50701 83.33333,-83.33333 0,-45.82632 -37.50701,-83.33333 -83.33333,-83.33333 z m 0,33.33333 c 27.81165,0 50,22.18835 50,50 0,27.81165 -22.18835,50 -50,50 -27.81165,0 -50,-22.18835 -50,-50 0,-27.81165 22.18835,-50 50,-50 z"
           style="color:#000000;font-style:normal;font-variant:normal;font-weight:normal;font-stretch:normal;font-size:medium;line-height:normal;font-family:sans-serif;font-variant-ligatures:normal;font-variant-position:normal;font-variant-caps:normal;font-variant-numeric:normal;font-variant-alternates:normal;font-feature-settings:normal;text-indent:0;text-align:start;text-decoration:none;text-decoration-line:none;text-decoration-style:solid;text-decoration-color:#000000;letter-spacing:normal;word-spacing:normal;text-transform:none;writing-mode:lr-tb;direction:ltr;text-orientation:mixed;dominant-baseline:auto;baseline-shift:baseline;text-anchor:start;white-space:normal;shape-padding:0;clip-rule:nonzero;display:inline;overflow:visible;visibility:visible;opacity:1;isolation:auto;mix-blend-mode:normal;color-interpolation:sRGB;color-interpolation-filters:linearRGB;solid-color:#000000;solid-opacity:1;vector-effect:none;fill:#000000;fill-opacity:1;fill-rule:nonzero;stroke:none;stroke-width:33.33333206;stroke-linecap:butt;stroke-linejoin:miter;stroke-miterlimit:4;stroke-dasharray:none;stroke-dashoffset:0;stroke-opacity:1;paint-order:stroke fill markers;color-rendering:auto;image-rendering:auto;shape-rendering:auto;text-rendering:auto;enable-background:accumulate" />
        <path
           inkscape:connector-curvature="0"
           id="path5183-4-8-3"
           d="m 500,869.02881 c -45.82632,0 -83.33333,37.50701 -83.33333,83.33333 0,45.82632 37.50701,83.33336 83.33333,83.33336 45.82632,0 83.33333,-37.50704 83.33333,-83.33336 0,-45.82632 -37.50701,-83.33333 -83.33333,-83.33333 z m 0,33.33333 c 27.81165,0 50,22.18835 50,50 0,27.81165 -22.18835,49.99996 -50,49.99996 -27.81165,0 -50,-22.18831 -50,-49.99996 0,-27.81165 22.18835,-50 50,-50 z"
           style="color:#000000;font-style:normal;font-variant:normal;font-weight:normal;font-stretch:normal;font-size:medium;line-height:normal;font-family:sans-serif;font-variant-ligatures:normal;font-variant-position:normal;font-variant-caps:normal;font-variant-numeric:normal;font-variant-alternates:normal;font-feature-settings:normal;text-indent:0;text-align:start;text-decoration:none;text-decoration-line:none;text-decoration-style:solid;text-decoration-color:#000000;letter-spacing:normal;word-spacing:normal;text-transform:none;writing-mode:lr-tb;direction:ltr;text-orientation:mixed;dominant-baseline:auto;baseline-shift:baseline;text-anchor:start;white-space:normal;shape-padding:0;clip-rule:nonzero;display:inline;overflow:visible;visibility:visible;opacity:1;isolation:auto;mix-blend-mode:normal;color-interpolation:sRGB;color-interpolation-filters:linearRGB;solid-color:#000000;solid-opacity:1;vector-effect:none;fill:#000000;fill-opacity:1;fill-rule:nonzero;stroke:none;stroke-width:33.33333206;stroke-linecap:butt;stroke-linejoin:miter;stroke-miterlimit:4;stroke-dasharray:none;stroke-dashoffset:0;stroke-opacity:1;paint-order:stroke fill markers;color-rendering:auto;image-rendering:auto;shape-rendering:auto;text-rendering:auto;enable-background:accumulate" />
      </g>
    </g>
    <path
       style="color:#000000;font-style:normal;font-variant:normal;font-weight:normal;font-stretch:normal;font-size:medium;line-height:normal;font-family:sans-serif;font-variant-ligatures:normal;font-variant-position:normal;font-variant-caps:normal;font-variant-numeric:normal;font-variant-alternates:normal;font-feature-settings:normal;text-indent:0;text-align:start;text-decoration:none;text-decoration-line:none;text-decoration-style:solid;text-decoration-color:#000000;letter-spacing:normal;word-spacing:normal;text-transform:none;writing-mode:lr-tb;direction:ltr;text-orientation:mixed;dominant-baseline:auto;baseline-shift:baseline;text-anchor:start;white-space:normal;shape-padding:0;clip-rule:nonzero;display:inline;overflow:visible;visibility:visible;opacity:1;isolation:auto;mix-blend-mode:normal;color-interpolation:sRGB;color-interpolation-filters:linearRGB;solid-color:#000000;solid-opacity:1;vector-effect:none;fill:#000000;fill-opacity:1;fill-rule:nonzero;stroke:none;stroke-width:70;stroke-linecap:butt;stroke-linejoin:miter;stroke-miterlimit:4;stroke-dasharray:none;stroke-dashoffset:0;stroke-opacity:1;color-rendering:auto;image-rendering:auto;shape-rendering:auto;text-rendering:auto;enable-background:accumulate"
       d="m 2228.0558,770.9678 -95.5859,181.59038 181.5905,95.58772 32.6056,-61.94242 L 2227.0181,923.22342 2290,803.57344 Z"
       id="path6142"
       inkscape:connector-curvature="0" />
    <path
       style="color:#000000;font-style:normal;font-variant:normal;font-weight:normal;font-stretch:normal;font-size:medium;line-height:normal;font-family:sans-serif;font-variant-ligatures:normal;font-variant-position:normal;font-variant-caps:normal;font-variant-numeric:normal;font-variant-alternates:normal;font-feature-settings:normal;text-indent:0;text-align:start;text-decoration:none;text-decoration-line:none;text-decoration-style:solid;text-decoration-color:#000000;letter-spacing:normal;word-spacing:normal;text-transform:none;writing-mode:lr-tb;direction:ltr;text-orientation:mixed;dominant-baseline:auto;baseline-shift:baseline;text-anchor:start;white-space:normal;shape-padding:0;clip-rule:nonzero;display:inline;overflow:visible;visibility:visible;opacity:1;isolation:auto;mix-blend-mode:normal;color-interpolation:sRGB;color-interpolation-filters:linearRGB;solid-color:#000000;solid-opacity:1;vector-effect:none;fill:#000000;fill-opacity:1;fill-rule:nonzero;stroke:none;stroke-width:70;stroke-linecap:butt;stroke-linejoin:miter;stroke-miterlimit:4;stroke-dasharray:none;stroke-dashoffset:0;stroke-opacity:1;color-rendering:auto;image-rendering:auto;shape-rendering:auto;text-rendering:auto;enable-background:accumulate"
       d="m 3440.0469,649.81912 -43.5448,128.00755 -128.0097,-43.54307 -22.543,66.27071 194.2803,66.08607 66.0879,-194.27824 z"
       id="path6142-5"
       inkscape:connector-curvature="0" />
    <path
       style="fill:none;stroke:#000000;stroke-width:70;stroke-linecap:butt;stroke-linejoin:miter;stroke-miterlimit:4;stroke-dasharray:none;stroke-opacity:1"
       d="m 1326.1362,79.066117 -1.7628,170.203663 -170.2038,-1.76308"
       id="path6142-1"
       inkscape:connector-curvature="0"
       inkscape:export-xdpi="96"
       inkscape:export-ydpi="96" />
    <path
       style="color:#000000;font-style:normal;font-variant:normal;font-weight:normal;font-stretch:normal;font-size:medium;line-height:normal;font-family:sans-serif;font-variant-ligatures:normal;font-variant-position:normal;font-variant-caps:normal;font-variant-numeric:normal;font-variant-alternates:normal;font-feature-settings:normal;text-indent:0;text-align:start;text-decoration:none;text-decoration-line:none;text-decoration-style:solid;text-decoration-color:#000000;letter-spacing:normal;word-spacing:normal;text-transform:none;writing-mode:lr-tb;direction:ltr;text-orientation:mixed;dominant-baseline:auto;baseline-shift:baseline;text-anchor:start;white-space:normal;shape-padding:0;clip-rule:nonzero;display:inline;overflow:visible;visibility:visible;opacity:1;isolation:auto;mix-blend-mode:normal;color-interpolation:sRGB;color-interpolation-filters:linearRGB;solid-color:#000000;solid-opacity:1;vector-effect:none;fill:#000000;fill-opacity:1;fill-rule:nonzero;stroke:none;stroke-width:33.33333206;stroke-linecap:butt;stroke-linejoin:miter;stroke-miterlimit:4;stroke-dasharray:none;stroke-dashoffset:0;stroke-opacity:1;paint-order:stroke fill markers;color-rendering:auto;image-rendering:auto;shape-rendering:auto;text-rendering:auto;enable-background:accumulate"
       d="m 1406,287.02882 c -45.8263,0 -83.3333,37.507 -83.3333,83.33332 0,45.82632 37.507,83.33333 83.3333,83.33333 45.8263,0 83.3333,-37.50701 83.3333,-83.33333 0,-45.82632 -37.507,-83.33332 -83.3333,-83.33332 z m 0,33.33332 c 27.8117,0 50,22.18835 50,50 0,27.81165 -22.1883,50 -50,50 -27.8116,0 -50,-22.18835 -50,-50 0,-27.81165 22.1884,-50 50,-50 z"
       id="path5183-4-10"
       inkscape:connector-curvature="0"
       inkscape:export-xdpi="96"
       inkscape:export-ydpi="96" />
  </g>
</svg>
