﻿OrgUnitId,Organization,Type,Name,Code,StartDate,EndDate,IsActive,CreatedDate,IsDeleted,DeletedDate,RecycledDate,Version
1742764,Georgia Online Virtual Instruction Enterprise Wide,Section,Art Appreciation Section 92G Summer 2019 SEC,SEC.390.ARTS1100.55275.20201,,,True,2019-05-21T20:17:12.4370000Z,False,,,20201856574
1742763,Georgia Online Virtual Instruction Enterprise Wide,Course Offering,Art Appreciation Section 92G Summer 2019 CO,CO.390.ARTS1100.55275.20201,2019-05-28T04:00:00.0000000Z,2019-09-23T04:00:00.0000000Z,True,2019-05-21T20:17:12.1530000Z,False,,,20201856572
