{
  "name": "Quickswap Token List",
  "timestamp": "2022-12-28T18:48:38.718Z",
  "version": {
    "major": 1,
    "minor": 2,
    "patch": 63
  },
  "tags": {},
  "logoURI": "ipfs://QmQ9GCVmLQkbPohxKeCYkbpmwfTvHXrY64TmBsPQAZdbqZ",
  "keywords": [
    "uniswap",
    "default"
  ],
  "tokens": [
    {
      "name": "4INT",
      "address": "0x5CEeBB0947d58Fabde2fc026Ffe4B33ccFE1bA8B",
      "symbol": "4INT",
      "decimals": 9,
      "chainId": 137,
      "logoURI": "https://polygonscan.com/token/images/forintfinance_32.png"
    },
    {
      "name": "Aave",
      "address": "0xD6DF932A45C0f255f85145f286eA0b292B21C90B",
      "symbol": "AAVE",
      "decimals": 18,
      "chainId": 137,
      "logoURI": "https://etherscan.io/token/images/aave_32.png"
    },
    {
      "name": "Arable Protocol",
      "address": "0x011734f6Ed20E8D011d85Cf7894814B897420acf",
      "symbol": "ACRE",
      "decimals": 18,
      "chainId": 137,
      "logoURI": "https://assets.coingecko.com/coins/images/23659/small/acre_token-02.png?1644989289"
    },
    {
      "name": "Adamant",
      "address": "0xc3FdbadC7c795EF1D6Ba111e06fF8F16A20Ea539",
      "symbol": "ADDY",
      "decimals": 18,
      "chainId": 137,
      "logoURI": "https://adamant.finance/img/adamant.png"
    },
    {
      "name": "Adshares",
      "address": "0x598e49f01bEfeB1753737934a5b11fea9119C796",
      "symbol": "ADS",
      "decimals": 11,
      "chainId": 137,
      "logoURI": "https://s2.coinmarketcap.com/static/img/coins/64x64/1883.png"
    },
    {
      "name": "agEUR",
      "address": "0xE0B52e49357Fd4DAf2c15e02058DCE6BC0057db4",
      "symbol": "agEUR",
      "decimals": 18,
      "chainId": 137,
      "logoURI": "https://assets.coingecko.com/coins/images/19479/small/agEUR.png?1635283566"
    },
    {
      "name": "Algebra",
      "address": "0x0169eC1f8f639B32Eec6D923e24C2A2ff45B9DD6",
      "symbol": "ALGB",
      "decimals": 18,
      "chainId": 137,
      "logoURI": "https://assets.coingecko.com/coins/images/19580/small/13211.png?1635469023"
    },
    {
      "name": "Aavegotchi ALPHA",
      "address": "0x6a3E7C3c6EF65Ee26975b12293cA1AAD7e1dAeD2",
      "symbol": "ALPHA",
      "decimals": 18,
      "chainId": 137,
      "logoURI": "https://assets.coingecko.com/coins/images/24738/small/alpha.png?1648769768"
    },
    {
      "name": "Ankr MATIC Reward Bearing Certif",
      "address": "0x0E9b89007eEE9c958c0EDA24eF70723C2C93dD58",
      "symbol": "aMATICc",
      "decimals": 18,
      "chainId": 137,
      "logoURI": "https://assets.coingecko.com/coins/images/25742/small/a-matic-c-da4ec10dc9723e695700e25dbf8c8edf.png?1653462321"
    },
    {
      "name": "AnRKey X",
      "address": "0x554f074d9cCda8F483d1812d4874cBebD682644E",
      "symbol": "ANRX",
      "decimals": 18,
      "chainId": 137,
      "logoURI": "https://assets.coingecko.com/coins/images/13415/small/anrkey.jpg?1608311301"
    },
    {
      "name": "Astrafer",
      "address": "0xDfCe1e99A31C4597a3f8A8945cBfa9037655e335",
      "symbol": "ASTRAFER",
      "decimals": 18,
      "chainId": 137,
      "logoURI": "https://assets.coingecko.com/coins/images/26246/small/ATSRA_Token.png?1657276411"
    },
    {
      "name": "Cosmos",
      "address": "0xac51C4c48Dc3116487eD4BC16542e27B5694Da1b",
      "symbol": "ATOM",
      "decimals": 6,
      "chainId": 137,
      "logoURI": "https://assets.coingecko.com/coins/images/1481/small/cosmos_hub.png?1555657960"
    },
    {
      "name": "Avalanche Token",
      "address": "0x2C89bbc92BD86F8075d1DEcc58C7F4E0107f286b",
      "symbol": "AVAX",
      "decimals": 18,
      "chainId": 137,
      "logoURI": "https://assets.coingecko.com/coins/images/12559/small/coin-round-red.png?1604021818"
    },
    {
      "name": "Axelar Wrapped USDC",
      "address": "0x750e4C4984a9e0f12978eA6742Bc1c5D248f40ed",
      "symbol": "axlUSDC",
      "decimals": 6,
      "chainId": 137,
      "logoURI": "https://raw.githubusercontent.com/trustwallet/assets/master/blockchains/ethereum/assets/0xA0b86991c6218b36c1d19D4a2e9Eb0cE3606eB48/logo.png"
    },
    {
      "name": "Banana",
      "address": "0xbC91347e80886453F3f8bBd6d7aC07C122D87735",
      "symbol": "BANANA",
      "decimals": 18,
      "chainId": 137,
      "logoURI": "https://assets.coingecko.com/coins/images/17521/small/banana-token-cg.png?1646285527"
    },
    {
      "name": "BetSwirl Token",
      "address": "0x9246a5F10A79a5a939b0C2a75A3AD196aAfDB43b",
      "symbol": "BETS",
      "decimals": 18,
      "chainId": 137,
      "logoURI": "https://assets.coingecko.com/coins/images/26618/small/icon_200.png?1659073275"
    },
    {
      "name": "Biconomy Token",
      "address": "0x91c89A94567980f0e9723b487b0beD586eE96aa7",
      "symbol": "BICO",
      "decimals": 18,
      "chainId": 137,
      "logoURI": "https://assets.coingecko.com/coins/images/21061/small/biconomy_logo.jpg?1638269749"
    },
    {
      "name": "beefy.finance",
      "address": "0xFbdd194376de19a88118e84E279b977f165d01b8",
      "symbol": "BIFI",
      "decimals": 18,
      "chainId": 137,
      "logoURI": "https://raw.githubusercontent.com/beefyfinance/beefy-app/prod/src/images/single-assets/BIFI.png"
    },
    {
      "name": "GoBlank Token",
      "address": "0xf4C83080E80AE530d6f8180572cBbf1Ac9D5d435",
      "symbol": "BLANK",
      "decimals": 18,
      "chainId": 137,
      "logoURI": "https://assets.coingecko.com/coins/images/14209/small/blank.png?1614940842"
    },
    {
      "name": "BLOK",
      "address": "0x229b1b6C23ff8953D663C4cBB519717e323a0a84",
      "symbol": "BLOK",
      "decimals": 18,
      "chainId": 137,
      "logoURI": "https://pbs.twimg.com/profile_images/1443182135410634754/l1wH-p3b_400x400.jpg"
    },
    {
      "name": "Binance Token",
      "address": "0x5c4b7CCBF908E64F32e12c6650ec0C96d717f03F",
      "symbol": "BNB",
      "decimals": 18,
      "chainId": 137,
      "logoURI": "https://assets.coingecko.com/coins/images/825/small/binance-coin-logo.png?1547034615"
    },
    {
      "name": "BOB",
      "address": "0xB0B195aEFA3650A6908f15CdaC7D92F8a5791B0B",
      "symbol": "BOB",
      "decimals": 18,
      "chainId": 137,
      "logoURI": "https://assets.coingecko.com/coins/images/27266/small/Bob-logo.png?1663073030"
    },
    {
      "name": "Bookie",
      "address": "0x8192759Bf7f247cC92F74E39B3A4225516624fC1",
      "symbol": "BOOK",
      "decimals": 8,
      "chainId": 137,
      "logoURI": "https://bookie.farm/logoether/bookie200.png"
    },
    {
      "name": "Catheon Gaming",
      "address": "0x7e7737C40878e720b32e7bC9CD096259f876d69f",
      "symbol": "CATHEON",
      "decimals": 9,
      "chainId": 137,
      "logoURI": "https://assets.coingecko.com/coins/images/28052/small/_removal.ai__tmp-635fe0271d6a3%281%29.png?1667286253"
    },
    {
      "name": "NFT Champions",
      "address": "0x8f9E8e833A69Aa467E42c46cCA640da84DD4585f",
      "symbol": "CHAMP",
      "decimals": 8,
      "chainId": 137,
      "logoURI": "https://assets.coingecko.com/coins/images/19536/small/champ.png?1635905981"
    },
    {
      "name": "Crosschain IOTX",
      "address": "0x300211Def2a644b036A9bdd3e58159bb2074d388",
      "symbol": "CIOTX",
      "decimals": 18,
      "chainId": 137,
      "logoURI": "https://raw.githubusercontent.com/iotexproject/iotex-token-metadata/master/images/io1nxetpma4de3wx6tqcgxdtj5wc64a24t64dc76s.png"
    },
    {
      "name": "Cryption Network Token",
      "address": "0xD1e6354fb05bF72A8909266203dAb80947dcEccF",
      "symbol": "CNT",
      "decimals": 18,
      "chainId": 137,
      "logoURI": "https://assets.coingecko.com/coins/images/16171/small/Cryption_Logo_Gradient_White_Text.png?1623191284"
    },
    {
      "name": "Furucombo",
      "address": "0x6DdB31002abC64e1479Fc439692F7eA061e78165",
      "symbol": "COMBO",
      "decimals": 18,
      "chainId": 137,
      "logoURI": "https://assets.coingecko.com/coins/images/13629/small/COMBO_token_ol.png?1610701537"
    },
    {
      "name": "CosplayToken",
      "address": "0x8d520c8E66091cfD6743fe37Fbe3A09505616C4b",
      "symbol": "COT",
      "decimals": 18,
      "chainId": 137,
      "logoURI": "https://assets.coingecko.com/coins/images/21294/small/brave_ZxsjzUc8xn.png?1638874098"
    },
    {
      "name": "Cookies Protocol",
      "address": "0xf9D3d8B25b95BCDA979025B74fDFa7ac3F380f9f",
      "symbol": "CP",
      "decimals": 18,
      "chainId": 137,
      "logoURI": "https://pbs.twimg.com/profile_images/1585702488912629763/8jX3_qXC_400x400.jpg"
    },
    {
      "name": "Crypto Volatility Token",
      "address": "0x9CD552551EC130b50c1421649C8d11E76aC821e1",
      "symbol": "CVOL",
      "decimals": 18,
      "chainId": 137,
      "logoURI": "https://assets.coingecko.com/coins/images/24008/small/govi-dao.03ef3083.png?1646029661"
    },
    {
      "name": "Cyclone Protocol",
      "address": "0xcFb54a6D2dA14ABeCD231174FC5735B4436965D8",
      "symbol": "CYC",
      "decimals": 18,
      "chainId": 137,
      "logoURI": "https://assets.coingecko.com/coins/images/14065/small/b3_DFjFp_400x400.jpg?1614128740"
    },
    {
      "name": "Dai Stablecoin",
      "address": "0x8f3Cf7ad23Cd3CaDbD9735AFf958023239c6A063",
      "symbol": "DAI",
      "decimals": 18,
      "chainId": 137,
      "logoURI": "https://raw.githubusercontent.com/trustwallet/assets/master/blockchains/ethereum/assets/0x6B175474E89094C44Da98b954EedeAC495271d0F/logo.png"
    },
    {
      "name": "DeRace Token",
      "address": "0xB35fcBCF1fD489fCe02Ee146599e893FDCdC60e6",
      "symbol": "DERC",
      "decimals": 18,
      "chainId": 137,
      "logoURI": "https://assets.coingecko.com/coins/images/17438/small/derace-logo-black-coingecko.png?1627656907"
    },
    {
      "name": "decentral.games",
      "address": "0xef938b6da8576a896f6E0321ef80996F4890f9c4",
      "symbol": "DG",
      "decimals": 18,
      "chainId": 137,
      "logoURI": "https://polygonscan.com/token/images/decentralgame_32.png?v=5"
    },
    {
      "name": "Dogira",
      "address": "0xdDa40cdfe4A0090f42Ff49f264A831402ADB801A",
      "symbol": "DOGIRA",
      "decimals": 9,
      "chainId": 137,
      "logoURI": "https://assets.coingecko.com/coins/images/14634/small/IQgaRw0.png?1622439620"
    },
    {
      "name": "DOSE",
      "address": "0x81382e9693dE2aFc33F69B70a6C12CA9B3a73F47",
      "symbol": "DOSE",
      "decimals": 18,
      "chainId": 137,
      "logoURI": "https://assets.coingecko.com/coins/images/18847/small/dose.PNG?1633590548"
    },
    {
      "name": "DefiPulse Index",
      "address": "0x85955046DF4668e1DD369D2DE9f3AEB98DD2A369",
      "symbol": "DPI",
      "decimals": 18,
      "chainId": 137,
      "logoURI": "https://assets.coingecko.com/coins/images/12465/small/defi_pulse_index_set.png?1600051053"
    },
    {
      "name": "Waves Ducks",
      "address": "0x51dE72b17c7bD12E9E6d69eb506a669EB6b5249E",
      "symbol": "EGG",
      "decimals": 18,
      "chainId": 137,
      "logoURI": "https://assets.coingecko.com/coins/images/17298/small/200x200_pixel.png?1627288546"
    },
    {
      "name": "Dogelon",
      "address": "0xE0339c80fFDE91F3e20494Df88d4206D86024cdF",
      "symbol": "ELON",
      "decimals": 18,
      "chainId": 137,
      "logoURI": "https://assets.coingecko.com/coins/images/14962/small/6GxcPRo3_400x400.jpg?1619157413"
    },
    {
      "name": "Ethernity Chain",
      "address": "0x0E50BEA95Fe001A370A4F1C220C49AEdCB982DeC",
      "symbol": "ERN",
      "decimals": 18,
      "chainId": 137,
      "logoURI": "https://assets.coingecko.com/coins/images/14238/small/ethernity_logo.png?1615189750"
    },
    {
      "name": "Ether",
      "address": "0x7ceB23fD6bC0adD59E62ac25578270cFf1b9f619",
      "symbol": "ETH",
      "decimals": 18,
      "chainId": 137,
      "logoURI": "https://raw.githubusercontent.com/trustwallet/assets/master/blockchains/ethereum/assets/0xC02aaA39b223FE8D0A0e5C4F27eAD9083C756Cc2/logo.png"
    },
    {
      "name": "ETHA",
      "address": "0x59E9261255644c411AfDd00bD89162d09D862e38",
      "symbol": "ETHA",
      "decimals": 18,
      "chainId": 137,
      "logoURI": "https://assets.coingecko.com/coins/images/14141/small/etha_logo200x200.png?1614646986"
    },
    {
      "name": "EASY V2",
      "address": "0x34C1b299A74588D6Abdc1b85A53345A48428a521",
      "symbol": "EZ",
      "decimals": 18,
      "chainId": 137,
      "logoURI": "https://etherscan.io/token/images/easyfi_32.png?v=2"
    },
    {
      "name": "Fear NFTs",
      "address": "0xa2CA40DBe72028D3Ac78B5250a8CB8c404e7Fb8C",
      "symbol": "FEAR",
      "decimals": 18,
      "chainId": 137,
      "logoURI": "https://quickswap.exchange/static/media/0xa2ca40dbe72028d3ac78b5250a8cb8c404e7fb8c.a4263994.webp"
    },
    {
      "name": "FireStarter",
      "address": "0x22e3f02f86Bc8eA0D73718A2AE8851854e62adc5",
      "symbol": "FLAME",
      "decimals": 18,
      "chainId": 137,
      "logoURI": "https://assets.coingecko.com/coins/images/17359/small/Logo_black_%282%29.png?1634095075"
    },
    {
      "name": "Fancy Games",
      "address": "0x7f280daC515121DcdA3EaC69eB4C13a52392CACE",
      "symbol": "FNC",
      "decimals": 18,
      "chainId": 137,
      "logoURI": "https://assets.coingecko.com/coins/images/21367/small/fnc.png?1639025576"
    },
    {
      "name": "Aavegotchi FOMO",
      "address": "0x44A6e0BE76e1D9620A7F76588e4509fE4fa8E8C8",
      "symbol": "FOMO",
      "decimals": 18,
      "chainId": 137,
      "logoURI": "https://assets.coingecko.com/coins/images/24737/small/fomo.png?1648769659"
    },
    {
      "name": "FoodChain Global",
      "address": "0x6F06e6beD64cF4c4187c06Ee2a4732f6a171BC4e",
      "symbol": "FOOD",
      "decimals": 18,
      "chainId": 137,
      "logoURI": "https://assets.coingecko.com/coins/images/23755/small/food.png?1645347956"
    },
    {
      "name": "Frax",
      "address": "0x45c32fA6DF82ead1e2EF74d17b76547EDdFaFF89",
      "symbol": "FRAX",
      "decimals": 18,
      "chainId": 137,
      "logoURI": "https://polygonscan.com/token/images/frax_32.png"
    },
    {
      "name": "Fantom Token",
      "address": "0xB85517b87BF64942adf3A0B9E4c71E4Bc5Caa4e5",
      "symbol": "FTM",
      "decimals": 18,
      "chainId": 137,
      "logoURI": "https://assets.coingecko.com/coins/images/4001/small/Fantom.png?1558015016"
    },
    {
      "name": "Aavegotchi FUD",
      "address": "0x403E967b044d4Be25170310157cB1A4Bf10bdD0f",
      "symbol": "FUD",
      "decimals": 18,
      "chainId": 137,
      "logoURI": "https://assets.coingecko.com/coins/images/24736/small/fud.png?1648769512"
    },
    {
      "name": "Fuse",
      "address": "0xF915fDDa4c882731C0456a4214548Cd13A822886",
      "symbol": "FUSE",
      "decimals": 18,
      "chainId": 137,
      "logoURI": "https://assets.coingecko.com/coins/images/10347/small/vUXKHEe.png?1601523640"
    },
    {
      "name": "Affyn",
      "address": "0x3B56a704C01D650147ADE2b8cEE594066b3F9421",
      "symbol": "FYN",
      "decimals": 18,
      "chainId": 137,
      "logoURI": "https://assets.coingecko.com/coins/images/23275/small/fyn.png?1643526250"
    },
    {
      "name": "GAIA Everworld",
      "address": "0x723B17718289A91AF252D616DE2C77944962d122",
      "symbol": "GAIA",
      "decimals": 18,
      "chainId": 137,
      "logoURI": "https://assets.coingecko.com/coins/images/19629/small/gaia_icon_new.png?1637559277"
    },
    {
      "name": "GameStation",
      "address": "0x3f6b3595ecF70735D3f48D69b09C4E4506DB3F47",
      "symbol": "GAMER",
      "decimals": 18,
      "chainId": 137,
      "logoURI": "https://assets.coingecko.com/coins/images/19584/small/game_station.PNG?1635471603"
    },
    {
      "name": "Aavegotchi GHST Token",
      "address": "0x385Eeac5cB85A38A9a07A70c73e0a3271CfB54A7",
      "symbol": "GHST",
      "decimals": 18,
      "chainId": 137,
      "logoURI": "https://aavegotchi.com/images/ghsttoken.svg"
    },
    {
      "name": "GAX Liquidity Token Reward",
      "address": "0x3801C3B3B5c98F88a9c9005966AA96aa440B9Afc",
      "symbol": "GLTR",
      "decimals": 18,
      "chainId": 137,
      "logoURI": "https://i.ibb.co/qMMwsK7/gltr-token.png"
    },
    {
      "name": "Guild Member Token",
      "address": "0xE40d881Cf66e1F6D19979A5fF6c830C6Af65D278",
      "symbol": "GM",
      "decimals": 18,
      "chainId": 137,
      "logoURI": "https://ipfs.io/ipfs/QmY1uqAaLvQ2cnax4P6ETQwHJmsigS6tLUQkomd4eZJMpM"
    },
    {
      "name": "GAMEE",
      "address": "0xcf32822ff397Ef82425153a9dcb726E5fF61DCA7",
      "symbol": "GMEE",
      "decimals": 18,
      "chainId": 137,
      "logoURI": "https://assets.coingecko.com/coins/images/14716/small/gmee-200x200.png?1621827468"
    },
    {
      "name": "Gains Network",
      "address": "0xE5417Af564e4bFDA1c483642db72007871397896",
      "symbol": "GNS",
      "decimals": 18,
      "chainId": 137,
      "logoURI": "https://gains.trade/images/logo.png"
    },
    {
      "name": "Goo",
      "address": "0x6F3Cc27E17a0f2e52D8e7693FF0d892Cea1854bF",
      "symbol": "GOO",
      "decimals": 9,
      "chainId": 137,
      "logoURI": "https://playgooeys.com/GOO-200x200.png"
    },
    {
      "name": "Hanzo",
      "address": "0x37eB60F78e06c4BB2A5F836B0Fc6BCcBbaA995b3",
      "symbol": "HANZO",
      "decimals": 9,
      "chainId": 137,
      "logoURI": "https://assets.coingecko.com/coins/images/15486/small/hanzo.png?1635830733"
    },
    {
      "name": "HEXX",
      "address": "0x23D29D30e35C5e8D321e1dc9A8a61BFD846D4C5C",
      "symbol": "HEX",
      "decimals": 8,
      "chainId": 137,
      "logoURI": "https://hex.com/favicon.png"
    },
    {
      "name": "Hop",
      "address": "0xc5102fE9359FD9a28f877a67E36B0F050d81a3CC",
      "symbol": "HOP",
      "decimals": 18,
      "chainId": 137,
      "logoURI": "https://assets.coingecko.com/coins/images/25445/small/hop.png?1665541677"
    },
    {
      "name": "Decentral Games ICE",
      "address": "0xc6C855AD634dCDAd23e64DA71Ba85b8C51E5aD7c",
      "symbol": "ICE",
      "decimals": 18,
      "chainId": 137,
      "logoURI": "https://assets.coingecko.com/coins/images/18110/small/ice-poker.png?1630500966"
    },
    {
      "name": "GeniuX",
      "address": "0x346404079b3792a6c548B072B9C4DDdFb92948d5",
      "symbol": "IUX",
      "decimals": 18,
      "chainId": 137,
      "logoURI": "https://assets.coingecko.com/coins/images/26078/small/black_IUX-coin-logo2.png?1661767150"
    },
    {
      "name": "PlanetIX",
      "address": "0xE06Bd4F5aAc8D0aA337D13eC88dB6defC6eAEefE",
      "symbol": "IXT",
      "decimals": 18,
      "chainId": 137,
      "logoURI": "https://assets.coingecko.com/coins/images/20927/small/IXT_SYMBOL_SVG_RGB_BLACK.png?1637934555"
    },
    {
      "name": "JPY Coin",
      "address": "0x6AE7Dfc73E0dDE2aa99ac063DcF7e8A63265108c",
      "symbol": "JPYC",
      "decimals": 18,
      "chainId": 137,
      "logoURI": "https://assets.coingecko.com/coins/images/17277/small/WoZ8rruL_400x400.png?1627016492"
    },
    {
      "name": "Aavegotchi KEK",
      "address": "0x42E5E06EF5b90Fe15F853F59299Fc96259209c5C",
      "symbol": "KEK",
      "decimals": 18,
      "chainId": 137,
      "logoURI": "https://assets.coingecko.com/coins/images/24739/small/kek.png?1648769879"
    },
    {
      "name": "Klima DAO",
      "address": "0x4e78011Ce80ee02d2c3e649Fb657E45898257815",
      "symbol": "KLIMA",
      "decimals": 9,
      "chainId": 137,
      "logoURI": "https://assets.coingecko.com/coins/images/19169/small/klima-logo.png?1634606729"
    },
    {
      "name": "Forest Knight",
      "address": "0x4455eF8B4B4A007a93DaA12DE63a47EEAC700D9D",
      "symbol": "KNIGHT",
      "decimals": 18,
      "chainId": 137,
      "logoURI": "https://assets.coingecko.com/coins/images/18441/small/Coin_Forest_Knight_200x200.png?1632480031"
    },
    {
      "name": "Kommunitas",
      "address": "0xC004e2318722EA2b15499D6375905d75Ee5390B8",
      "symbol": "KOM",
      "decimals": 8,
      "chainId": 137,
      "logoURI": "https://i.imgur.com/KTS2F7I.png"
    },
    {
      "name": "Lucidao",
      "address": "0xc2A45FE7d40bCAc8369371B08419DDAFd3131b4a",
      "symbol": "LCD",
      "decimals": 18,
      "chainId": 137,
      "logoURI": "https://assets.coingecko.com/coins/images/23693/small/lcd-icon-color-200px.png?1645450706"
    },
    {
      "name": "Lido DAO Token",
      "address": "0xC3C7d422809852031b44ab29EEC9F1EfF2A58756",
      "symbol": "LDO",
      "decimals": 18,
      "chainId": 137,
      "logoURI": "https://assets.coingecko.com/coins/images/13573/small/Lido_DAO.png?1609873644"
    },
    {
      "name": "LunaFi",
      "address": "0x77D97db5615dFE8a2D16b38EAa3f8f34524a0a74",
      "symbol": "LFI",
      "decimals": 18,
      "chainId": 137,
      "logoURI": "https://assets.coingecko.com/coins/images/24594/small/lfi.png?1648310927"
    },
    {
      "name": "ChainLink Token",
      "address": "0x53E0bca35eC356BD5ddDFebbD1Fc0fD03FaBad39",
      "symbol": "LINK",
      "decimals": 18,
      "chainId": 137,
      "logoURI": "https://raw.githubusercontent.com/trustwallet/assets/master/blockchains/ethereum/assets/0x514910771AF9Ca656af840dff83E8264EcF986CA/logo.png"
    },
    {
      "name": "LumiiiToken",
      "address": "0xED88227296943857409A8e0f15Ad7134e70D0F73",
      "symbol": "LUMIII",
      "decimals": 18,
      "chainId": 137,
      "logoURI": "https://s2.coinmarketcap.com/static/img/coins/64x64/21892.png"
    },
    {
      "name": "Lunr Token",
      "address": "0xBBfE0B60dE96a189BF09079DE86A2Db7bF0C7883",
      "symbol": "Lunr",
      "decimals": 4,
      "chainId": 137,
      "logoURI": "https://s2.coinmarketcap.com/static/img/coins/64x64/12971.png"
    },
    {
      "name": "MAI",
      "address": "0xa3Fa99A148fA48D14Ed51d610c367C61876997F1",
      "symbol": "MAI",
      "decimals": 18,
      "chainId": 137,
      "logoURI": "https://raw.githubusercontent.com/0xlaozi/qidao/main/images/mimatic-red.png"
    },
    {
      "name": "Decentraland MANA",
      "address": "0xA1c57f48F0Deb89f569dFbE6E2B7f46D33606fD4",
      "symbol": "MANA",
      "decimals": 18,
      "chainId": 137,
      "logoURI": "https://raw.githubusercontent.com/trustwallet/assets/master/blockchains/ethereum/assets/0x0F5D2fB29fb7d3CFeE444a200298f468908cC942/logo.png"
    },
    {
      "name": "Mask Network",
      "address": "0x2B9E7ccDF0F4e5B24757c1E1a80e311E34Cb10c7",
      "symbol": "MASK",
      "decimals": 18,
      "chainId": 137,
      "logoURI": "https://assets.coingecko.com/coins/images/14051/small/Mask_Network.jpg?1614050316"
    },
    {
      "name": "MASQ",
      "address": "0xEe9A352F6aAc4aF1A5B9f467F6a93E0ffBe9Dd35",
      "symbol": "MASQ",
      "decimals": 18,
      "chainId": 137,
      "logoURI": "https://assets.coingecko.com/coins/images/13699/small/MASQ_Logo_Blue_Solo_Transparent.png?1616661801"
    },
    {
      "name": "Liquid Staking Matic",
      "address": "0xfa68FB4628DFF1028CFEc22b4162FCcd0d45efb6",
      "symbol": "MaticX",
      "decimals": 18,
      "chainId": 137,
      "logoURI": "https://i.ibb.co/9bHbFsB/2022-04-26-11-53-13.jpg"
    },
    {
      "name": "MCHCoin",
      "address": "0xee7666aACAEFaa6efeeF62ea40176d3eB21953B9",
      "symbol": "MCHC",
      "decimals": 18,
      "chainId": 137,
      "logoURI": "https://assets.coingecko.com/coins/images/15399/small/MCHC.jpg?1620721307"
    },
    {
      "name": "Moss Carbon Credit",
      "address": "0xAa7DbD1598251f856C12f63557A4C4397c253Cea",
      "symbol": "MCO2",
      "decimals": 18,
      "chainId": 137,
      "logoURI": "https://i.imgur.com/ZcOLkHe.jpg"
    },
    {
      "name": "MetaShooter",
      "address": "0x61f95bd637e3034133335C1baA0148E518D438ad",
      "symbol": "MHUNT",
      "decimals": 18,
      "chainId": 137,
      "logoURI": "https://assets.coingecko.com/coins/images/24985/small/200x200.png?1649681575"
    },
    {
      "name": "Milk",
      "address": "0x1599fE55Cda767b1F631ee7D414b41F5d6dE393d",
      "symbol": "MILK",
      "decimals": 18,
      "chainId": 137,
      "logoURI": "https://i.ibb.co/6FDxmPG/milk-coin.png"
    },
    {
      "name": "AssetMantle",
      "address": "0x38A536A31bA4d8C1Bcca016AbBf786ecD25877E8",
      "symbol": "MNTL",
      "decimals": 6,
      "chainId": 137,
      "logoURI": "https://assets.coingecko.com/coins/images/25181/small/thumbnail.png?1658821784"
    },
    {
      "name": "Museum of Crypto Art",
      "address": "0xcE899f26928a2B21c6a2Fddd393EF37c61dbA918",
      "symbol": "MOCA",
      "decimals": 18,
      "chainId": 137,
      "logoURI": "https://assets.coingecko.com/coins/images/15829/small/photo_2021-06-04_09.36.16.jpeg?1622770606"
    },
    {
      "name": "Ocean Token",
      "address": "0x282d8efCe846A88B159800bd4130ad77443Fa1A1",
      "symbol": "mOCEAN",
      "decimals": 18,
      "chainId": 137,
      "logoURI": "https://oceanprotocol.com/static/4ad704a150d436a1f32d495413fc47cd/favicon-white.png"
    },
    {
      "name": "Monavale",
      "address": "0x6968105460f67c3BF751bE7C15f92F5286Fd0CE5",
      "symbol": "MONA",
      "decimals": 18,
      "chainId": 137,
      "logoURI": "https://i.imgur.com/FR12tmm.jpg"
    },
    {
      "name": "MoonEdge",
      "address": "0x7E4c577ca35913af564ee2a24d882a4946Ec492B",
      "symbol": "MOONED",
      "decimals": 18,
      "chainId": 137,
      "logoURI": "https://assets.coingecko.com/coins/images/17393/small/ME_logo_200_200.png?1627526275"
    },
    {
      "name": "SHEESHA POLYGON",
      "address": "0x88C949b4eB85a90071f2C0beF861BDDEe1a7479D",
      "symbol": "mSHEESHA",
      "decimals": 18,
      "chainId": 137,
      "logoURI": "https://pbs.twimg.com/profile_images/1427241161417060359/uHXKH64w_400x400.jpg"
    },
    {
      "name": "Metaverse",
      "address": "0xA3c322Ad15218fBFAEd26bA7f616249f7705D945",
      "symbol": "MV",
      "decimals": 18,
      "chainId": 137,
      "logoURI": "https://assets.coingecko.com/coins/images/23143/small/geno.png?1643626421"
    },
    {
      "name": "Mysterium",
      "address": "0x1379E8886A944d2D9d440b3d88DF536Aea08d9F3",
      "symbol": "MYST",
      "decimals": 18,
      "chainId": 137,
      "logoURI": "https://assets.coingecko.com/coins/images/757/small/mysterium.png?1547034503"
    },
    {
      "name": "NEAR",
      "address": "0x72bd80445b0db58ebe3E8dB056529D4C5FAF6F2f",
      "symbol": "NEAR",
      "decimals": 18,
      "chainId": 137,
      "logoURI": "https://assets.coingecko.com/coins/images/10365/small/near_icon.png?1601359077"
    },
    {
      "name": "Nexo",
      "address": "0x41b3966B4FF7b427969ddf5da3627d6AEAE9a48E",
      "symbol": "NEXO",
      "decimals": 18,
      "chainId": 137,
      "logoURI": "https://s2.coinmarketcap.com/static/img/coins/200x200/2694.png"
    },
    {
      "name": "Nitro",
      "address": "0x695FC8B80F344411F34bDbCb4E621aA69AdA384b",
      "symbol": "NITRO",
      "decimals": 18,
      "chainId": 137,
      "logoURI": "https://assets.coingecko.com/coins/images/21668/small/_X6vYBDM_400x400.jpg?1639705848"
    },
    {
      "name": "NASDEX Token",
      "address": "0xE8d17b127BA8b9899a160D9a07b69bCa8E08bfc6",
      "symbol": "NSDX",
      "decimals": 18,
      "chainId": 137,
      "logoURI": "https://assets.coingecko.com/coins/images/18634/small/nadex.PNG?1632727863"
    },
    {
      "name": "Pleasure Coin",
      "address": "0x8f006D1e1D9dC6C98996F50a4c810F17a47fBF19",
      "symbol": "NSFW",
      "decimals": 18,
      "chainId": 137,
      "logoURI": "https://assets.coingecko.com/coins/images/15315/small/pleasurecoin-icon.png?1648724879"
    },
    {
      "name": "OM",
      "address": "0xC3Ec80343D2bae2F8E680FDADDe7C17E71E114ea",
      "symbol": "OM",
      "decimals": 18,
      "chainId": 137,
      "logoURI": "https://etherscan.io/token/images/mantradao_32.png"
    },
    {
      "name": "Augury Finance",
      "address": "0x76e63a3E7Ba1e2E61D3DA86a87479f983dE89a7E",
      "symbol": "OMEN",
      "decimals": 18,
      "chainId": 137,
      "logoURI": "https://augury.finance/_nuxt/img/omen.b433161.png"
    },
    {
      "name": "One Rare Token",
      "address": "0xFF2382Bd52efaceF02Cc895bcBFc4618608AA56F",
      "symbol": "ORARE",
      "decimals": 18,
      "chainId": 137,
      "logoURI": "https://assets.coingecko.com/coins/images/19696/small/Thumbnail_-_500_px_-_Black.png?1635751681"
    },
    {
      "name": "Orbs",
      "address": "0x614389EaAE0A6821DC49062D56BDA3d9d45Fa2ff",
      "symbol": "ORBS",
      "decimals": 18,
      "chainId": 137,
      "logoURI": "https://assets.coingecko.com/coins/images/4630/small/Orbs.jpg?1547039896"
    },
    {
      "name": "Paxos Gold",
      "address": "0x553d3D295e0f695B9228246232eDF400ed3560B5",
      "symbol": "PAXG",
      "decimals": 18,
      "chainId": 137,
      "logoURI": "https://assets.coingecko.com/coins/images/9519/small/paxg.PNG?1568542565"
    },
    {
      "name": "Polygon Ecosystem Index",
      "address": "0xA9536B9c75A9E0faE3B56a96AC8EdF76AbC91978",
      "symbol": "PECO",
      "decimals": 18,
      "chainId": 137,
      "logoURI": "https://assets.coingecko.com/coins/images/19270/small/amun-peco.png?1634868167"
    },
    {
      "name": "PLOT",
      "address": "0xe82808eaA78339b06a691fd92E1Be79671cAd8D3",
      "symbol": "PLOT",
      "decimals": 18,
      "chainId": 137,
      "logoURI": "https://i.imgur.com/nQDG9AQ.png"
    },
    {
      "name": "pMATIC",
      "address": "0xA0dF47432d9d88bcc040E9ee66dDC7E17A882715",
      "symbol": "pMATIC",
      "decimals": 18,
      "chainId": 137,
      "logoURI": "https://matic.ripae.finance/static/media/ripae_pftm.1a3fe2b4.svg"
    },
    {
      "name": "PolyDoge",
      "address": "0x8A953CfE442c5E8855cc6c61b1293FA648BAE472",
      "symbol": "PolyDoge",
      "decimals": 18,
      "chainId": 137,
      "logoURI": "https://polydoge.com/doge-webpage_files/doge.png"
    },
    {
      "name": "PolysportsToken",
      "address": "0x32Cd1BCB75473845b5d1dB6ecE60AEC6E41d8518",
      "symbol": "PS1",
      "decimals": 18,
      "chainId": 137,
      "logoURI": "https://assets.coingecko.com/coins/images/25070/small/L-T2x_cG_400x400.jpg?1650024620"
    },
    {
      "name": "ParaSwap",
      "address": "0x42d61D766B85431666B39B89C43011f24451bFf6",
      "symbol": "PSP",
      "decimals": 18,
      "chainId": 137,
      "logoURI": "https://assets.coingecko.com/coins/images/20403/small/ep7GqM19_400x400.jpg?1636979120"
    },
    {
      "name": "PYR Token",
      "address": "0x430EF9263E76DAE63c84292C3409D61c598E9682",
      "symbol": "PYR",
      "decimals": 18,
      "chainId": 137,
      "logoURI": "https://assets.coingecko.com/coins/images/14770/small/1617088937196.png?1619414736"
    },
    {
      "name": "Qi Dao",
      "address": "0x580A84C73811E1839F75d86d75d88cCa0c241fF4",
      "symbol": "QI",
      "decimals": 18,
      "chainId": 137,
      "logoURI": "https://raw.githubusercontent.com/0xlaozi/qidao/main/images/qi.png"
    },
    {
      "name": "QuickSwap(NEW)",
      "address": "0xB5C064F955D8e7F38fE0460C556a72987494eE17",
      "symbol": "QUICK(NEW)",
      "decimals": 18,
      "chainId": 137,
      "logoURI": "https://i.ibb.co/HGWTLM7/Quick-Icon-V2.png"
    },
    {
      "name": "QuickSwap(OLD)",
      "address": "0x831753DD7087CaC61aB5644b308642cc1c33Dc13",
      "symbol": "QUICK(OLD)",
      "decimals": 18,
      "chainId": 137,
      "logoURI": "https://raw.githubusercontent.com/sameepsi/quickswap-interface/master/public/favicon.jpeg"
    },
    {
      "name": "QUIDD",
      "address": "0x123706cDD8e60324e610E9A2CC7012D0F45A5b8E",
      "symbol": "QUIDD",
      "decimals": 18,
      "chainId": 137,
      "logoURI": "https://assets.coingecko.com/coins/images/19725/small/quidd.png?1637303435"
    },
    {
      "name": "Request",
      "address": "0xB25e20De2F2eBb4CfFD4D16a55C7B395e8a94762",
      "symbol": "REQ",
      "decimals": 18,
      "chainId": 137,
      "logoURI": "https://assets.coingecko.com/coins/images/1031/small/Request_icon.png?1550832088"
    },
    {
      "name": "REVV",
      "address": "0x70c006878a5A50Ed185ac4C87d837633923De296",
      "symbol": "REVV",
      "decimals": 18,
      "chainId": 137,
      "logoURI": "https://assets.coingecko.com/coins/images/12373/small/REVV_TOKEN_Refined_2021_%281%29.png?1627652390"
    },
    {
      "name": "ROND Coin",
      "address": "0x204820B6e6FEae805e376D2C6837446186e57981",
      "symbol": "ROND",
      "decimals": 18,
      "chainId": 137,
      "logoURI": "https://assets.coingecko.com/coins/images/27601/small/rond.png?1664716228"
    },
    {
      "name": "Revolt 2 Earn",
      "address": "0xf0f9D895aCa5c8678f706FB8216fa22957685A13",
      "symbol": "RVLT",
      "decimals": 18,
      "chainId": 137,
      "logoURI": "https://s2.coinmarketcap.com/static/img/coins/64x64/19893.png"
    },
    {
      "name": "Safle",
      "address": "0x04b33078Ea1aEf29bf3fB29c6aB7B200C58ea126",
      "symbol": "SAFLE",
      "decimals": 18,
      "chainId": 137,
      "logoURI": "https://s2.coinmarketcap.com/static/img/coins/64x64/12691.png"
    },
    {
      "name": "SAND",
      "address": "0xBbba073C31bF03b8ACf7c28EF0738DeCF3695683",
      "symbol": "SAND",
      "decimals": 18,
      "chainId": 137,
      "logoURI": "https://assets.coingecko.com/coins/images/12129/small/sandbox_logo.jpg?1597397942"
    },
    {
      "name": "Stader",
      "address": "0x1d734A02eF1e1f5886e66b0673b71Af5B53ffA94",
      "symbol": "SD",
      "decimals": 18,
      "chainId": 137,
      "logoURI": "https://assets.coingecko.com/coins/images/20658/small/sd.png?1642927667"
    },
    {
      "name": "Sunflower Land",
      "address": "0xD1f9c58e33933a993A3891F8acFe05a68E1afC05",
      "symbol": "SFL",
      "decimals": 18,
      "chainId": 137,
      "logoURI": "https://assets.coingecko.com/coins/images/25514/small/download.png?1652164203"
    },
    {
      "name": "SHIBA INU",
      "address": "0x6f8a06447Ff6FcF75d803135a7de15CE88C1d4ec",
      "symbol": "SHIB",
      "decimals": 18,
      "chainId": 137,
      "logoURI": "https://assets.coingecko.com/coins/images/11939/small/shiba.png?1622619446"
    },
    {
      "name": "StrongNodeEdge Token",
      "address": "0x32934CB16DA43fd661116468c1B225Fc26CF9A8c",
      "symbol": "SNE",
      "decimals": 18,
      "chainId": 137,
      "logoURI": "https://s2.coinmarketcap.com/static/img/coins/64x64/12258.png"
    },
    {
      "name": "Snook",
      "address": "0x689f8e5913C158fFB5Ac5aeb83b3C875F5d20309",
      "symbol": "SNK",
      "decimals": 18,
      "chainId": 137,
      "logoURI": "https://assets.coingecko.com/coins/images/18197/small/snk.png?1630979321"
    },
    {
      "name": "SOL",
      "address": "0x7DfF46370e9eA5f0Bad3C4E29711aD50062EA7A4",
      "symbol": "SOL",
      "decimals": 18,
      "chainId": 137,
      "logoURI": "https://assets.coingecko.com/coins/images/4128/small/coinmarketcap-solana-200.png?1616489452"
    },
    {
      "name": "Staked MATIC",
      "address": "0x3A58a54C066FdC0f2D55FC9C89F0415C92eBf3C4",
      "symbol": "stMATIC",
      "decimals": 18,
      "chainId": 137,
      "logoURI": "https://assets.coingecko.com/coins/images/24185/small/stMATIC.png?1646789287"
    },
    {
      "name": "99Starz",
      "address": "0x2c92a8A41f4b806a6f6F1F7C9D9DEc78DCd8c18e",
      "symbol": "STZ",
      "decimals": 18,
      "chainId": 137,
      "logoURI": "https://assets.coingecko.com/coins/images/21467/small/n1fqEYRI_400x400.png?1639345175"
    },
    {
      "name": "Super WinGoal Token",
      "address": "0x9D2Aa8B9Cd32fe46F4E177F49871518D942B1E47",
      "symbol": "SWT",
      "decimals": 18,
      "chainId": 137,
      "logoURI": "https://i.imgur.com/GO11OUH.png"
    },
    {
      "name": "Cryptomeda",
      "address": "0x6286A9e6f7e745A6D884561D88F94542d6715698",
      "symbol": "TECH",
      "decimals": 18,
      "chainId": 137,
      "logoURI": "https://assets.coingecko.com/coins/images/17983/small/tech.png?1654330771"
    },
    {
      "name": "Telcoin",
      "address": "0xdF7837DE1F2Fa4631D716CF2502f8b230F1dcc32",
      "symbol": "TEL",
      "decimals": 2,
      "chainId": 137,
      "logoURI": "https://etherscan.io/token/images/telcoin_28.png"
    },
    {
      "name": "TOWER",
      "address": "0x2bC07124D8dAc638E290f401046Ad584546BC47b",
      "symbol": "TOWER",
      "decimals": 18,
      "chainId": 137,
      "logoURI": "https://assets.coingecko.com/coins/images/14134/small/tower-circular-1000.png?1632195469"
    },
    {
      "name": "Trace Network",
      "address": "0x4287F07CBE6954f9F0DecD91d0705C926d8d03A4",
      "symbol": "TRACE",
      "decimals": 18,
      "chainId": 137,
      "logoURI": "https://assets.coingecko.com/coins/images/23266/small/Token_Icon_02.png?1655797843"
    },
    {
      "name": "Polytrade",
      "address": "0x692AC1e363ae34b6B489148152b12e2785a3d8d6",
      "symbol": "TRADE",
      "decimals": 18,
      "chainId": 137,
      "logoURI": "https://polygonscan.com/token/images/polytrade_32.png"
    },
    {
      "name": "TrueUSD",
      "address": "0x2e1AD108fF1D8C782fcBbB89AAd783aC49586756",
      "symbol": "TUSD",
      "decimals": 18,
      "chainId": 137,
      "logoURI": "https://assets.coingecko.com/coins/images/3449/small/tusd.png?1618395665"
    },
    {
      "name": "UnirisToken",
      "address": "0x3C720206bFaCB2d16fA3ac0ed87D2048Dbc401Fc",
      "symbol": "UCO",
      "decimals": 18,
      "chainId": 137,
      "logoURI": "https://assets.coingecko.com/coins/images/12330/small/e353ZVj.png?1599112996"
    },
    {
      "name": "Continuum",
      "address": "0x3B1A0c9252ee7403093fF55b4a5886d49a3d837a",
      "symbol": "UM",
      "decimals": 18,
      "chainId": 137,
      "logoURI": "https://assets.coingecko.com/coins/images/18798/small/Moneda.png?1633474110"
    },
    {
      "name": "Unbound Dollar",
      "address": "0x1eBA4B44C4F8cc2695347C6a78F0B7a002d26413",
      "symbol": "UND",
      "decimals": 18,
      "chainId": 137,
      "logoURI": "https://assets.coingecko.com/coins/images/19932/small/und.PNG?1636325217"
    },
    {
      "name": "Uniswap",
      "address": "0xb33EaAd8d922B1083446DC23f610c2567fB5180f",
      "symbol": "UNI",
      "decimals": 18,
      "chainId": 137,
      "logoURI": "https://raw.githubusercontent.com/sameepsi/quickswap-interface/master/public/favicon1.png"
    },
    {
      "name": "USD Coin",
      "address": "0x2791Bca1f2de4661ED88A30C99A7a9449Aa84174",
      "symbol": "USDC",
      "decimals": 6,
      "chainId": 137,
      "logoURI": "https://raw.githubusercontent.com/trustwallet/assets/master/blockchains/ethereum/assets/0xA0b86991c6218b36c1d19D4a2e9Eb0cE3606eB48/logo.png"
    },
    {
      "name": "Decentralized USD",
      "address": "0xFFA4D863C96e743A2e1513824EA006B8D0353C57",
      "symbol": "USDD",
      "decimals": 18,
      "chainId": 137,
      "logoURI": "https://assets.coingecko.com/coins/images/25380/small/UUSD.jpg?1651823371"
    },
    {
      "name": "Tether USD",
      "address": "0xc2132D05D31c914a87C6611C10748AEb04B58e8F",
      "symbol": "USDT",
      "decimals": 6,
      "chainId": 137,
      "logoURI": "https://raw.githubusercontent.com/trustwallet/assets/master/blockchains/ethereum/assets/0xdAC17F958D2ee523a2206206994597C13D831ec7/logo.png"
    },
    {
      "name": "VersaGames",
      "address": "0x8497842420cFdbc97896C2353D75d89Fc8D5Be5D",
      "symbol": "VERSA",
      "decimals": 18,
      "chainId": 137,
      "logoURI": "https://assets.coingecko.com/coins/images/25491/small/versa_token_96_96.png?1652074785"
    },
    {
      "name": "VOXEL Token",
      "address": "0xd0258a3fD00f38aa8090dfee343f10A9D4d30D3F",
      "symbol": "VOXEL",
      "decimals": 18,
      "chainId": 137,
      "logoURI": "https://assets.coingecko.com/coins/images/21260/small/voxies.png?1638789903"
    },
    {
      "name": "Wrapped BTC",
      "address": "0x1BFD67037B42Cf73acF2047067bd4F2C47D9BfD6",
      "symbol": "WBTC",
      "decimals": 8,
      "chainId": 137,
      "logoURI": "https://raw.githubusercontent.com/trustwallet/assets/master/blockchains/ethereum/assets/0x2260FAC5E5542a773Aa44fBCfeDf7C193bc2C599/logo.png"
    },
    {
      "name": "FABWELT",
      "address": "0x23E8B6A3f6891254988B84Da3738D2bfe5E703b9",
      "symbol": "WELT",
      "decimals": 18,
      "chainId": 137,
      "logoURI": "https://assets.coingecko.com/coins/images/20505/small/welt.PNG?1637143324"
    },
    {
      "name": "Wise Token",
      "address": "0xB77e62709e39aD1cbeEBE77cF493745AeC0F453a",
      "symbol": "WISE",
      "decimals": 18,
      "chainId": 137,
      "logoURI": "https://assets.coingecko.com/coins/images/13552/small/WISE-logo-1600x1280.png?1609727947"
    },
    {
      "name": "wLitiDAO",
      "address": "0xA936e1f747d14fC30d08272D065c8aeF4ab7f810",
      "symbol": "WLD",
      "decimals": 18,
      "chainId": 137,
      "logoURI": "https://assets.coingecko.com/coins/images/24106/small/200px-cmc.png?1646376154"
    },
    {
      "name": "Wrapped Matic",
      "address": "0x0d500B1d8E8eF31E21C99d1Db9A6444d3ADf1270",
      "symbol": "WMATIC",
      "decimals": 18,
      "chainId": 137,
      "logoURI": "https://i.imgur.com/uIExoAr.png"
    },
    {
      "name": "Wombat",
      "address": "0x0C9c7712C83B3C70e7c5E11100D33D9401BdF9dd",
      "symbol": "WOMBAT",
      "decimals": 18,
      "chainId": 137,
      "logoURI": "https://assets.coingecko.com/coins/images/26430/small/Project_Page_Icon.png?1657930951"
    },
    {
      "name": "Wootrade Network",
      "address": "0x1B815d120B3eF02039Ee11dC2d33DE7aA4a8C603",
      "symbol": "WOO",
      "decimals": 18,
      "chainId": 137,
      "logoURI": "https://raw.githubusercontent.com/sameepsi/quickswap-default-token-list/master/assets/wootrade_w.svg"
    },
    {
      "name": "WinGoal Token",
      "address": "0x72B6A3155EF6C5a6222f2f946A03E3f3Fd991E3c",
      "symbol": "WT",
      "decimals": 18,
      "chainId": 137,
      "logoURI": "https://i.imgur.com/yrxXY9u.png"
    },
    {
      "name": "XCAD Token",
      "address": "0xA55870278d6389ec5B524553D03C04F5677c061E",
      "symbol": "XCAD",
      "decimals": 18,
      "chainId": 137,
      "logoURI": "https://i.imgur.com/jykuRwK.png"
    },
    {
      "name": "Exchange Genesis Ethlas Medium",
      "address": "0x02649C1Ff4296038De4b9bA8F491b42b940A8252",
      "symbol": "XGEM",
      "decimals": 18,
      "chainId": 137,
      "logoURI": "https://assets.coingecko.com/coins/images/22535/small/17200.png?1642023748"
    },
    {
      "name": "USD Coin",
      "address": "0x6c28AeF8977c9B773996d0e8376d2EE379446F2f",
      "symbol": "USDC",
      "decimals": 6,
      "chainId": 1402,
      "logoURI": "https://raw.githubusercontent.com/trustwallet/assets/master/blockchains/ethereum/assets/0xA0b86991c6218b36c1d19D4a2e9Eb0cE3606eB48/logo.png"
    },
    {
      "name": "Dogechain Token",
      "address": "0x7B4328c127B85369D9f82ca0503B000D09CF9180",
      "symbol": "DC",
      "decimals": 18,
      "chainId": 2000,
      "logoURI": "https://i.imgur.com/llRjxRL.png"
    },
    {
      "name": "DCGOD",
      "address": "0x91cd28e57b92e34124C4540eE376C581D188B53E",
      "symbol": "DCGOD",
      "decimals": 18,
      "chainId": 2000,
      "logoURI": "https://i.imgur.com/WH22eKZ.png"
    },
    {
      "name": "Doge Dragon",
      "address": "0x582DaEF1F36D6009f64b74519cFD612a8467Be18",
      "symbol": "DD",
      "decimals": 18,
      "chainId": 2000,
      "logoURI": "https://i.imgur.com/qCzBBC4.png"
    },
    {
      "name": "Dogira",
      "address": "0xF480f38C366dAaC4305dC484b2Ad7a496FF00CeA",
      "symbol": "DOGIRA",
      "decimals": 9,
      "chainId": 2000,
      "logoURI": "https://i.imgur.com/X753Wko.jpg"
    },
    {
      "name": "Ether",
      "address": "0xB44a9B6905aF7c801311e8F4E76932ee959c663C",
      "symbol": "ETH",
      "decimals": 18,
      "chainId": 2000,
      "logoURI": "https://raw.githubusercontent.com/trustwallet/assets/master/blockchains/ethereum/assets/0xC02aaA39b223FE8D0A0e5C4F27eAD9083C756Cc2/logo.png"
    },
    {
      "name": "Mai Stablecoin",
      "address": "0xb84Df10966a5D7e1ab46D9276F55d57bD336AFC7",
      "symbol": "MAI",
      "decimals": 18,
      "chainId": 2000,
      "logoURI": "https://raw.githubusercontent.com/0xlaozi/qidao/main/images/mimatic-red.png"
    },
    {
      "name": "Matic",
      "address": "0xDC42728B0eA910349ed3c6e1c9Dc06b5FB591f98",
      "symbol": "MATIC",
      "decimals": 18,
      "chainId": 2000,
      "logoURI": "https://i.imgur.com/uIExoAr.png"
    },
    {
      "name": "QuickSwap",
      "address": "0xb12c13e66AdE1F72f71834f2FC5082Db8C091358",
      "symbol": "QUICK",
      "decimals": 18,
      "chainId": 2000,
      "logoURI": "https://i.ibb.co/HGWTLM7/Quick-Icon-V2.png"
    },
    {
      "name": "USD Coin",
      "address": "0x765277EebeCA2e31912C9946eAe1021199B39C61",
      "symbol": "USDC",
      "decimals": 6,
      "chainId": 2000,
      "logoURI": "https://raw.githubusercontent.com/trustwallet/assets/master/blockchains/ethereum/assets/0xA0b86991c6218b36c1d19D4a2e9Eb0cE3606eB48/logo.png"
    },
    {
      "name": "Tether USD",
      "address": "0xE3F5a90F9cb311505cd691a46596599aA1A0AD7D",
      "symbol": "USDT",
      "decimals": 6,
      "chainId": 2000,
      "logoURI": "https://raw.githubusercontent.com/trustwallet/assets/master/blockchains/ethereum/assets/0xdAC17F958D2ee523a2206206994597C13D831ec7/logo.png"
    },
    {
      "name": "Wrapped Bitcoin",
      "address": "0xfA9343C3897324496A05fC75abeD6bAC29f8A40f",
      "symbol": "WBTC",
      "decimals": 6,
      "chainId": 2000,
      "logoURI": "https://raw.githubusercontent.com/trustwallet/assets/master/blockchains/ethereum/assets/0x2260FAC5E5542a773Aa44fBCfeDf7C193bc2C599/logo.png"
    },
    {
      "name": "Wrapped WDOGE",
      "address": "0xB7ddC6414bf4F5515b52D8BdD69973Ae205ff101",
      "symbol": "WWDOGE",
      "decimals": 18,
      "chainId": 2000,
      "logoURI": "https://s2.coinmarketcap.com/static/img/coins/64x64/74.png"
    },
    {
      "name": "Dai Stablecoin",
      "address": "0xcB1e72786A6eb3b44C2a2429e317c8a2462CFeb1",
      "symbol": "DAI",
      "decimals": 18,
      "chainId": 80001,
      "logoURI": "https://raw.githubusercontent.com/trustwallet/assets/master/blockchains/ethereum/assets/0x6B175474E89094C44Da98b954EedeAC495271d0F/logo.png"
    },
    {
      "name": "Ether",
      "address": "0x714550C2C1Ea08688607D86ed8EeF4f5E4F22323",
      "symbol": "ETH",
      "decimals": 18,
      "chainId": 80001,
      "logoURI": "https://raw.githubusercontent.com/trustwallet/assets/master/blockchains/ethereum/assets/0xC02aaA39b223FE8D0A0e5C4F27eAD9083C756Cc2/logo.png"
    },
    {
      "name": "SAND",
      "address": "0xE03489D4E90b22c59c5e23d45DFd59Fc0dB8a025",
      "symbol": "SAND",
      "decimals": 18,
      "chainId": 80001,
      "logoURI": "https://assets.coingecko.com/coins/images/12129/small/sandbox_logo.jpg?1597397942"
    },
    {
      "name": "Tether USD",
      "address": "0x3813e82e6f7098b9583FC0F33a962D02018B6803",
      "symbol": "USDT",
      "decimals": 6,
      "chainId": 80001,
      "logoURI": "https://raw.githubusercontent.com/trustwallet/assets/master/blockchains/ethereum/assets/0xdAC17F958D2ee523a2206206994597C13D831ec7/logo.png"
    },
    {
      "name": "Wrapped Matic",
      "address": "0x9c3C9283D3e44854697Cd22D3Faa240Cfb032889",
      "symbol": "WMATIC",
      "decimals": 18,
      "chainId": 80001,
      "logoURI": "https://raw.githubusercontent.com/trustwallet/assets/master/blockchains/ethereum/assets/0x7D1AfA7B718fb893dB30A3aBc0Cfc608AaCfeBB0/logo.png"
    },
    {
      "name": "BitCone",
      "address": "0x36858Bc6181d452CDdF5648eE40E53B46aD7b531",
      "symbol": "CONE",
      "decimals": 18,
      "chainId": 80001,
      "logoURI": "https://raw.githubusercontent.com/trustwallet/assets/master/blockchains/ethereum/assets/0x7D1AfA7B718fb893dB30A3aBc0Cfc608AaC>"
    }
  ]
}