%YAML 1.1
%TAG !u! tag:unity3d.com,2011:
--- !u!114 &11400000
MonoBehaviour:
  m_ObjectHideFlags: 0
  m_CorrespondingSourceObject: {fileID: 0}
  m_PrefabInstance: {fileID: 0}
  m_PrefabAsset: {fileID: 0}
  m_GameObject: {fileID: 0}
  m_Enabled: 1
  m_EditorHideFlags: 0
  m_Script: {fileID: 11500000, guid: 95e66c6366d904e98bc83428217d4fd7, type: 3}
  m_Name: CapsuleScaling
  m_EditorClassIdentifier: 
  _data:
    _json: '{"graph":{"variables":{"Kind":"Flow","collection":{"$content":[],"$version":"A"},"$version":"A"},"controlInputDefinitions":[],"controlOutputDefinitions":[],"valueInputDefinitions":[],"valueOutputDefinitions":[],"title":null,"summary":null,"pan":{"x":236.0,"y":53.0},"zoom":1.0,"elements":[{"coroutine":false,"defaultValues":{},"position":{"x":-315.0,"y":-150.0},"guid":"2ea79684-6ff6-4bd3-8e93-b829f4465e61","$version":"A","$type":"Unity.VisualScripting.Update","$id":"9"},{"member":{"name":"deltaTime","parameterTypes":null,"targetType":"UnityEngine.Time","targetTypeName":"UnityEngine.Time","$version":"A"},"defaultValues":{},"position":{"x":-147.0,"y":314.0},"guid":"ae06e7c9-fb5c-42b8-bc5c-cb66bc3aa79f","$version":"A","$type":"Unity.VisualScripting.GetMember","$id":"11"},{"defaultValues":{},"position":{"x":149.0,"y":22.0},"guid":"98abb1f3-30cf-4382-8cb1-9adb306b2e58","$version":"A","$type":"Unity.VisualScripting.GenericMultiply","$id":"14"},{"chainable":false,"member":{"name":"Translate","parameterTypes":["UnityEngine.Vector3"],"targetType":"UnityEngine.Transform","targetTypeName":"UnityEngine.Transform","$version":"A"},"defaultValues":{"target":null,"%translation":{"x":0.0,"y":0.0,"z":0.0,"$type":"UnityEngine.Vector3"}},"position":{"x":323.0,"y":-203.0},"guid":"c60e7166-7103-448c-aa7d-98c2fbbc2057","$version":"A","$type":"Unity.VisualScripting.InvokeMember","$id":"16"},{"specifyFallback":false,"kind":"Object","defaultValues":{"name":{"$content":"scaleUnits","$type":"System.String"},"object":null},"position":{"x":-113.0,"y":134.0},"guid":"dd69a6d0-0dc2-46d0-8096-5cf1e73d5a72","$version":"A","$type":"Unity.VisualScripting.GetVariable","$id":"19"},{"specifyFallback":false,"kind":"Object","defaultValues":{"name":{"$content":"axes","$type":"System.String"},"object":null},"position":{"x":-295.0,"y":3.0},"guid":"236a465d-7d7e-4131-b951-66f44d8184bf","$version":"A","$type":"Unity.VisualScripting.GetVariable","$id":"21"},{"chainable":false,"member":{"name":"ClampMagnitude","parameterTypes":["UnityEngine.Vector3","System.Single"],"targetType":"UnityEngine.Vector3","targetTypeName":"UnityEngine.Vector3","$version":"A"},"defaultValues":{"%vector":{"x":0.0,"y":0.0,"z":0.0,"$type":"UnityEngine.Vector3"},"%maxLength":{"$content":1.0,"$type":"System.Single"}},"position":{"x":-103.0,"y":-170.0},"guid":"e9ecf1ed-9140-46cb-a76d-2a54c1e5cfa6","$version":"A","$type":"Unity.VisualScripting.InvokeMember","$id":"23"},{"defaultValues":{"b":{"$content":1.0,"$type":"System.Single"}},"position":{"x":76.0,"y":167.0},"guid":"451b9094-8420-4974-b42c-cccd7fa031cc","$version":"A","$type":"Unity.VisualScripting.ScalarMultiply","$id":"26"},{"sourceUnit":{"$ref":"9"},"sourceKey":"trigger","destinationUnit":{"$ref":"23"},"destinationKey":"enter","guid":"4d9c8a78-0f52-450e-b3e0-1f955e8485c8","$type":"Unity.VisualScripting.ControlConnection"},{"sourceUnit":{"$ref":"23"},"sourceKey":"exit","destinationUnit":{"$ref":"16"},"destinationKey":"enter","guid":"1c15a02f-8053-4cfa-b844-e63d7fef8982","$type":"Unity.VisualScripting.ControlConnection"},{"sourceUnit":{"$ref":"21"},"sourceKey":"value","destinationUnit":{"$ref":"23"},"destinationKey":"%vector","guid":"fc396668-ed1a-4cb1-99d5-28ea5b39a559","$type":"Unity.VisualScripting.ValueConnection"},{"sourceUnit":{"$ref":"19"},"sourceKey":"value","destinationUnit":{"$ref":"26"},"destinationKey":"a","guid":"f216c34c-2b89-4abc-bdb3-d0fa8b2db16d","$type":"Unity.VisualScripting.ValueConnection"},{"sourceUnit":{"$ref":"11"},"sourceKey":"value","destinationUnit":{"$ref":"26"},"destinationKey":"b","guid":"6b86a9e4-a2ff-429b-b639-9501f46d93f2","$type":"Unity.VisualScripting.ValueConnection"},{"sourceUnit":{"$ref":"26"},"sourceKey":"product","destinationUnit":{"$ref":"14"},"destinationKey":"b","guid":"4c26d4ad-f1da-4045-afbd-0f85aa0ce79f","$type":"Unity.VisualScripting.ValueConnection"},{"sourceUnit":{"$ref":"23"},"sourceKey":"result","destinationUnit":{"$ref":"14"},"destinationKey":"a","guid":"54eed920-fc80-4481-8792-f32c428b5d0e","$type":"Unity.VisualScripting.ValueConnection"},{"sourceUnit":{"$ref":"14"},"sourceKey":"product","destinationUnit":{"$ref":"16"},"destinationKey":"%translation","guid":"505a677a-d5be-4d57-afd5-fa9da0cb2033","$type":"Unity.VisualScripting.ValueConnection"}],"$version":"A"}}'
    _objectReferences: []
