%YAML 1.1
%TAG !u! tag:unity3d.com,2011:
--- !u!162 &1
EditorUserSettings:
  m_ObjectHideFlags: 0
  serializedVersion: 4
  m_ConfigSettings:
    RecentlyUsedSceneGuid-0:
      value: 5a5757560101590a5d0c0e24427b5d44434e4c7a7b7a23677f2b4565b7b5353a
      flags: 0
    RecentlyUsedSceneGuid-1:
      value: 5353065704010b0f58565a7b45220d4441151d792f712568292d4c6ab6b6326d
      flags: 0
    RecentlyUsedSceneGuid-2:
      value: 5009040406565d080b5c542144225a44424e1d2f7a7c25607e284963bbb6626e
      flags: 0
    RecentlyUsedScenePath-0:
      value: 22424703114646680e0b0227036c77151a1b176a3b27343c2967083debf42d
      flags: 0
    RecentlyUsedScenePath-1:
      value: 22424703114646680e0b0227036c6c111b07142f1f2b233e2867083debf42d
      flags: 0
    RecentlyUsedScenePath-2:
      value: 22424703114646680e0b0227036c4b0217190b2c233a2b7e38271427fb
      flags: 0
    RecentlyUsedScenePath-3:
      value: 22424703114646680e0b0227036c761e06020c6a3568213539691e3ceff03b36e7e922a7f234362820
      flags: 0
    RecentlyUsedScenePath-4:
      value: 22424703114646680e0b0227036c7c1817051929382d34702e261327f0ef3834e7f578fce9332b25
      flags: 0
    vcSharedLogLevel:
      value: 0d5e400f0650
      flags: 0
  m_VCAutomaticAdd: 1
  m_VCDebugCom: 0
  m_VCDebugCmd: 0
  m_VCDebugOut: 0
  m_SemanticMergeMode: 2
  m_VCShowFailedCheckout: 1
  m_VCOverwriteFailedCheckoutAssets: 1
  m_VCProjectOverlayIcons: 1
  m_VCHierarchyOverlayIcons: 1
  m_VCOtherOverlayIcons: 1
  m_VCAllowAsyncUpdate: 1
