%YAML 1.1
%TAG !u! tag:unity3d.com,2011:
--- !u!114 &11400000
MonoBehaviour:
  m_ObjectHideFlags: 0
  m_CorrespondingSourceObject: {fileID: 0}
  m_PrefabInstance: {fileID: 0}
  m_PrefabAsset: {fileID: 0}
  m_GameObject: {fileID: 0}
  m_Enabled: 1
  m_EditorHideFlags: 0
  m_Script: {fileID: 11500000, guid: 3f1ca63a91b17724bbd99c8fa67e0180, type: 3}
  m_Name: Default Material Palette
  m_EditorClassIdentifier: 
  array:
  - {fileID: 2100000, guid: 0dc9bc8f627d6cc428bbe61bf4ff6028, type: 2}
  - {fileID: 2100000, guid: 8565c4d9c2b2b7e4fbe623e7cdee9013, type: 2}
  - {fileID: 2100000, guid: 3c266e41c02eeb7408a18b973e22fb94, type: 2}
  - {fileID: 2100000, guid: f5810305596f0e247acf57d5c6a7f338, type: 2}
  - {fileID: 2100000, guid: ec83668b5d3f08c4093f40b31777b35e, type: 2}
  - {fileID: 0}
  - {fileID: 0}
  - {fileID: 0}
  - {fileID: 0}
  - {fileID: 0}
