Place,Sex,Event,Equipment,Name,Country,BirthDate,Age,BodyweightKg,Division,WeightClassKg,Squat1Kg,Squat2Kg,Squat3Kg,Best3SquatKg,Squat4Kg,Bench1Kg,Bench2Kg,Bench3Kg,Best3BenchKg,Bench4Kg,Deadlift1Kg,Deadlift2Kg,Deadlift3Kg,Best3DeadliftKg,Deadlift4Kg,TotalKg
1,F,SBD,Wraps,Veronika Ťapková,Slovakia,,19,51.6,Teen,52,110,-120.5,120.5,120.5,-130,40,45,47.5,47.5,,-110,110,120,120,125.5,288
2,F,SBD,Wraps,Nadia Wieszczyk,Poland,,16,50.3,Teen,52,82.5,-90,-95,82.5,,47.5,52.5,-55,52.5,,100,123,125,125,,260
DQ,F,SBD,Wraps,Patrícia Cirnerová,Slovakia,,16,49,Teen,52,-70,-75,80,80,,-35,-40,-40,,,,,,,,
1,F,SBD,Wraps,Lillien Pačová,Slovakia,,17,59.5,Teen,60,120,130,-135,130,,50,55,60.5,60.5,,120,128,-132.5,128,,318.5
DQ,F,SBD,Wraps,Veronika Seres,Slovakia,,19,58.3,Teen,60,-110,-112.5,-115,,,,,,,,,,,,,
1,F,SBD,Wraps,Tereza Porubská,Slovakia,,19,67.4,Teen,67.5,110,-120,-120,110,,40,45,-50,45,,120,130,140,140,,295
2,F,SBD,Wraps,Marie Lipovská,Czechia,,17,63.7,Teen,67.5,90,100,-105,100,,45,52.5,-55,52.5,,105,115,-122.5,115,,267.5
3,F,SBD,Wraps,Viktória Demková,Slovakia,,16,60.3,Teen,67.5,-75,75,-80,75,,32.5,35,-37.5,35,,80,85,-87.5,85,,195
1,F,SBD,Wraps,Diana Štefanidesová,Slovakia,,17,71.7,Teen,82.5,-115,120,-130,120,,52.5,57.5,-62.5,57.5,,120,127.5,135,135,,312.5
2,F,SBD,Wraps,Ela Štecová,Slovakia,,18,73.7,Teen,82.5,110,-120,-120,110,,50,-57.5,,50,,100,110,115,115,,275
1,F,SBD,Wraps,Lívia Liptáková,Slovakia,,19,82.6,Teen,82.5+,-100,100,-102.5,100,,-65,65,-67.5,65,,105,107.5,110,110,115,275
1,F,SBD,Wraps,Laura Tomai,Hungary,,21,51.3,Juniors,52,110,117.5,-120,117.5,,47.5,52.5,-55,52.5,,125,-135,-135,125,,295
1,F,SBD,Wraps,Leoni Heigl,Austria,,20,59.3,Juniors,60,115,120,-125,120,,62.5,67.5,-73,67.5,,117.5,122.5,125,125,,312.5
2,F,SBD,Wraps,Nina Baniarová,Slovakia,,20,56.2,Juniors,60,-110,-110,110,110,,40,45,-50,45,,105,115,-125,115,,270
1,F,SBD,Wraps,Julie Kolářová,Czechia,,23,60.2,Juniors,67.5,90,100,-107.5,100,,40,47.5,-52.5,47.5,,105,110,-120,110,,257.5
1,F,SBD,Wraps,Oksana Onyshchenko,Ukraine,,30,52,Open,52,115,125,132.5,132.5,,50,55,57.5,57.5,,120,130,-140,130,,320
2,F,SBD,Wraps,Radka Tóth,Slovakia,,35,49.8,Open,52,85,-90,90,90,,50,52.5,-55,52.5,,110,115,120,120,,262.5
1,F,SBD,Wraps,Mariya Grigoryan,Armenia,,32,56.8,Open,60,145,155,160,160,,87.5,92.5,-95,92.5,,145,155,160,160,,412.5
2,F,SBD,Wraps,Kristína Zbojan,Slovakia,,24,57.2,Open,60,120,-130,-135,120,,47.5,-50,52.5,52.5,,130,140,-150,140,,312.5
3,F,SBD,Wraps,Anna Šimková,Czechia,,34,59.5,Open,60,80,87.5,95,95,,37.5,42.5,-45,42.5,,107.5,115,120,120,,257.5
1,F,SBD,Wraps,Anna Staszczak,Poland,,24,63.3,Open,67.5,-110,-125,125,125,,55,60,62.5,62.5,,130,142.5,150,150,,337.5
2,F,SBD,Wraps,Šarlota Kaňuková,Slovakia,,28,64.7,Open,67.5,-117.5,125,-132.5,125,,62.5,67.5,,67.5,,125,135,145,145,,337.5
1,F,SBD,Wraps,Dóra Balogh,Hungary,,29,80.5,Open,82.5,-167.5,-175,175,175,,62.5,67.5,70,70,,155,165,-172.5,165,,410
2,F,SBD,Wraps,Mercedes Halbig,Austria,,26,82.4,Open,82.5,130,-150,-155,130,,65,75,-82.5,75,,140,157.5,162.5,162.5,,367.5
3,F,SBD,Wraps,Viktória Schulczová,Slovakia,,24,70.5,Open,82.5,90,100,110,110,,-55,55,57.5,57.5,,90,97.5,105,105,,272.5
1,F,SBD,Wraps,Dominika Uhrová,Czechia,,26,95.9,Open,82.5+,-165,165,180,180,,85,-90,-90,85,,180,190,200,200,,465
1,F,SBD,Wraps,Elrzbieta Pachucy-Sacharzec,Poland,,43,58,M 40-49,60,85,-95,95,95,,45,50,52.5,52.5,,90,100,115,115,,262.5
2,F,SBD,Wraps,Iryna Kriukova,Ukraine,,44,56.2,M 40-49,60,75,82.5,-90,82.5,,35,37.5,40,40,,90,105,-110,105,,227.5
1,F,SBD,Wraps,Nadiia Holynská,Slovakia,,41,67.4,M 40-49,67.5,50,60,70,70,,35,-42.5,42.5,42.5,,80,90,100,100,,212.5
1,F,SBD,Wraps,Monika Lelkes,Slovakia,,49,72.8,M 40-49,82.5,85,90,95,95,,-47.5,-50,50,50,,110,115,125,125,,270
1,F,SBD,Wraps,Andrea Chromčová,Slovakia,,47,82.6,M 40-49,82.5+,115,125,130,130,,75,-80,-80,75,,160,168,173,173,,378
2,F,SBD,Wraps,Claudia Busse,Germany,,45,99.5,M 40-49,82.5+,100,110,-120,110,,80,85,90,90,,140,145,-150,145,,345
1,F,SBD,Wraps,Klaudia Tanczos,Slovakia,,50,75.8,M 50-59,82.5,85,95,100,100,,50,-52.5,-52.5,50,,105,110,115,115,,265
1,F,SBD,Wraps,Katarína Zajková,Slovakia,,62,81,M 60-69,82.5,-135,135,,135,,70,75,80,80,,180,-200,200,200,,415
1,M,SBD,Wraps,Davit Haroyan,Armenia,,19,65.6,Teen,67.5,145,155,165,165,,110,120,125,125,,190,205,212.5,212.5,,502.5
2,M,SBD,Wraps,Samuel Kubík,Slovakia,,18,66.5,Teen,67.5,140,150,155,155,,95,105,107.5,107.5,,190,-210,210,210,,472.5
1,M,SBD,Wraps,Miloš Škvarka,Slovakia,,17,79.8,Teen,82.5,180,-195,195,195,,-112.5,112.5,-122.5,112.5,,245,260,-281,260,,567.5
2,M,SBD,Wraps,Adam Wimmer,Czechia,,19,80.7,Teen,82.5,-155,160,167.5,167.5,,105,110,-115,110,,160,200,217.5,217.5,,495
3,M,SBD,Wraps,Stano Šebesta,Slovakia,,17,81.6,Teen,82.5,160,170,-175,170,,105,112.5,-117.5,112.5,,190,200,205,205,,487.5
4,M,SBD,Wraps,Jozef Suchánek,Slovakia,,17,72.1,Teen,82.5,135,145,-150,145,,95,100,-105,100,,-200,-200,200,200,,445
1,M,SBD,Wraps,Frederik Jendraššák,Slovakia,,18,91.5,Teen,95,240,-250,250,250,,130,145,-150,145,,220,235,245,245,,640
2,M,SBD,Wraps,Tomáš Kovařík,Czechia,,17,92.7,Teen,95,205,-210,210,210,,120,130,-135,130,,-240,240,-250,240,,580
3,M,SBD,Wraps,Erik Dudáš,Slovakia,,18,92.2,Teen,95,-200,215,-230,215,,110,117.5,-125,117.5,,220,240,-260,240,,572.5
4,M,SBD,Wraps,Benjámin Farkas,Hungary,,18,87.2,Teen,95,180,192.5,-200,192.5,,100,110,115,115,,190,202.5,210,210,,517.5
DQ,M,SBD,Wraps,Kornél Nagy,Hungary,,16,91.5,Teen,95,-162.5,-162.5,-162.5,,,,,,,,,,,,,
DQ,M,SBD,Wraps,Timotej Hlina,Slovakia,,17,94,Teen,95,-170,-190,-190,,,,,,,,,,,,,
1,M,SBD,Wraps,Samuel Kaszás,Slovakia,,16,107.9,Teen,110,250,-260,-260,250,,135,-142.5,142.5,142.5,,230,240,-245,240,,632.5
2,M,SBD,Wraps,Dávid Košč,Slovakia,,18,108.1,Teen,110,200,210,215,215,,150,-160,-160,150,,250,255,260,260,,625
3,M,SBD,Wraps,Zsolt Viktór Szabó,Hungary,,17,108.5,Teen,110,-182.5,202.5,207.5,207.5,,130,140,-145,140,,200,210,-220,210,,557.5
4,M,SBD,Wraps,Imre Ladyka,Ukraine,,17,95.1,Teen,110,160,170,-180,170,,120,130,-137.5,130,,220,-225,225,225,,525
1,M,SBD,Wraps,Andrej Adámek,Slovakia,,22,67.1,Juniors,67.5,145,155,-160,155,,82.5,95,-100,95,,145,155,165,165,,415
1,M,SBD,Wraps,Andrej Nika,Slovakia,,20,82.3,Juniors,82.5,225,-240,245,245,,135,142.5,-147.5,142.5,,260,280,-290.5,280,,667.5
2,M,SBD,Wraps,Miroslav Sobota,Slovakia,,22,77,Juniors,82.5,210,220,225,225,,140,-150,-150,140,,190,205,215,215,,580
3,M,SBD,Wraps,Nikolaj Lapihuska,Slovakia,,22,82,Juniors,82.5,180,190,,190,,120,-130,130,130,,220,230,-240,230,,550
4,M,SBD,Wraps,Erik Borovička,Slovakia,,20,76.4,Juniors,82.5,180,190,-200,190,,115,122.5,-127.5,122.5,,215,-225,,215,,527.5
5,M,SBD,Wraps,Radovan Druska,Slovakia,,22,76.6,Juniors,82.5,-165,170,180,180,,85,-95,-95,85,,215,-230,230,230,,495
1,M,SBD,Wraps,Marek Červenka,Slovakia,,23,91.8,Juniors,95,230,250,-265,250,,130,140,-145,140,,-230,250,260,260,,650
2,M,SBD,Wraps,František Plášil,Czechia,,22,93.7,Juniors,95,217.5,232.5,242.5,242.5,,125,-132.5,-132.5,125,,237.5,257.5,-270,257.5,,625
3,M,SBD,Wraps,Tomáš Burian,Czechia,,23,93.9,Juniors,95,202.5,212.5,-222.5,212.5,,120,127.5,-135,127.5,,245,255,267.5,267.5,,607.5
4,M,SBD,Wraps,Alex Horacsek,Slovakia,,22,92.8,Juniors,95,-210,-210,210,210,,150,-160,-160,150,,220,240,-250,240,,600
5,M,SBD,Wraps,Jan Wirth,Czechia,,22,94.6,Juniors,95,200,215,-220,215,,120,127.5,-132.5,127.5,,242.5,257.5,-270,257.5,,600
6,M,SBD,Wraps,Ivan Bozhilov,Bulgaria,,22,93.4,Juniors,95,180,200,-210,200,,140,147.5,150,150,,190,210,220,220,,570
7,M,SBD,Wraps,Ondrej Michalovič,Slovakia,,23,88.6,Juniors,95,180,190,-200,190,,110,115,120,120,,205,215,225,225,,535
8,M,SBD,Wraps,Jaroslav Dvořák,Czechia,,21,92.6,Juniors,95,160,170,-177.5,170,,92.5,-100,-100,92.5,,155,170,-190,170,,432.5
9,M,SBD,Wraps,Maximilián Belica,Slovakia,,20,89.6,Juniors,95,140,150,157.5,157.5,,87.5,92.5,95,95,,155,165,-170,165,,417.5
1,M,SBD,Wraps,Daniel Gaura,Czechia,,21,109.9,Juniors,110,230,245,260,260,,145,155,-170,155,,280,315,-330,315,,730
2,M,SBD,Wraps,László Baji,Hungary,,22,106.8,Juniors,110,230,245,255,255,,130,145,-152.5,145,,250,260,-270,260,,660
3,M,SBD,Wraps,Tomáš Kadlečík,Slovakia,,22,109,Juniors,110,230,-250,-265,230,,-140,150,160,160,,270,-295,-295,270,,660
1,M,SBD,Wraps,Michal Lapihuska,Slovakia,,21,130.8,Juniors,125+,240,255,265,265,,170,180,-185,180,,270,290,300,300,,745
1,M,SBD,Wraps,Richárd György Vezér,Hungary,,27,61.5,Open,67.5,155,162.5,170,170,,115,120,-125,120,,185,200,-202.5,200,,490
DQ,M,SBD,Wraps,Viktor Nagy,Slovakia,,26,63,Open,67.5,-150,-160,-160,,,,,,,,,,,,,
1,M,SBD,Wraps,Denis Kovačík,Czechia,,27,79.3,Open,82.5,220,235,245,245,,150,160,165,165,,280,-290,295,295,,705
2,M,SBD,Wraps,Patrik Kovačík,Czechia,,24,82,Open,82.5,-220,220,230,230,,100,110,115,115,,260,270,280,280,,625
3,M,SBD,Wraps,Lukáš Tlstý,Slovakia,,31,82.1,Open,82.5,-180,180,-195,180,,115,120,-125,120,,270,285,-292.5,285,,585
DQ,M,SBD,Wraps,Marek Kéri,Slovakia,,31,82.3,Open,82.5,-230,-237.5,-237.5,,,,,,,,,,,,,
1,M,SBD,Wraps,Zdenko Bystrianský,Slovakia,,35,82.9,Open,95,285,-295,-295,285,,160,170,-175,170,,270,-280,280,280,,735
2,M,SBD,Wraps,Patrik Peciar,Slovakia,,38,92.7,Open,95,255,270,-280,270,,155,165,-170,165,,270,290,300,300,,735
3,M,SBD,Wraps,Bence Nagy,Slovakia,,29,93.9,Open,95,235,-255,-255,235,,165,175,182.5,182.5,,240,255,262.5,262.5,,680
4,M,SBD,Wraps,Juraj Barnet,Czechia,,43,84.4,Open,95,210,220,-227.5,220,,160,-170,170,170,,250,260,-270,260,,650
5,M,SBD,Wraps,David Trčka,Czechia,,28,94.4,Open,95,232.5,-247.5,-247.5,232.5,,120,127.5,-130,127.5,,255,275,,275,,635
6,M,SBD,Wraps,Ivan Ravza,Serbia,,25,93.8,Open,95,220,240,250,250,,130,137.5,-145,137.5,,230,245,-250,245,,632.5
7,M,SBD,Wraps,Martin Tesař,Czechia,,25,92.5,Open,95,210,230,-240,230,,130,-140,140,140,,240,260,-265,260,,630
8,M,SBD,Wraps,Filip Daněk,Czechia,,25,92.6,Open,95,220,235,-240,235,,145,-155,155,155,,235,-245,-245,235,,625
9,M,SBD,Wraps,Ondřej Fialka,Czechia,,29,91.2,Open,95,192.5,205,217.5,217.5,,132.5,142.5,-150,142.5,,205,-225,-225,205,,565
10,M,SBD,Wraps,Dominik Fišer,Czechia,,27,94.1,Open,95,195,-205,205,205,,120,125,-130,125,,220,-230,-230,220,,550
DQ,M,SBD,Wraps,Ivan Dávid,Slovakia,,28,93.3,Open,95,-230,230,-240,230,,-150,-150,-150,,,,,,,,
1,M,SBD,Wraps,Milán Apaceller,Hungary,,30,99.2,Open,110,292.5,312.5,-325,312.5,,185,195,197.5,197.5,,290,307.5,-322.5,307.5,,817.5
2,M,SBD,Wraps,Kollár Csaba,Hungary,,26,107,Open,110,275,282.5,290,290,,185,195,-200,195,,-305,315,325,325,,810
3,M,SBD,Wraps,Juraj Kačmárik,Slovakia,,39,108.2,Open,110,-280,-280,280,280,,175,185,,185,,325,345,-355.5,345,,810
4,M,SBD,Wraps,Vladyslav Moshenskyi,Czechia,,26,107.1,Open,110,-242.5,262.5,-272.5,262.5,,172.5,185,-190,185,,280,300,305,305,,752.5
5,M,SBD,Wraps,Roman Salbrechter,Austria,,35,105,Open,110,260,280,285,285,,165,170,172.5,172.5,,270,-285,-285,270,,727.5
1,M,SBD,Wraps,Rafał Ziewiecki,Poland,,37,120.7,Open,125,-280,280,-300,280,,170,177.5,182.5,182.5,,-320,-320,320,320,,782.5
2,M,SBD,Wraps,Tomáš Tóth,Slovakia,,33,119.8,Open,125,170,200,220,220,,170,180,-190,180,,250,270,-320,270,,670
3,M,SBD,Wraps,Dávid Bakos,Hungary,,36,110.8,Open,125,-205,205,222.5,222.5,,-180,180,-192.5,180,,225,-235,235,235,,637.5
1,M,SBD,Wraps,Martin Šarman,Czechia,,28,150.4,Open,125+,-240,250,265,265,,140,150,155,155,,220,232.5,240,240,,660
2,M,SBD,Wraps,Adrián Drábik,Slovakia,,29,132.4,Open,125+,-190,200,215,215,,125,-130,-130,125,,190,210,-215,210,,550
1,M,SBD,Wraps,Michal Móry,Slovakia,,45,67.4,M 40-49,67.5,-165,165,180.5,180.5,-200.5,105,110,115,115,,193,205,217.5,217.5,-231,513
1,M,SBD,Wraps,Petr Gažko,Czechia,,42,81.1,M 40-49,82.5,240,-250,250,250,,175,180,185,185,,230,240,-250,240,,675
1,M,SBD,Wraps,Peter Razenböck,Austria,,41,93.4,M 40-49,95,205,220,222.5,222.5,,135,145,-152.5,145,,-290,290,-305,290,,657.5
1,M,SBD,Wraps,Antal Tábor,Hungary,,45,103.5,M 40-49,110,230,240,-250,240,,160,170,175,175,,240,260,-280,260,,675
2,M,SBD,Wraps,Marcel Baláž,Slovakia,,46,107.6,M 40-49,110,-180,-180,180,180,,180,190,-192.5,190,,170,180,190,190,,560
1,M,SBD,Wraps,Matthias Hörning,Germany,,49,118.7,M 40-49,125,200,-215,-215,200,,167.5,-172.5,-172.5,167.5,,230,240,-245,240,,607.5
1,M,SBD,Wraps,Tibor Pukáč,Slovakia,,53,105.4,M 50-59,110,245,260,-270,260,,170,175,177.5,177.5,,235,245,-255,245,,682.5
2,M,SBD,Wraps,Oleksandr Molodov,Ukraine,,52,109.6,M 50-59,110,230,247.5,257.5,257.5,,135,-145,145,145,,250,270,-287.5,270,,672.5
3,M,SBD,Wraps,Dominik Grajciar,Slovakia,,52,105.8,M 50-59,110,90,-100,100,100,,90,-100,-100,90,,100,120,130,130,,320
1,M,SBD,Wraps,Gagik Tonoyan,Armenia,,58,114.2,M 50-59,125,245,255,262.5,262.5,,105,115,122.5,122.5,,255,267.5,280,280,,665
2,M,SBD,Wraps,Ľubomír Majstrák,Slovakia,,50,113.4,M 50-59,125,110,125,140,140,,50,60,70,70,,110,125,140,140,,350
1,M,SBD,Wraps,Bernd Beyer,Germany,,56,127.5,M 50-59,125+,130,140,-150,140,,90,95,100,100,,130,140,150,150,,390
DQ,M,SBD,Wraps,Tibor Zvada,Slovakia,,66,81.7,M 60-69,82.5,-100,-100,-100,,,,,,,,,,,,,
1,M,SBD,Wraps,Paolo Stefanelli,Italy,,64,91.6,M 60-69,95,-150,150,155,155,,80,85,90,90,,165,175,-180,175,,420
1,M,SBD,Wraps,Jaroslav Šolc,Slovakia,,67,108.8,M 60-69,110,200,210,220,220,,160,170,175,175,,200,210,215,215,,610
2,M,SBD,Wraps,Jiří Barnet,Czechia,,63,100,M 60-69,110,160,180,-210,180,,105,115,-125,115,,-190,190,-210,190,,485
1,M,SBD,Wraps,František Makranský,Slovakia,,62,112.3,M 60-69,125,-210,210,-230,210,,150,160,-171,160,,210,-230,,210,,580
1,M,SBD,Wraps,Jozef Meravý,Slovakia,,74,96.7,M 70-74,110,80,-100,-100,80,,70,80,,80,,100,120,-140,120,,280
1,M,SBD,Wraps,Jozef Bartek,Slovakia,,79,72.7,M 75+,82.5,40,-60,-60,40,,-50,55,-60,55,,50,70,80,80,,175
1,F,SBD,Unlimited,Andrea Thurner,Austria,,58,73.4,M 50-59,82.5,150,-160,160,160,,85,93.5,100,100,,-171,171,180,180,,440
DQ,M,SBD,Unlimited,Oliver Krajčovič,Slovakia,,22,125.4,Juniors,125+,100,,,100,,-195,-195,-195,,,,,,,,
1,M,SBD,Unlimited,Ľubomír Samseli,Slovakia,,37,81.2,Open,82.5,-200,-200,200,200,,160,170,-175,170,,220,240,-250,240,,610
1,M,SBD,Unlimited,Sargis Stamboltsyan,Armenia,,29,93.7,Open,95,230,240,260,260,,140,155,-160,155,,220,240,-250,240,,655
1,M,SBD,Unlimited,Adam Sobek,Slovakia,,28,117.8,Open,125,285,-300,-300,285,,215,225,-230,225,,275,302.5,,302.5,,812.5
1,M,SBD,Unlimited,Anton Frič,Slovakia,,51,82,M 50-59,82.5,-250,250,270,270,,180,190,-200,190,,240,-255,-255,240,,700
1,M,SBD,Unlimited,Ivan Levický,Slovakia,,54,104.6,M 50-59,110,200,220,230,230,,150,-160,,150,,285,295,300.5,300.5,,680.5
DQ,M,SBD,Unlimited,Michal Červinka,Slovakia,,64,86.9,M 60-69,95,-170,-170,-170,,,,,,,,,,,,,
1,F,B,Raw,Anita Tímea Szűcs,Hungary,,17,49.3,Teen,52,,,,,,55,60,62.5,62.5,,,,,,,62.5
2,F,B,Raw,Brigitta Rékási,Hungary,,18,51.4,Teen,52,,,,,,55,57.5,-62.5,57.5,,,,,,,57.5
1,F,B,Raw,Lea Pukáčová,Slovakia,,18,59.9,Teen,60,,,,,,40,-42.5,-42.5,40,,,,,,,40
1,F,B,Raw,Lívia Liptáková,Slovakia,,19,82.9,Teen,82.5+,,,,,,62.5,-65,-65,62.5,,,,,,,62.5
1,F,B,Raw,Hannah Penndorf,Germany,,20,71.1,Juniors,82.5,,,,,,50,60,-65,60,,,,,,,60
1,F,B,Raw,Diana Balážová,Slovakia,,21,98.4,Juniors,82.5+,,,,,,42.5,47.5,-55,47.5,,,,,,,47.5
1,F,B,Raw,Jana Müller,Germany,,38,60,Open,60,,,,,,75,80,82.5,82.5,,,,,,,82.5
2,F,B,Raw,Ilona Egri,Hungary,,51,59.9,Open,60,,,,,,55,57.5,-60,57.5,,,,,,,57.5
3,F,B,Raw,Iryna Kovalova,Ukraine,,36,57.3,Open,60,,,,,,47.5,-50,-50,47.5,,,,,,,47.5
1,F,B,Raw,Romana Štefániková,Slovakia,,40,63.7,Open,67.5,,,,,,65,-70,,65,,,,,,,65
1,F,B,Raw,Tatiana Magulová,Slovakia,,42,74.1,Open,82.5,,,,,,90,95,-97.5,95,,,,,,,95
2,F,B,Raw,Nadine Noack,Germany,,38,81.3,Open,82.5,,,,,,95,-105,-105,95,,,,,,,95
3,F,B,Raw,Viktória Shulczová,Slovakia,,24,70,Open,82.5,,,,,,55,-60,60,60,,,,,,,60
1,F,B,Raw,Claudia Busse,Germany,,45,100.1,Open,82.5+,,,,,,85,90,95,95,,,,,,,95
2,F,B,Raw,Zuzana Marcinkó,Slovakia,,34,110.1,Open,82.5+,,,,,,65,70,-77.5,70,,,,,,,70
1,F,B,Raw,Erika Rékásiné Gőz,Hungary,,48,55.6,M 40-49,60,,,,,,57.5,60,62.5,62.5,,,,,,,62.5
1,F,B,Raw,Romana Štefániková,Slovakia,,40,63.7,M 40-49,67.5,,,,,,65,-72.5,-72.5,65,,,,,,,65
1,F,B,Raw,Tatiana Magulová,Slovakia,,42,74.1,M 40-49,82.5,,,,,,90,95,,95,,,,,,,95
1,F,B,Raw,Claudia Busse,Germany,,45,100.1,M 40-49,82.5+,,,,,,90,-95,95,95,,,,,,,95
1,F,B,Raw,Moonika Aus,Estonia,,53,51.9,M 50-59,52,,,,,,47.5,52.5,-54,52.5,,,,,,,52.5
1,F,B,Raw,Ilona Egri,Hungary,,51,59.9,M 50-59,60,,,,,,55,57.5,,57.5,,,,,,,57.5
1,F,B,Raw,Mónika Bazsó,Hungary,,50,79.9,M 50-59,82.5,,,,,,112.5,122.5,-127.5,122.5,,,,,,,122.5
1,M,B,Raw,Mateusz Jażdżewski,Poland,,17,64.7,Teen,67.5,,,,,,70,80,85,85,,,,,,,85
1,M,B,Raw,Áron Baráth,Hungary,,18,75.3,Teen,82.5,,,,,,150,157.5,160,160,,,,,,,160
2,M,B,Raw,Kacper Pieniak,Poland,,16,80.7,Teen,82.5,,,,,,120,125,-130,125,,,,,,,125
3,M,B,Raw,Gabriel Bošňák,Slovakia,,18,77.2,Teen,82.5,,,,,,115,120,-125,120,,,,,,,120
4,M,B,Raw,Adam Duda,Poland,,18,82.1,Teen,82.5,,,,,,115,-120,-120,115,,,,,,,115
1,M,B,Raw,Michal Hucík,Slovakia,,19,86.1,Teen,95,,,,,,135,145,150,150,,,,,,,150
2,M,B,Raw,Dávid Bučok,Slovakia,,18,84.6,Teen,95,,,,,,130,140,-145,140,,,,,,,140
3,M,B,Raw,Osman Kovalov,Ukraine,,16,86.4,Teen,95,,,,,,125,127.5,-130,127.5,,,,,,,127.5
4,M,B,Raw,Dániel Sándor,Hungary,,17,84.1,Teen,95,,,,,,112.5,120,122.5,122.5,,,,,,,122.5
1,M,B,Raw,Štefan Rácz,Slovakia,,20,62.1,Juniors,67.5,,,,,,112.5,122.5,125,125,,,,,,,125
1,M,B,Raw,Radovan Čech,Slovakia,,23,78.4,Juniors,82.5,,,,,,140,150,155,155,,,,,,,155
2,M,B,Raw,Radoslav Krajčovič,Slovakia,,20,73.1,Juniors,82.5,,,,,,105,107.5,-110,107.5,,,,,,,107.5
DQ,M,B,Raw,Anton Friedl,Slovakia,,23,74,Juniors,82.5,,,,,,,,,,,,,,,,
1,M,B,Raw,Alex Horacsek,Slovakia,,22,92.5,Juniors,95,,,,,,140,150,-160,150,,,,,,,150
1,M,B,Raw,István Szalai,Hungary,,23,96.8,Juniors,110,,,,,,160,170,175,175,,,,,,,175
2,M,B,Raw,Tomáš Obrlík,Czechia,,22,107.7,Juniors,110,,,,,,150,160,-165,160,,,,,,,160
1,M,B,Raw,Ramón Szeifert,Slovakia,,23,142.2,Juniors,125+,,,,,,180,195,200,200,,,,,,,200
1,M,B,Raw,Benjámin Áder,Hungary,,25,67.1,Open,67.5,,,,,,150,-155,157.5,157.5,,,,,,,157.5
1,M,B,Raw,Tomáš Ryšavý,Slovakia,,33,81.3,Open,82.5,,,,,,180,190,195,195,,,,,,,195
2,M,B,Raw,Filip Stanko,Slovakia,,34,81.7,Open,82.5,,,,,,190,-195,,190,,,,,,,190
3,M,B,Raw,Ondrej Oláh,Slovakia,,33,71.8,Open,82.5,,,,,,157.5,162.5,165,165,,,,,,,165
4,M,B,Raw,Michal Kozma,Slovakia,,32,78.3,Open,82.5,,,,,,157.5,162.5,165,165,,,,,,,165
5,M,B,Raw,Ľubomír Mikuš,Slovakia,,39,73.5,Open,82.5,,,,,,-105,110,112.5,112.5,,,,,,,112.5
6,M,B,Raw,Ján Hruška,Slovakia,,35,71.9,Open,82.5,,,,,,102.5,105,,105,,,,,,,105
1,M,B,Raw,Móricz Benjamin,Hungary,,28,92.3,Open,95,,,,,,210,220,230.5,230.5,-235,,,,,,230.5
2,M,B,Raw,Janeš Velibor,Croatia,,38,94.7,Open,95,,,,,,185,192.5,-197.5,192.5,,,,,,,192.5
3,M,B,Raw,Július Mertvík,Slovakia,,27,94.3,Open,95,,,,,,190,-200,,190,,,,,,,190
4,M,B,Raw,Gracjan Hnatów,Poland,,31,92.6,Open,95,,,,,,-170,182.5,-190,182.5,,,,,,,182.5
5,M,B,Raw,Kamil Babiš,Czechia,,32,94.3,Open,95,,,,,,180,-185,-185,180,,,,,,,180
6,M,B,Raw,Peter Klukavý,Slovakia,,30,94.5,Open,95,,,,,,160,170,175,175,,,,,,,175
7,M,B,Raw,Péter Kolompár,Slovakia,,25,92.8,Open,95,,,,,,145,152.5,-155,152.5,,,,,,,152.5
1,M,B,Raw,Lukáš Škorík,Slovakia,,35,108.1,Open,110,,,,,,217.5,227.5,230,230,,,,,,,230
2,M,B,Raw,Ákos Oláh,Hungary,,35,103,Open,110,,,,,,205,215,220,220,,,,,,,220
3,M,B,Raw,Hubert Przybyłek,Poland,,30,107.8,Open,110,,,,,,190,200,-202.5,200,,,,,,,200
4,M,B,Raw,Juraj Korman,Slovakia,,28,109.4,Open,110,,,,,,190,200,-205,200,,,,,,,200
5,M,B,Raw,Sergii Kovalov,Ukraine,,35,104.5,Open,110,,,,,,185,190,-192.5,190,,,,,,,190
6,M,B,Raw,Matthew Brown,UK,,38,97.6,Open,110,,,,,,150,160,-170,160,,,,,,,160
7,M,B,Raw,Dawid Przybyłek,Poland,,35,106.9,Open,110,,,,,,150,-155,-155,150,,,,,,,150
1,M,B,Raw,Stanislav Močkor,Slovakia,,27,116.3,Open,125,,,,,,215,222.5,-227.5,222.5,,,,,,,222.5
2,M,B,Raw,Mirko Welke,Germany,,35,115.2,Open,125,,,,,,210,-220,-225,210,,,,,,,210
3,M,B,Raw,Matthias Hörning,Germany,,49,118.9,Open,125,,,,,,165,-170,-170,165,,,,,,,165
1,M,B,Raw,Patrík Korčok,Slovakia,,27,182,Open,125+,,,,,,210,220,232.5,232.5,,,,,,,232.5
2,M,B,Raw,Adam Kekelák,Slovakia,,29,140.2,Open,125+,,,,,,170,180,185,185,,,,,,,185
3,M,B,Raw,Robert Kiss,Slovakia,,36,142.7,Open,125+,,,,,,160,170,175,175,,,,,,,175
4,M,B,Raw,Krisztián Piroska,Slovakia,,25,150.3,Open,125+,,,,,,165,175,-185,175,,,,,,,175
1,M,B,Raw,István Répás,Hungary,,47,66.4,M 40-49,67.5,,,,,,137.5,145,147.5,147.5,,,,,,,147.5
1,M,B,Raw,Péter Barkó,Hungary,,49,80.2,M 40-49,82.5,,,,,,150,-155,157.5,157.5,,,,,,,157.5
2,M,B,Raw,Vladimír Kúdelka,Slovakia,,43,79.5,M 40-49,82.5,,,,,,145,152.5,155,155,,,,,,,155
3,M,B,Raw,Radosław Jażdżewski,Poland,,49,77.7,M 40-49,82.5,,,,,,110,120,-125,120,,,,,,,120
1,M,B,Raw,Jozef Kišš,Slovakia,,48,92.5,M 40-49,95,,,,,,190,195,-200,195,,,,,,,195
2,M,B,Raw,László Németh,Hungary,,44,94.8,M 40-49,95,,,,,,190,192.5,-200,192.5,,,,,,,192.5
3,M,B,Raw,Ladislav Mikovčík,Slovakia,,43,91.6,M 40-49,95,,,,,,175,185,190,190,,,,,,,190
4,M,B,Raw,Štefan Sokoly,Slovakia,,48,91.7,M 40-49,95,,,,,,170,182.5,-192.5,182.5,,,,,,,182.5
DQ,M,B,Raw,István Szeifert,Hungary,,47,92.5,M 40-49,95,,,,,,-180,-190,-192.5,,,,,,,,
1,M,B,Raw,Marcel Marossow,Germany,,47,104.7,M 40-49,110,,,,,,192.5,200,207.5,207.5,,,,,,,207.5
2,M,B,Raw,Denys Kovalov,Ukraine,,45,100.7,M 40-49,110,,,,,,195,200,-207.5,200,,,,,,,200
3,M,B,Raw,Sándor Vaszilkó,Hungary,,42,107.1,M 40-49,110,,,,,,180,190,192.5,192.5,,,,,,,192.5
4,M,B,Raw,Marcel Baláž,Slovakia,,46,107.3,M 40-49,110,,,,,,180,190,-192.5,190,,,,,,,190
5,M,B,Raw,Peter Ševčík,Slovakia,,45,107.7,M 40-49,110,,,,,,182.5,187.5,-195,187.5,,,,,,,187.5
1,M,B,Raw,Štefan Červenák,Slovakia,,40,116.3,M 40-49,125,,,,,,-180,192.5,205,205,,,,,,,205
2,M,B,Raw,Ondrej Hudák,Slovakia,,49,121.3,M 40-49,125,,,,,,190,200,205,205,,,,,,,205
3,M,B,Raw,Roman Werner,Austria,,45,123,M 40-49,125,,,,,,190,200,-205,200,,,,,,,200
4,M,B,Raw,Paweł Fus,Poland,,46,115.2,M 40-49,125,,,,,,167.5,-175,175,175,,,,,,,175
5,M,B,Raw,Matthias Hörning,Germany,,49,118.9,M 40-49,125,,,,,,165,170,-172.5,170,,,,,,,170
6,M,B,Raw,Štefan Nagy,Slovakia,,42,112.7,M 40-49,125,,,,,,165,-170,-170,165,,,,,,,165
7,M,B,Raw,Michal Čorba,Slovakia,,44,118.1,M 40-49,125,,,,,,160,-165,,160,,,,,,,160
8,M,B,Raw,Jozef Minár,Slovakia,,47,122.9,M 40-49,125,,,,,,-155,155,-162.5,155,,,,,,,155
1,M,B,Raw,Imrich Vörös,Slovakia,,40,173.4,M 40-49,125+,,,,,,220,230,-247.5,230,,,,,,,230
2,M,B,Raw,Sándor Vörös,Slovakia,,49,140.8,M 40-49,125+,,,,,,195,210,220,220,,,,,,,220
3,M,B,Raw,Pavol Ivan,Slovakia,,41,127.3,M 40-49,125+,,,,,,205,-212.5,-212.5,205,,,,,,,205
4,M,B,Raw,Marcin Czaja,Poland,,48,137.8,M 40-49,125+,,,,,,175,180,185,185,,,,,,,185
5,M,B,Raw,Peter Pletka,Slovakia,,48,128,M 40-49,125+,,,,,,130,140,142.5,142.5,,,,,,,142.5
1,M,B,Raw,Mirko Jaedtke-Schulze,Germany,,57,67.2,M 50-59,67.5,,,,,,105,110,112.5,112.5,,,,,,,112.5
1,M,B,Raw,Zsolt Karlik,Hungary,,52,74.7,M 50-59,82.5,,,,,,145,155,157.5,157.5,,,,,,,157.5
2,M,B,Raw,Vincent Karička,Slovakia,,56,74.2,M 50-59,82.5,,,,,,110,125,-130,125,,,,,,,125
3,M,B,Raw,Mike Künzling,Germany,,59,79.8,M 50-59,82.5,,,,,,120,-130,-130,120,,,,,,,120
1,M,B,Raw,František Sajko,Slovakia,,53,93.8,M 50-59,95,,,,,,150,160,165,165,,,,,,,165
2,M,B,Raw,Zsolt Kotrócz,Hungary,,57,88.2,M 50-59,95,,,,,,140,150,-152.5,150,,,,,,,150
3,M,B,Raw,György Wimmer,Hungary,,55,94.2,M 50-59,95,,,,,,-130,-140,140,140,,,,,,,140
1,M,B,Raw,József Tóth,Hungary,,50,97.8,M 50-59,110,,,,,,190,200,-202.5,200,,,,,,,200
2,M,B,Raw,Tibor Pukáč,Slovakia,,53,106.7,M 50-59,110,,,,,,170,-180,-180,170,,,,,,,170
3,M,B,Raw,Roman Vida,Slovakia,,54,101.5,M 50-59,110,,,,,,130,140,-150,140,,,,,,,140
1,M,B,Raw,Adam Eikman,Poland,,52,124,M 50-59,125,,,,,,200,207.5,212.5,212.5,,,,,,,212.5
2,M,B,Raw,Günther Hold,Austria,,57,112.4,M 50-59,125,,,,,,205,210,-212.5,210,,,,,,,210
3,M,B,Raw,Biró Csaba,Hungary,,52,116.2,M 50-59,125,,,,,,140,155,-165,155,,,,,,,155
1,M,B,Raw,Rémy Krayzel,Czechia,,68,79.9,M 60-69,82.5,,,,,,160,165,170,170,,,,,,,170
1,M,B,Raw,István Ágoston,Hungary,,62,90.9,M 60-69,95,,,,,,145,150,155,155,,,,,,,155
2,M,B,Raw,René Hohbom,Germany,,62,93.7,M 60-69,95,,,,,,135,145,-152.5,145,,,,,,,145
1,M,B,Raw,Július Vrbiniak,Slovakia,,67,109.1,M 60-69,110,,,,,,150,155,160,160,,,,,,,160
2,M,B,Raw,Vincent Kondákor,Slovakia,,60,99.1,M 60-69,110,,,,,,140,-150,155,155,,,,,,,155
3,M,B,Raw,Imre Nagy,Hungary,,61,106.7,M 60-69,110,,,,,,-125,130,137.5,137.5,,,,,,,137.5
4,M,B,Raw,Peter Klimo,Slovakia,,63,106.7,M 60-69,110,,,,,,110,125,-132.5,125,,,,,,,125
1,M,B,Raw,Jaroslav Šolc,Slovakia,,67,110.9,M 60-69,125,,,,,,165,170,-177.5,170,,,,,,,170
2,M,B,Raw,Jozef Belica,Slovakia,,67,110.8,M 60-69,125,,,,,,-135,135,-145,135,,,,,,,135
1,M,B,Raw,Gerd Müller,Germany,,71,80,M 70-74,82.5,,,,,,100,110,115,115,,,,,,,115
1,M,B,Raw,Jozef Meravý,Slovakia,,74,96.6,M 70-74,110,,,,,,70,-80,-80,70,,,,,,,70
2,M,B,Raw,Ján Slovík,Slovakia,,73,98.7,M 70-74,110,,,,,,50,55,60,60,,,,,,,60
1,M,B,Raw,Erwin Trichlin,Austria,,85,65.2,M 75+,67.5,,,,,,70,77.5,82.5,82.5,,,,,,,82.5
1,M,B,Raw,Jozef Bartek,Slovakia,,79,73.2,M 75+,82.5,,,,,,50,55,-60,55,,,,,,,55
1,M,B,Raw,Michal Juriš,Slovakia,,75,101.5,M 75+,110,,,,,,65,70,-75,70,,,,,,,70
1,M,B,Multi-ply,Milan Vojačik,Slovakia,,23,65.6,Juniors,67.5,,,,,,-120,120,-140,120,,,,,,,120
1,M,B,Multi-ply,Petr Skřinář,Czechia,,29,82.1,Open,82.5,,,,,,180,190,205,205,,,,,,,205
2,M,B,Multi-ply,Ľubomír Samseli,Slovakia,,37,81.9,Open,82.5,,,,,,170,180,-185,180,,,,,,,180
2,M,B,Multi-ply,František Szobolovszký,Slovakia,,29,92.7,Open,95,,,,,,-170,170,-180,170,,,,,,,170
DQ,M,B,Multi-ply,Károly Szuder,Hungary,,37,91.2,Open,95,,,,,,-200,-200,-210,,,,,,,,
1,M,B,Multi-ply,Dávid Bendík,Slovakia,,32,109.1,Open,110,,,,,,270,-300,-300,270,,,,,,,270
1,M,B,Multi-ply,Martin Krajčí,Slovakia,,36,120.4,Open,125,,,,,,250,265,-270,265,,,,,,,265
1,M,B,Multi-ply,Mamikon Kostanyan,Armenia,,40,91.4,M 40-49,95,,,,,,140,155,180,180,,,,,,,180
2,M,B,Multi-ply,Marcel Vasilenko,Slovakia,,45,93.1,M 40-49,95,,,,,,170,180,-190,180,,,,,,,180
1,M,B,Multi-ply,Andrej Smutný,Slovakia,,46,103.4,M 40-49,110,,,,,,240,-250,-250,240,,,,,,,240
DQ,M,B,Multi-ply,Pavol Roba,Slovakia,,40,108.6,M 40-49,110,,,,,,-180,-180,-190,,,,,,,,
1,M,B,Multi-ply,Michael Pischinger,Austria,,46,122.9,M 40-49,125,,,,,,-250,250,-270,250,,,,,,,250
1,M,B,Multi-ply,Franz Gansinger,Austria,,56,107.3,M 50-59,110,,,,,,160,167.5,175,175,,,,,,,175
1,M,B,Multi-ply,Günther Hold,Austria,,57,114.1,M 50-59,125,,,,,,-240,240,-250,240,,,,,,,240
1,M,B,Multi-ply,Molnár Csaba,Hungary,,59,134.5,M 50-59,125+,,,,,,200,,,200,,,,,,,200
1,M,B,Multi-ply,Franciszek Szabluk,Poland,,67,102,M 60-69,110,,,,,,200,210,220,220,,,,,,,220
1,M,B,Multi-ply,Boris Švirec,Slovakia,,60,114.7,M 60-69,125,,,,,,140,150,-155,150,,,,,,,150
1,M,B,Multi-ply,Erwin Trichlin,Austria,,85,65.9,M 75+,67.5,,,,,,-80,80,87.5,87.5,,,,,,,87.5
1,M,B,Unlimited,Gracjan Hnatów,Poland,,31,93.2,Open,95,,,,,,280,-330,-340,280,,,,,,,280
1,M,B,Unlimited,Szakál Levente,Hungary,,35,109.2,Open,110,,,,,,-300,300,-305,300,,,,,,,300
DQ,M,B,Unlimited,Bíró Lajos,Hungary,,28,150.2,Open,125+,,,,,,-400,-400,-400,,,,,,,,
1,M,B,Unlimited,Zoltán Győri,Hungary,,49,100.4,M 40-49,110,,,,,,-230,240,250,250,,,,,,,250
2,M,B,Unlimited,Attila Marosi,Hungary,,51,102.6,M 50-59,110,,,,,,280,,,280,,,,,,,280
DQ,M,B,Unlimited,Ernő Eck,Hungary,,52,121.4,M 50-59,125,,,,,,-335,-335,-335,,,,,,,,
1,F,D,Raw,Sofia Csadiová,Slovakia,,17,51.3,Teen,52,,,,,,,,,,,75,80,82.5,82.5,,82.5
1,F,D,Raw,Veronika Seres,Slovakia,,19,59.1,Teen,60,,,,,,,,,,,-115,-115,115,115,,115
1,F,D,Raw,Lívia Liptáková,Slovakia,,19,81.5,Teen,82.5,,,,,,,,,,,110,115,-120,115,,115
1,F,D,Raw,Joanna Mosor,Poland,,18,85,Teen,82.5+,,,,,,,,,,,140,150,160,160,165,160
1,F,D,Raw,Radka Tóth,Slovakia,,35,50.6,Open,52,,,,,,,,,,,115,120,125,125,,125
1,F,D,Raw,Lilla Bodonová,Slovakia,,32,57.7,Open,60,,,,,,,,,,,115,120,122.5,122.5,,122.5
2,F,D,Raw,Eva Padová,Slovakia,,34,59.8,Open,60,,,,,,,,,,,110,117.5,-125,117.5,,117.5
1,F,D,Raw,Miroslava Hrašková,Slovakia,,35,76.5,Open,82.5,,,,,,,,,,,150,160,170,170,,170
1,F,D,Raw,Zsófia Blaskó,Hungary,,26,95.1,Open,82.5+,,,,,,,,,,,130,145,152.5,152.5,,152.5
2,F,D,Raw,Claudia Busse,Germany,,45,101.8,Open,82.5+,,,,,,,,,,,145,-150,152.5,152.5,,152.5
3,F,D,Raw,Siranush Manucharyan,Armenia,,34,82.7,Open,82.5+,,,,,,,,,,,130,-140,-150,130,,130
1,F,D,Raw,Kateryna Khomych,Ukraine,,43,59.3,M 40-49,60,,,,,,,,,,,135,142.5,150,150,,150
1,F,D,Raw,Lilit Vardanyan,Armenia,,49,73.7,M 40-49,82.5,,,,,,,,,,,150,165,175,175,,175
2,F,D,Raw,Éva Manzera,Hungary,,47,82.3,M 40-49,82.5,,,,,,,,,,,145,162.5,-177.5,162.5,,162.5
3,F,D,Raw,Melinda Derdák,Hungary,,49,78.7,M 40-49,82.5,,,,,,,,,,,115,125,135,135,,135
1,F,D,Raw,Andrea Chromčová,Slovakia,,47,82.6,M 40-49,82.5+,,,,,,,,,,,160,171,173,173,175,173
2,F,D,Raw,Claudia Busse,Germany,,45,101.8,M 40-49,82.5+,,,,,,,,,,,140,145,150,150,,150
1,F,D,Raw,Moonika Aus,Estonia,,53,51.7,M 50-59,52,,,,,,,,,,,100,110,-115,110,,110
1,F,D,Raw,Carmen Dorsch,Germany,,53,59.9,M 50-59,60,,,,,,,,,,,-110,110,120,120,,120
1,F,D,Raw,Klaudia Tanczos,Slovakia,,50,76.4,M 50-59,82.5,,,,,,,,,,,107.5,-115,,107.5,,107.5
1,F,D,Raw,Katarína Zajková,Slovakia,,62,81.5,M 60-69,82.5,,,,,,,,,,,180,200.5,-205,200.5,,200.5
1,F,D,Raw,Kvetka Baranovičová,Slovakia,,71,60,M 70-74,60,,,,,,,,,,,70,80,-90,80,,80
1,F,D,Raw,Božena Imreová,Slovakia,,71,89,M 70-74,82.5+,,,,,,,,,,,75,82.5,-90,82.5,,82.5
1,M,D,Raw,Benedek Firtl,Hungary,,17,67.4,Teen,67.5,,,,,,,,,,,185,197.5,205,205,,205
2,M,D,Raw,Samuel Urbanek,Austria,,19,63.9,Teen,67.5,,,,,,,,,,,175,-185,-185,175,,175
1,M,D,Raw,Dávid Horváth,Slovakia,,18,75.8,Teen,82.5,,,,,,,,,,,210,225,232.5,232.5,,232.5
2,M,D,Raw,Martin Balla,Slovakia,,16,78.5,Teen,82.5,,,,,,,,,,,190,212.5,-237.5,212.5,,212.5
3,M,D,Raw,Alexander Michálek,Slovakia,,19,80.9,Teen,82.5,,,,,,,,,,,175,192.5,-207.5,192.5,,192.5
1,M,D,Raw,Pavol Nedoroščík,Slovakia,,19,94.4,Teen,95,,,,,,,,,,,240,260,270,270,,270
2,M,D,Raw,Martin Szombath,Slovakia,,18,92.2,Teen,95,,,,,,,,,,,180,205,212.5,212.5,,212.5
1,M,D,Raw,David Klukavý,Slovakia,,20,81.4,Juniors,82.5,,,,,,,,,,,-245,260,-270,260,,260
2,M,D,Raw,Daniel Kuflik,Slovakia,,23,77.4,Juniors,82.5,,,,,,,,,,,200,215,225,225,,225
3,M,D,Raw,Matúš Kerekeš,Slovakia,,22,77.2,Juniors,82.5,,,,,,,,,,,185,200,202.5,202.5,,202.5
4,M,D,Raw,Adrián Lašák,Slovakia,,22,77.6,Juniors,82.5,,,,,,,,,,,175,195,202.5,202.5,,202.5
5,M,D,Raw,Szymon Skrudlik,Poland,,23,68.6,Juniors,82.5,,,,,,,,,,,175,185,200,200,,200
1,M,D,Raw,Juraj Ďureje,Slovakia,,20,84.4,Juniors,95,,,,,,,,,,,165,175,185,185,,185
1,M,D,Raw,Jakub Kružliak,Slovakia,,23,103.4,Juniors,110,,,,,,,,,,,250,265,270,270,,270
2,M,D,Raw,Tomáš Obrlík,Czechia,,22,106.7,Juniors,110,,,,,,,,,,,250,260,270,270,,270
1,M,D,Raw,Ramón Szeifert,Slovakia,,23,140.9,Juniors,125+,,,,,,,,,,,275,290.5,-295,290.5,,290.5
1,M,D,Raw,Viktor Šafránek,Slovakia,,29,59.8,Open,67.5,,,,,,,,,,,-200,-220,220,220,,220
2,M,D,Raw,Martin Macháč,Slovakia,,24,67.3,Open,67.5,,,,,,,,,,,170,-190,190,190,,190
1,M,D,Raw,Dominik Šafránek,Slovakia,,32,79.8,Open,82.5,,,,,,,,,,,290,300,-307.5,300,,300
2,M,D,Raw,Martin Ürban,Czechia,,33,78.3,Open,82.5,,,,,,,,,,,230,-245,245,245,,245
3,M,D,Raw,Marek Fusko,Slovakia,,24,82.3,Open,82.5,,,,,,,,,,,235,245,-255,245,,245
4,M,D,Raw,Christoph Kolar,Austria,,32,76.1,Open,82.5,,,,,,,,,,,180,205,215,215,,215
1,M,D,Raw,Lukáš Tlstý,Slovakia,,31,84.8,Open,95,,,,,,,,,,,250,-275,275,275,,275
2,M,D,Raw,András Vass,Slovakia,,29,93.8,Open,95,,,,,,,,,,,275,-285,-285,275,,275
3,M,D,Raw,Peter Krošlák,Slovakia,,32,90.1,Open,95,,,,,,,,,,,235,245,252.5,252.5,,252.5
4,M,D,Raw,Ivan Dávid,Slovakia,,28,92.9,Open,95,,,,,,,,,,,230,245,-252.5,245,,245
5,M,D,Raw,František Ševčík,Slovakia,,36,90.5,Open,95,,,,,,,,,,,220,-235,-240,220,,220
6,M,D,Raw,Ricky Richens,UK,,37,90.1,Open,95,,,,,,,,,,,-180,180,210,210,,210
1,M,D,Raw,Lukáš Prekop,Slovakia,,29,98.9,Open,110,,,,,,,,,,,-290,290,305,305,,305
2,M,D,Raw,Marek Muška,Slovakia,,34,103,Open,110,,,,,,,,,,,250,270,285,285,,285
3,M,D,Raw,Gáli Norbert,Hungary,,34,104.6,Open,110,,,,,,,,,,,-270,270,-280,270,,270
1,M,D,Raw,Juraj Kačmárik,Slovakia,,39,113.1,Open,125,,,,,,,,,,,325,340,-351,340,,340
2,M,D,Raw,Tristan Bauer,Austria,,39,112.8,Open,125,,,,,,,,,,,280,300,-305,300,,300
3,M,D,Raw,Tomáš Tóth,Slovakia,,33,120.3,Open,125,,,,,,,,,,,300,-327.5,-327.5,300,,300
1,M,D,Raw,Róbert Blácha,Slovakia,,34,135.1,Open,125+,,,,,,,,,,,300,310,-312.5,310,,310
2,M,D,Raw,Róbert Šimko,Slovakia,,37,142.3,Open,125+,,,,,,,,,,,300,-310,-312.5,300,,300
3,M,D,Raw,Bíró Lajos,Hungary,,28,150.1,Open,125+,,,,,,,,,,,250,270,282.5,282.5,,282.5
4,M,D,Raw,Adrián Drábik,Slovakia,,29,133.8,Open,125+,,,,,,,,,,,200,-220,-220,200,,200
1,M,D,Raw,Vlastimil Yacoub Bandík,Slovakia,,43,79.2,M 40-49,82.5,,,,,,,,,,,190,232.5,-235,232.5,,232.5
2,M,D,Raw,Andrej Farkaš,Slovakia,,43,68,M 40-49,82.5,,,,,,,,,,,150,160,-172.5,160,,160
1,M,D,Raw,Ladislav Mikovčík,Slovakia,,43,91.6,M 40-49,95,,,,,,,,,,,250,260,270,270,,270
2,M,D,Raw,Marcel Vasilenko,Slovakia,,45,93.1,M 40-49,95,,,,,,,,,,,230,252.5,-260,252.5,,252.5
3,M,D,Raw,David Künzling,Germany,,46,88.1,M 40-49,95,,,,,,,,,,,190,210,-212.5,210,,210
1,M,D,Raw,Vlastimil Kalaš,Czechia,,45,108.7,M 40-49,110,,,,,,,,,,,260,270,-275,270,,270
2,M,D,Raw,Štefan Elischer,Slovakia,,41,107.3,M 40-49,110,,,,,,,,,,,-267.5,267.5,-282.5,267.5,,267.5
3,M,D,Raw,Marcel Marossow,Germany,,47,104.2,M 40-49,110,,,,,,,,,,,240,260,-280,260,,260
4,M,D,Raw,Martin Martinka,Slovakia,,49,97.6,M 40-49,110,,,,,,,,,,,190,205,-210,205,,205
1,M,D,Raw,Matthias Hörning,Germany,,49,119.5,M 40-49,125,,,,,,,,,,,230,-245,245,245,,245
2,M,D,Raw,Mushegh Danielyan,Armenia,,42,111.3,M 40-49,125,,,,,,,,,,,160,170,180,180,,180
1,M,D,Raw,Markus Zehethofer,Austria,,49,145.8,M 40-49,125+,,,,,,,,,,,310,330,340,340,,340
1,M,D,Raw,Mirko Jaedtke-Schulze,Germany,,57,67.1,M 50-59,67.5,,,,,,,,,,,-145,150,165,165,,165
1,M,D,Raw,Robert Fekete,Slovakia,,51,81.8,M 50-59,82.5,,,,,,,,,,,150,165,-180,165,,165
1,M,D,Raw,Milan Páleník,Slovakia,,53,93.8,M 50-59,95,,,,,,,,,,,140,160,180,180,,180
1,M,D,Raw,Steffen Schneider,Germany,,56,101.8,M 50-59,110,,,,,,,,,,,207.5,215,217.5,217.5,,217.5
1,M,D,Raw,Richard Haberl,Austria,,52,117.4,M 50-59,125,,,,,,,,,,,250,-260,260,260,,260
1,M,D,Raw,Tibor Karalyos,Hungary,,50,140,M 50-59,125+,,,,,,,,,,,267.5,-287.5,,267.5,,267.5
2,M,D,Raw,Oliver Dorsch,Germany,,51,130.1,M 50-59,125+,,,,,,,,,,,260,-270,-270,260,,260
1,M,D,Raw,Sejfo Šehović,Bosnia and Herzegovina,,64,79.3,M 60-69,82.5,,,,,,,,,,,-250,260,-285,260,,260
1,M,D,Raw,Peter Herák,Slovakia,,63,93,M 60-69,95,,,,,,,,,,,215,227.5,235,235,,235
1,M,D,Raw,Tibor Gejdoš,Slovakia,,60,102.8,M 60-69,110,,,,,,,,,,,220,250,,250,,250
1,M,D,Raw,František Albert,Slovakia,,72,76,M 70-74,82.5,,,,,,,,,,,90,95,100,100,,100
1,M,D,Raw,Jozef Meravý,Slovakia,,74,96.4,M 70-74,110,,,,,,,,,,,100,120,140,140,,140
1,M,D,Raw,Stefan Sochaňski,Poland,,75,80.9,M 75+,82.5,,,,,,,,,,,162.5,175,-180,175,,175
2,M,D,Raw,Jozef Bartek,Slovakia,,79,73.1,M 75+,82.5,,,,,,,,,,,70,80,,80,,80
1,F,D,Multi-ply,Moonika Aus,Estonia,,53,51.7,M 50-59,52,,,,,,,,,,,-110,110,-115,110,,110
1,F,D,Multi-ply,Mónika Bazsó,Hungary,,50,80.6,M 50-59,82.5,,,,,,,,,,,172.5,182.5,190,190,,190
1,M,D,Multi-ply,Hablicsek Hunor,Hungary,,16,64.7,Teen,67.5,,,,,,,,,,,125,140,-150,140,,140
1,M,D,Multi-ply,Július Tkáč,Slovakia,,18,75.8,Teen,82.5,,,,,,,,,,,180,192.5,-200,192.5,,192.5
1,M,D,Multi-ply,Tobias Hvozdovič,Slovakia,,17,93.5,Teen,95,,,,,,,,,,,210,230,250,250,-260,250
1,M,D,Multi-ply,Samuel Danis,Slovakia,,22,87.5,Juniors,95,,,,,,,,,,,265,-286,286,286,-300,286
1,M,D,Multi-ply,Ľubomír Samseli,Slovakia,,37,81.9,Open,82.5,,,,,,,,,,,230,242.5,-260,242.5,,242.5
2,M,D,Multi-ply,Vlastimil Yacoub Bandík,Slovakia,,43,79.2,Open,82.5,,,,,,,,,,,190,200,-245,200,,200
3,M,D,Multi-ply,Tomáš Čan,Slovakia,,36,75.6,Open,82.5,,,,,,,,,,,165,175,185,185,,185
1,M,D,Multi-ply,Tomáš Múdrý,Slovakia,,30,92.1,Open,95,,,,,,,,,,,270,290,-300.5,290,,290
2,M,D,Multi-ply,Martin Tesař,Czechia,,25,94.5,Open,95,,,,,,,,,,,275,-300.5,-300.5,275,,275
3,M,D,Multi-ply,Ivan Lazor,Slovakia,,32,87.2,Open,95,,,,,,,,,,,230,-245,-245,230,,230
4,M,D,Multi-ply,František Szobolovszký,Slovakia,,29,92.7,Open,95,,,,,,,,,,,210,225,-240,225,,225
1,M,D,Multi-ply,Mátyás Sándor Mészáros,Hungary,,29,100,Open,110,,,,,,,,,,,280,-295,-305,280,,280
2,M,D,Multi-ply,René Cicák,Slovakia,,32,108.8,Open,110,,,,,,,,,,,225,240,250,250,,250
1,M,D,Multi-ply,Josef Capouch,Czechia,,27,122.4,Open,125,,,,,,,,,,,350,-380,-380,350,,350
1,M,D,Multi-ply,Michal Móry,Slovakia,,45,66.8,M 40-49,67.5,,,,,,,,,,,190.5,207.5,220,220,227.5,220
1,M,D,Multi-ply,Daniel Tatarka,Slovakia,,40,78.9,M 40-49,82.5,,,,,,,,,,,250,-262,-262,250,,250
DQ,M,D,Multi-ply,Michal Buranský,Slovakia,,43,81.5,M 40-49,82.5,,,,,,,,,,,-235,-235,,,,
1,M,D,Multi-ply,Peter Lincmaier,Slovakia,,40,92.3,M 40-49,95,,,,,,,,,,,290,305,-310,305,,305
2,M,D,Multi-ply,Štefan Sokoly,Slovakia,,48,93.2,M 40-49,95,,,,,,,,,,,280,300.5,-307.5,300.5,,300.5
DQ,M,D,Multi-ply,Mamikon Kostanyan,Armenia,,40,91.4,M 40-49,95,,,,,,,,,,,-140,-140,,,,
1,M,D,Multi-ply,Grzegorz Drewniany,Poland,,47,101.8,M 40-49,110,,,,,,,,,,,250,275,292.5,292.5,,292.5
2,M,D,Multi-ply,László Eck,Hungary,,46,95.3,M 40-49,110,,,,,,,,,,,210,220,-230,220,,220
3,M,D,Multi-ply,Ľubomír Trstenský,Slovakia,,49,102.2,M 40-49,110,,,,,,,,,,,190,210,-222.5,210,,210
1,M,D,Multi-ply,Ondrej Hudák,Slovakia,,49,120.2,M 40-49,125,,,,,,,,,,,270,300,-310,300,,300
1,M,D,Multi-ply,Norbert Hablicsek,Hungary,,50,108.3,M 50-59,110,,,,,,,,,,,270,290,-297.5,290,,290
1,M,D,Multi-ply,Tibor Manzera,Hungary,,55,111.6,M 50-59,125,,,,,,,,,,,160,172.5,185,185,,185
1,M,D,Multi-ply,Michal Červinka,Slovakia,,64,87.4,M 60-69,95,,,,,,,,,,,150,160,-170,160,,160
1,M,D,Multi-ply,Stefan Sochaňski,Poland,,75,80.9,M 75+,82.5,,,,,,,,,,,175,190,-210,190,,190
