module github.com/edx04/oracleValidator

go 1.16

require (
	github.com/cosmos/cosmos-sdk v0.44.5
	github.com/cosmos/ibc-go v1.2.2
	github.com/gogo/protobuf v1.3.3
	github.com/gorilla/mux v1.8.0
	github.com/grpc-ecosystem/grpc-gateway v1.16.0
	github.com/spf13/cast v1.3.1
	github.com/spf13/cobra v1.2.1
	github.com/stretchr/testify v1.7.0
	github.com/tendermint/spm v0.1.9
	github.com/tendermint/tendermint v0.34.14
	github.com/tendermint/tm-db v0.6.6
	google.golang.org/genproto v0.0.0-20220519153652-3a47de7e79bd
	google.golang.org/grpc v1.46.2
)

require (
	github.com/fsnotify/fsnotify v1.5.1 // indirect
	github.com/golang/protobuf v1.5.2
	github.com/golang/snappy v0.0.3 // indirect
	github.com/google/go-cmp v0.5.8 // indirect
	github.com/mitchellh/mapstructure v1.4.2 // indirect
	github.com/opencontainers/image-spec v1.0.2 // indirect
	github.com/opencontainers/runc v1.0.3 // indirect
	github.com/pelletier/go-toml v1.9.4 // indirect
	github.com/pkg/errors v0.9.1
	golang.org/x/net v0.0.0-20220127200216-cd36cc0744dd // indirect
	gopkg.in/ini.v1 v1.63.2 // indirect
	gopkg.in/yaml.v2 v2.4.0
)

replace (
	github.com/gogo/protobuf => github.com/regen-network/protobuf v1.3.3-alpha.regen.1
	github.com/keybase/go-keychain => github.com/99designs/go-keychain v0.0.0-20191008050251-8e49817e8af4
	google.golang.org/grpc => google.golang.org/grpc v1.33.2
)
