EESchema Schematic File Version 2
LIBS:power
LIBS:device
LIBS:transistors
LIBS:conn
LIBS:linear
LIBS:regul
LIBS:74xx
LIBS:cmos4000
LIBS:adc-dac
LIBS:memory
LIBS:xilinx
LIBS:special
LIBS:microcontrollers
LIBS:dsp
LIBS:microchip
LIBS:analog_switches
LIBS:motorola
LIBS:texas
LIBS:intel
LIBS:audio
LIBS:interface
LIBS:digital-audio
LIBS:philips
LIBS:display
LIBS:cypress
LIBS:siliconi
LIBS:opto
LIBS:atmel
LIBS:contrib
LIBS:valves
LIBS:TechnoBoard-cache
EELAYER 25 0
EELAYER END
$Descr A4 11693 8268
encoding utf-8
Sheet 3 3
Title "TechnoBoard Model 1"
Date "Mon 23 mar 2015"
Rev "A"
Comp "Copyright 2015, Jean-Sébastien Castonguay"
Comment1 "Licensed under the Creative Commons Attribution-ShareAlike (BY-SA) license "
Comment2 ""
Comment3 ""
Comment4 ""
$EndDescr
$Comp
L MCP4822 U3
U 1 1 5358149F
P 3250 3250
F 0 "U3" H 2800 3650 60  0000 C CNN
F 1 "MCP4822" H 3250 4100 60  0000 C CNN
F 2 "Sockets_DIP:DIP-8__300" H 3250 3250 60  0001 C CNN
F 3 "" H 3250 3250 60  0000 C CNN
	1    3250 3250
	1    0    0    -1  
$EndComp
$Comp
L LED D2
U 1 1 53581527
P 2000 1900
F 0 "D2" H 2000 2000 50  0000 C CNN
F 1 "475-2766-1-ND" H 2000 1800 50  0000 C CNN
F 2 "T67K:T67K" H 2000 1900 60  0001 C CNN
F 3 "" H 2000 1900 60  0000 C CNN
	1    2000 1900
	0    1    1    0   
$EndComp
$Comp
L SW_PUSH SW2
U 1 1 5358155E
P 2000 3200
F 0 "SW2" H 2150 3310 50  0000 C CNN
F 1 "EG4385CT-ND" H 2000 3120 50  0000 C CNN
F 2 "smt_btn:smt_btn" H 2000 3200 60  0001 C CNN
F 3 "" H 2000 3200 60  0000 C CNN
	1    2000 3200
	0    -1   -1   0   
$EndComp
$Comp
L CONN_6 P2
U 1 1 535816C0
P 5100 1850
F 0 "P2" V 5050 1850 60  0000 C CNN
F 1 "PMOD" V 5150 1850 60  0000 C CNN
F 2 "Socket_Strips:Socket_Strip_Angled_1x06" H 5100 1850 60  0001 C CNN
F 3 "" H 5100 1850 60  0000 C CNN
	1    5100 1850
	1    0    0    -1  
$EndComp
$Comp
L CONN_12 P4
U 1 1 535816DB
P 10750 2350
F 0 "P4" V 10700 2350 60  0000 C CNN
F 1 "PMOD2" V 10800 2350 60  0000 C CNN
F 2 "PMOD2:PMOD2" H 10750 2350 60  0001 C CNN
F 3 "" H 10750 2350 60  0000 C CNN
	1    10750 2350
	1    0    0    -1  
$EndComp
$Comp
L JUMPER3 JP1
U 1 1 535817E1
P 1650 4800
F 0 "JP1" H 1700 4700 40  0000 L CNN
F 1 "JUMPER3" H 1650 4900 40  0000 C CNN
F 2 "Pin_Headers:Pin_Header_Straight_1x03" H 1650 4800 60  0001 C CNN
F 3 "" H 1650 4800 60  0000 C CNN
	1    1650 4800
	1    0    0    -1  
$EndComp
$Comp
L JUMPER3 JP2
U 1 1 535817ED
P 5200 2450
F 0 "JP2" H 5250 2350 40  0000 L CNN
F 1 "JUMPER3" H 5200 2550 40  0000 C CNN
F 2 "Pin_Headers:Pin_Header_Straight_1x03" H 5200 2450 60  0001 C CNN
F 3 "" H 5200 2450 60  0000 C CNN
	1    5200 2450
	0    1    1    0   
$EndComp
$Comp
L R R8
U 1 1 535817FB
P 2000 2450
F 0 "R8" V 2080 2450 40  0000 C CNN
F 1 "750" V 2007 2451 40  0000 C CNN
F 2 "R3_ref:R3_ref" V 1930 2450 30  0001 C CNN
F 3 "" H 2000 2450 30  0000 C CNN
	1    2000 2450
	1    0    0    -1  
$EndComp
$Comp
L +3,3V #PWR032
U 1 1 535867DC
P 2000 1600
F 0 "#PWR032" H 2000 1560 30  0001 C CNN
F 1 "+3,3V" H 2000 1710 30  0000 C CNN
F 2 "" H 2000 1600 60  0000 C CNN
F 3 "" H 2000 1600 60  0000 C CNN
	1    2000 1600
	1    0    0    -1  
$EndComp
$Comp
L GND #PWR033
U 1 1 535867EB
P 3200 3200
F 0 "#PWR033" H 3200 3200 30  0001 C CNN
F 1 "GND" H 3200 3130 30  0001 C CNN
F 2 "" H 3200 3200 60  0000 C CNN
F 3 "" H 3200 3200 60  0000 C CNN
	1    3200 3200
	1    0    0    -1  
$EndComp
$Comp
L R R9
U 1 1 535869EA
P 2000 4450
F 0 "R9" V 2080 4450 40  0000 C CNN
F 1 "10k" V 2007 4451 40  0000 C CNN
F 2 "R3_ref:R3_ref" V 1930 4450 30  0001 C CNN
F 3 "" H 2000 4450 30  0000 C CNN
	1    2000 4450
	1    0    0    -1  
$EndComp
$Comp
L +3,3V #PWR034
U 1 1 535869F0
P 2000 4100
F 0 "#PWR034" H 2000 4060 30  0001 C CNN
F 1 "+3,3V" H 2000 4210 30  0000 C CNN
F 2 "" H 2000 4100 60  0000 C CNN
F 3 "" H 2000 4100 60  0000 C CNN
	1    2000 4100
	1    0    0    -1  
$EndComp
$Comp
L GND #PWR035
U 1 1 53586B45
P 2000 3600
F 0 "#PWR035" H 2000 3600 30  0001 C CNN
F 1 "GND" H 2000 3530 30  0001 C CNN
F 2 "" H 2000 3600 60  0000 C CNN
F 3 "" H 2000 3600 60  0000 C CNN
	1    2000 3600
	1    0    0    -1  
$EndComp
$Comp
L R R7
U 1 1 53586CE7
P 1600 2800
F 0 "R7" V 1680 2800 40  0000 C CNN
F 1 "200" V 1607 2801 40  0000 C CNN
F 2 "R3_ref:R3_ref" V 1530 2800 30  0001 C CNN
F 3 "" H 1600 2800 30  0000 C CNN
	1    1600 2800
	0    -1   -1   0   
$EndComp
$Comp
L +3,3V #PWR036
U 1 1 53586E59
P 5450 2650
F 0 "#PWR036" H 5450 2610 30  0001 C CNN
F 1 "+3,3V" H 5450 2760 30  0000 C CNN
F 2 "" H 5450 2650 60  0000 C CNN
F 3 "" H 5450 2650 60  0000 C CNN
	1    5450 2650
	1    0    0    -1  
$EndComp
$Comp
L +5V #PWR037
U 1 1 53586E61
P 5450 2150
F 0 "#PWR037" H 5450 2240 20  0001 C CNN
F 1 "+5V" H 5450 2240 30  0000 C CNN
F 2 "" H 5450 2150 60  0000 C CNN
F 3 "" H 5450 2150 60  0000 C CNN
	1    5450 2150
	1    0    0    -1  
$EndComp
$Comp
L GND #PWR038
U 1 1 53587275
P 4600 2100
F 0 "#PWR038" H 4600 2100 30  0001 C CNN
F 1 "GND" H 4600 2030 30  0001 C CNN
F 2 "" H 4600 2100 60  0000 C CNN
F 3 "" H 4600 2100 60  0000 C CNN
	1    4600 2100
	1    0    0    -1  
$EndComp
$Comp
L CONN_6 P3
U 1 1 53587341
P 5100 3650
F 0 "P3" V 5050 3650 60  0000 C CNN
F 1 "PMOD" V 5150 3650 60  0000 C CNN
F 2 "Socket_Strips:Socket_Strip_Angled_1x06" H 5100 3650 60  0001 C CNN
F 3 "" H 5100 3650 60  0000 C CNN
	1    5100 3650
	1    0    0    -1  
$EndComp
$Comp
L JUMPER3 JP3
U 1 1 53587347
P 5200 4250
F 0 "JP3" H 5250 4150 40  0000 L CNN
F 1 "JUMPER3" H 5200 4350 40  0000 C CNN
F 2 "Pin_Headers:Pin_Header_Straight_1x03" H 5200 4250 60  0001 C CNN
F 3 "" H 5200 4250 60  0000 C CNN
	1    5200 4250
	0    1    1    0   
$EndComp
$Comp
L +3,3V #PWR039
U 1 1 5358734D
P 5450 4450
F 0 "#PWR039" H 5450 4410 30  0001 C CNN
F 1 "+3,3V" H 5450 4560 30  0000 C CNN
F 2 "" H 5450 4450 60  0000 C CNN
F 3 "" H 5450 4450 60  0000 C CNN
	1    5450 4450
	1    0    0    -1  
$EndComp
$Comp
L +5V #PWR040
U 1 1 53587353
P 5450 3950
F 0 "#PWR040" H 5450 4040 20  0001 C CNN
F 1 "+5V" H 5450 4040 30  0000 C CNN
F 2 "" H 5450 3950 60  0000 C CNN
F 3 "" H 5450 3950 60  0000 C CNN
	1    5450 3950
	1    0    0    -1  
$EndComp
$Comp
L GND #PWR041
U 1 1 5358735B
P 4600 3900
F 0 "#PWR041" H 4600 3900 30  0001 C CNN
F 1 "GND" H 4600 3830 30  0001 C CNN
F 2 "" H 4600 3900 60  0000 C CNN
F 3 "" H 4600 3900 60  0000 C CNN
	1    4600 3900
	1    0    0    -1  
$EndComp
$Comp
L JUMPER3 JP4
U 1 1 53587377
P 10850 3250
F 0 "JP4" H 10900 3150 40  0000 L CNN
F 1 "JUMPER3" H 10850 3350 40  0000 C CNN
F 2 "Pin_Headers:Pin_Header_Straight_1x03" H 10850 3250 60  0001 C CNN
F 3 "" H 10850 3250 60  0000 C CNN
	1    10850 3250
	0    1    1    0   
$EndComp
$Comp
L +3,3V #PWR042
U 1 1 5358737D
P 11100 3450
F 0 "#PWR042" H 11100 3410 30  0001 C CNN
F 1 "+3,3V" H 11100 3560 30  0000 C CNN
F 2 "" H 11100 3450 60  0000 C CNN
F 3 "" H 11100 3450 60  0000 C CNN
	1    11100 3450
	1    0    0    -1  
$EndComp
$Comp
L +5V #PWR043
U 1 1 53587389
P 11100 2950
F 0 "#PWR043" H 11100 3040 20  0001 C CNN
F 1 "+5V" H 11100 3040 30  0000 C CNN
F 2 "" H 11100 2950 60  0000 C CNN
F 3 "" H 11100 2950 60  0000 C CNN
	1    11100 2950
	1    0    0    -1  
$EndComp
$Comp
L GND #PWR044
U 1 1 53587399
P 10100 2900
F 0 "#PWR044" H 10100 2900 30  0001 C CNN
F 1 "GND" H 10100 2830 30  0001 C CNN
F 2 "" H 10100 2900 60  0000 C CNN
F 3 "" H 10100 2900 60  0000 C CNN
	1    10100 2900
	1    0    0    -1  
$EndComp
Text GLabel 950  2800 0    60   BiDi ~ 0
RB5
Text GLabel 950  5200 0    60   BiDi ~ 0
RA0
Text GLabel 950  5350 0    60   BiDi ~ 0
RA1
Text GLabel 950  5500 0    60   BiDi ~ 0
RB15
Text GLabel 950  5650 0    60   BiDi ~ 0
RB14
$Comp
L PROTECT_TBD U4
U 1 1 535F0DD9
P 4800 6550
F 0 "U4" H 4250 6800 60  0000 C CNN
F 1 "AOZ8105CI" H 4150 7150 60  0000 C CNN
F 2 "Housings_SOT-23_SOT-143_TSOT-6:SOT-23-6" H 4800 6550 60  0001 C CNN
F 3 "" H 4800 6550 60  0000 C CNN
	1    4800 6550
	1    0    0    -1  
$EndComp
$Comp
L +3,3V #PWR045
U 1 1 535F0DFC
P 4450 5250
F 0 "#PWR045" H 4450 5210 30  0001 C CNN
F 1 "+3,3V" H 4450 5360 30  0000 C CNN
F 2 "" H 4450 5250 60  0000 C CNN
F 3 "" H 4450 5250 60  0000 C CNN
	1    4450 5250
	1    0    0    -1  
$EndComp
$Comp
L GND #PWR046
U 1 1 535F0EC4
P 4150 6650
F 0 "#PWR046" H 4150 6650 30  0001 C CNN
F 1 "GND" H 4150 6580 30  0001 C CNN
F 2 "" H 4150 6650 60  0000 C CNN
F 3 "" H 4150 6650 60  0000 C CNN
	1    4150 6650
	1    0    0    -1  
$EndComp
$Comp
L PROTECT_TBD U6
U 1 1 535F1026
P 10000 4800
F 0 "U6" H 9450 5050 60  0000 C CNN
F 1 "AOZ8105CI" H 9350 5400 60  0000 C CNN
F 2 "Housings_SOT-23_SOT-143_TSOT-6:SOT-23-6" H 10000 4800 60  0001 C CNN
F 3 "" H 10000 4800 60  0000 C CNN
	1    10000 4800
	1    0    0    -1  
$EndComp
$Comp
L +3,3V #PWR047
U 1 1 535F102C
P 9650 3500
F 0 "#PWR047" H 9650 3460 30  0001 C CNN
F 1 "+3,3V" H 9650 3610 30  0000 C CNN
F 2 "" H 9650 3500 60  0000 C CNN
F 3 "" H 9650 3500 60  0000 C CNN
	1    9650 3500
	1    0    0    -1  
$EndComp
$Comp
L GND #PWR048
U 1 1 535F1035
P 9350 4850
F 0 "#PWR048" H 9350 4850 30  0001 C CNN
F 1 "GND" H 9350 4780 30  0001 C CNN
F 2 "" H 9350 4850 60  0000 C CNN
F 3 "" H 9350 4850 60  0000 C CNN
	1    9350 4850
	1    0    0    -1  
$EndComp
$Comp
L PROTECT_TBD U5
U 1 1 535F103C
P 9100 4800
F 0 "U5" H 8550 5050 60  0000 C CNN
F 1 "AOZ8105CI" H 8450 5400 60  0000 C CNN
F 2 "Housings_SOT-23_SOT-143_TSOT-6:SOT-23-6" H 9100 4800 60  0001 C CNN
F 3 "" H 9100 4800 60  0000 C CNN
	1    9100 4800
	1    0    0    -1  
$EndComp
$Comp
L +3,3V #PWR049
U 1 1 535F1042
P 8750 3500
F 0 "#PWR049" H 8750 3460 30  0001 C CNN
F 1 "+3,3V" H 8750 3610 30  0000 C CNN
F 2 "" H 8750 3500 60  0000 C CNN
F 3 "" H 8750 3500 60  0000 C CNN
	1    8750 3500
	1    0    0    -1  
$EndComp
$Comp
L GND #PWR050
U 1 1 535F104B
P 8450 4900
F 0 "#PWR050" H 8450 4900 30  0001 C CNN
F 1 "GND" H 8450 4830 30  0001 C CNN
F 2 "" H 8450 4900 60  0000 C CNN
F 3 "" H 8450 4900 60  0000 C CNN
	1    8450 4900
	1    0    0    -1  
$EndComp
Text GLabel 6650 1800 0    60   BiDi ~ 0
RB7
Text GLabel 6650 1950 0    60   BiDi ~ 0
RB8
Text GLabel 6650 2100 0    60   BiDi ~ 0
RB9
Text GLabel 6650 2250 0    60   BiDi ~ 0
RB13
Text GLabel 6650 2400 0    60   BiDi ~ 0
RA4
Text GLabel 6650 2550 0    60   BiDi ~ 0
RB4
Text GLabel 6650 2700 0    60   BiDi ~ 0
RB3
Text GLabel 6650 2850 0    60   BiDi ~ 0
RB2
$Comp
L C C13
U 1 1 53A077CB
P 3450 1300
F 0 "C13" H 3450 1400 40  0000 L CNN
F 1 "0.1uF" H 3456 1215 40  0000 L CNN
F 2 "Discret:C1" H 3488 1150 30  0001 C CNN
F 3 "" H 3450 1300 60  0000 C CNN
	1    3450 1300
	1    0    0    -1  
$EndComp
$Comp
L GND #PWR051
U 1 1 53A0788D
P 3450 1550
F 0 "#PWR051" H 3450 1550 30  0001 C CNN
F 1 "GND" H 3450 1480 30  0001 C CNN
F 2 "" H 3450 1550 60  0000 C CNN
F 3 "" H 3450 1550 60  0000 C CNN
	1    3450 1550
	1    0    0    -1  
$EndComp
$Comp
L +3,3V #PWR052
U 1 1 53A079C7
P 1150 1600
F 0 "#PWR052" H 1150 1560 30  0001 C CNN
F 1 "+3,3V" H 1150 1710 30  0000 C CNN
F 2 "" H 1150 1600 60  0000 C CNN
F 3 "" H 1150 1600 60  0000 C CNN
	1    1150 1600
	1    0    0    -1  
$EndComp
$Comp
L R R6
U 1 1 53A079CF
P 1150 2150
F 0 "R6" V 1230 2150 40  0000 C CNN
F 1 "10k" V 1157 2151 40  0000 C CNN
F 2 "R3_ref:R3_ref" V 1080 2150 30  0001 C CNN
F 3 "" H 1150 2150 30  0000 C CNN
	1    1150 2150
	1    0    0    -1  
$EndComp
$Comp
L R_PACK8 RP1
U 1 1 53A1929F
P 7500 2150
F 0 "RP1" H 7500 2600 40  0000 C CNN
F 1 "4116R-1-221LF-ND" H 7500 1700 40  0000 C CNN
F 2 "Sockets_DIP:DIP-16__300" H 7500 2150 60  0001 C CNN
F 3 "" H 7500 2150 60  0000 C CNN
	1    7500 2150
	1    0    0    -1  
$EndComp
$Comp
L RR4_SIP RR1
U 1 1 53A1D6A8
P 3450 4200
F 0 "RR1" H 3500 4750 70  0000 C CNN
F 1 "4608X-102-221LF" V 3650 4150 70  0000 C CNN
F 2 "Pin_Headers:Pin_Header_Straight_1x08" H 3450 4200 60  0001 C CNN
F 3 "" H 3450 4200 60  0000 C CNN
	1    3450 4200
	1    0    0    -1  
$EndComp
$Comp
L GND #PWR053
U 1 1 54F9B7CB
P 2900 1550
F 0 "#PWR053" H 2900 1550 30  0001 C CNN
F 1 "GND" H 2900 1480 30  0001 C CNN
F 2 "" H 2900 1550 60  0000 C CNN
F 3 "" H 2900 1550 60  0000 C CNN
	1    2900 1550
	1    0    0    -1  
$EndComp
$Comp
L CONN_02X04 P5
U 1 1 54F9C2D5
P 7150 5500
F 0 "P5" H 7150 5750 50  0000 C CNN
F 1 "PMOD_I2C" H 7150 5250 50  0000 C CNN
F 2 "Pin_Headers:Pin_Header_Straight_2x04" H 7150 5150 60  0000 C CNN
F 3 "" H 7150 4300 60  0000 C CNN
	1    7150 5500
	1    0    0    -1  
$EndComp
$Comp
L +3,3V #PWR054
U 1 1 54F9E83B
P 7550 6050
F 0 "#PWR054" H 7550 6010 30  0001 C CNN
F 1 "+3,3V" H 7550 6160 30  0000 C CNN
F 2 "" H 7550 6050 60  0000 C CNN
F 3 "" H 7550 6050 60  0000 C CNN
	1    7550 6050
	1    0    0    -1  
$EndComp
$Comp
L GND #PWR055
U 1 1 54F9EAD1
P 6700 5600
F 0 "#PWR055" H 6700 5600 30  0001 C CNN
F 1 "GND" H 6700 5530 30  0001 C CNN
F 2 "" H 6700 5600 60  0000 C CNN
F 3 "" H 6700 5600 60  0000 C CNN
	1    6700 5600
	1    0    0    -1  
$EndComp
$Comp
L GND #PWR056
U 1 1 54F9EB6F
P 7600 5600
F 0 "#PWR056" H 7600 5600 30  0001 C CNN
F 1 "GND" H 7600 5530 30  0001 C CNN
F 2 "" H 7600 5600 60  0000 C CNN
F 3 "" H 7600 5600 60  0000 C CNN
	1    7600 5600
	1    0    0    -1  
$EndComp
$Comp
L +5V #PWR057
U 1 1 54FA073B
P 3250 1000
F 0 "#PWR057" H 3250 1090 20  0001 C CNN
F 1 "+5V" H 3250 1090 30  0000 C CNN
F 2 "" H 3250 1000 60  0000 C CNN
F 3 "" H 3250 1000 60  0000 C CNN
	1    3250 1000
	1    0    0    -1  
$EndComp
$Comp
L R R11
U 1 1 550780C9
P 6600 4050
F 0 "R11" V 6680 4050 50  0000 C CNN
F 1 "2k2" V 6607 4051 50  0000 C CNN
F 2 "Resistors_SMD:R_1206_HandSoldering" V 6530 4050 30  0001 C CNN
F 3 "" H 6600 4050 30  0000 C CNN
	1    6600 4050
	1    0    0    -1  
$EndComp
$Comp
L R R10
U 1 1 5507859C
P 6200 4050
F 0 "R10" V 6280 4050 50  0000 C CNN
F 1 "2k2" V 6207 4051 50  0000 C CNN
F 2 "Resistors_SMD:R_1206_HandSoldering" V 6130 4050 30  0001 C CNN
F 3 "" H 6200 4050 30  0000 C CNN
	1    6200 4050
	1    0    0    -1  
$EndComp
$Comp
L JUMPER JP5
U 1 1 5507A32F
P 6200 4650
F 0 "JP5" H 6200 4800 50  0000 C CNN
F 1 "JUMPER" H 6200 4570 50  0000 C CNN
F 2 "Pin_Headers:Pin_Header_Straight_1x02" H 6200 4650 60  0001 C CNN
F 3 "" H 6200 4650 60  0000 C CNN
	1    6200 4650
	0    1    1    0   
$EndComp
$Comp
L JUMPER JP6
U 1 1 5507A41F
P 6600 4650
F 0 "JP6" H 6600 4800 50  0000 C CNN
F 1 "JUMPER" H 6600 4570 50  0000 C CNN
F 2 "Pin_Headers:Pin_Header_Straight_1x02" H 6600 4650 60  0001 C CNN
F 3 "" H 6600 4650 60  0000 C CNN
	1    6600 4650
	0    1    1    0   
$EndComp
$Comp
L +3,3V #PWR058
U 1 1 5507A5A7
P 6200 3750
F 0 "#PWR058" H 6200 3710 30  0001 C CNN
F 1 "+3,3V" H 6200 3860 30  0000 C CNN
F 2 "" H 6200 3750 60  0000 C CNN
F 3 "" H 6200 3750 60  0000 C CNN
	1    6200 3750
	1    0    0    -1  
$EndComp
$Comp
L +3,3V #PWR059
U 1 1 5507A652
P 6600 3750
F 0 "#PWR059" H 6600 3710 30  0001 C CNN
F 1 "+3,3V" H 6600 3860 30  0000 C CNN
F 2 "" H 6600 3750 60  0000 C CNN
F 3 "" H 6600 3750 60  0000 C CNN
	1    6600 3750
	1    0    0    -1  
$EndComp
Wire Wire Line
	2000 4800 1900 4800
Wire Wire Line
	2000 1600 2000 1700
Wire Wire Line
	2000 2100 2000 2200
Wire Wire Line
	2000 2700 2000 2900
Wire Wire Line
	2000 3500 2000 3600
Wire Wire Line
	2000 4800 2000 4700
Wire Wire Line
	2000 4100 2000 4200
Connection ~ 2000 2800
Wire Wire Line
	5100 2450 4750 2450
Wire Wire Line
	4750 2450 4750 2100
Wire Wire Line
	4750 2000 4600 2000
Wire Wire Line
	4600 2000 4600 2100
Wire Wire Line
	5200 2200 5450 2200
Wire Wire Line
	5200 2700 5450 2700
Wire Wire Line
	5450 2700 5450 2650
Wire Wire Line
	5100 4250 4750 4250
Wire Wire Line
	4750 4250 4750 3900
Wire Wire Line
	4750 3800 4600 3800
Wire Wire Line
	4600 3800 4600 3900
Wire Wire Line
	5200 4000 5450 4000
Wire Wire Line
	5450 4000 5450 3950
Wire Wire Line
	5200 4500 5450 4500
Wire Wire Line
	5450 4500 5450 4450
Wire Wire Line
	10250 3250 10750 3250
Wire Wire Line
	10850 3000 11100 3000
Wire Wire Line
	11100 3000 11100 2950
Wire Wire Line
	10850 3500 11100 3500
Wire Wire Line
	11100 3500 11100 3450
Wire Wire Line
	10400 2800 10100 2800
Wire Wire Line
	10100 2200 10100 2900
Wire Wire Line
	1650 4900 1650 5050
Wire Wire Line
	1650 5050 2200 5050
Wire Wire Line
	1850 2800 2000 2800
Wire Wire Line
	10100 2200 10400 2200
Connection ~ 10100 2800
Wire Wire Line
	10250 2300 10250 3250
Wire Wire Line
	10250 2300 10400 2300
Wire Wire Line
	10400 2900 10250 2900
Connection ~ 10250 2900
Wire Wire Line
	950  2800 1350 2800
Wire Wire Line
	1150 2400 1150 4800
Wire Wire Line
	1150 4800 1400 4800
Connection ~ 1150 2800
Wire Wire Line
	4100 2250 4100 1600
Wire Wire Line
	4200 2550 4200 1700
Wire Wire Line
	4450 5250 4450 5350
Wire Wire Line
	4150 6550 4150 6650
Wire Wire Line
	9650 3500 9650 3600
Wire Wire Line
	8750 3500 8750 3600
Wire Wire Line
	8150 1800 8150 3600
Wire Wire Line
	8300 1900 8300 3600
Wire Wire Line
	8450 4800 8450 4900
Wire Wire Line
	9350 4800 9350 4850
Wire Wire Line
	2200 5050 2200 2250
Wire Wire Line
	2200 2250 2450 2250
Wire Wire Line
	2300 2400 2300 5200
Wire Wire Line
	2300 5200 950  5200
Wire Wire Line
	2450 2550 2400 2550
Wire Wire Line
	2400 2550 2400 5350
Wire Wire Line
	2400 5350 950  5350
Wire Wire Line
	4200 2550 4100 2550
Wire Wire Line
	4100 1600 4750 1600
Wire Wire Line
	4200 1700 4750 1700
Wire Wire Line
	4300 1800 4750 1800
Wire Wire Line
	4400 1900 4750 1900
Wire Wire Line
	4750 3600 4300 3600
Connection ~ 4300 3600
Wire Wire Line
	4750 3700 4400 3700
Connection ~ 4400 3700
Wire Wire Line
	6800 1900 6800 1950
Wire Wire Line
	6800 1950 6650 1950
Wire Wire Line
	6850 2000 6850 2100
Wire Wire Line
	6850 2100 6650 2100
Wire Wire Line
	6900 2100 6900 2250
Wire Wire Line
	6900 2250 6650 2250
Wire Wire Line
	7000 2550 6650 2550
Wire Wire Line
	7050 2700 6650 2700
Wire Wire Line
	7100 2850 6650 2850
Connection ~ 8150 1800
Connection ~ 8300 1900
Wire Wire Line
	8450 3600 8450 2000
Connection ~ 8450 2000
Wire Wire Line
	8600 3600 8600 2100
Connection ~ 8600 2100
Wire Wire Line
	9050 3600 9050 2400
Connection ~ 9050 2400
Wire Wire Line
	9200 3600 9200 2500
Connection ~ 9200 2500
Wire Wire Line
	9350 3600 9350 2600
Connection ~ 9350 2600
Wire Wire Line
	9500 3600 9500 2700
Connection ~ 9500 2700
Wire Wire Line
	2900 3400 4750 3400
Wire Wire Line
	4300 4850 3000 4850
Wire Wire Line
	4400 5000 3100 5000
Wire Wire Line
	7700 1900 10400 1900
Wire Wire Line
	7700 2000 10400 2000
Wire Wire Line
	7700 2100 10400 2100
Wire Wire Line
	2300 2400 2450 2400
Wire Wire Line
	3200 3100 3200 3200
Wire Wire Line
	5450 2200 5450 2150
Wire Wire Line
	3450 1050 3450 1100
Wire Wire Line
	3450 1500 3450 1550
Wire Wire Line
	3100 1700 3100 1500
Wire Wire Line
	1150 1900 1150 1600
Wire Wire Line
	2500 5500 950  5500
Wire Wire Line
	950  5650 2600 5650
Wire Wire Line
	4150 5350 4150 4850
Connection ~ 4150 4850
Wire Wire Line
	4300 5000 4300 5350
Connection ~ 4300 5000
Wire Wire Line
	6650 1800 7300 1800
Wire Wire Line
	6800 1900 7300 1900
Wire Wire Line
	6850 2000 7300 2000
Wire Wire Line
	6900 2100 7300 2100
Wire Wire Line
	6650 2400 6950 2400
Wire Wire Line
	7700 1800 10400 1800
Wire Wire Line
	7700 2500 7850 2500
Wire Wire Line
	7850 2500 7850 2700
Wire Wire Line
	7850 2700 10400 2700
Wire Wire Line
	7700 2400 7900 2400
Wire Wire Line
	7900 2400 7900 2600
Wire Wire Line
	7900 2600 10400 2600
Wire Wire Line
	7700 2300 7950 2300
Wire Wire Line
	7950 2300 7950 2500
Wire Wire Line
	7950 2500 10400 2500
Wire Wire Line
	7700 2200 8000 2200
Wire Wire Line
	8000 2200 8000 2400
Wire Wire Line
	8000 2400 10400 2400
Wire Wire Line
	6950 2400 6950 2200
Wire Wire Line
	6950 2200 7300 2200
Wire Wire Line
	7000 2550 7000 2300
Wire Wire Line
	7000 2300 7300 2300
Wire Wire Line
	7050 2700 7050 2400
Wire Wire Line
	7050 2400 7300 2400
Wire Wire Line
	7100 2850 7100 2500
Wire Wire Line
	7100 2500 7300 2500
Wire Wire Line
	4400 1900 4400 5000
Wire Wire Line
	4300 1800 4300 4850
Wire Wire Line
	3000 4850 3000 4250
Wire Wire Line
	3000 4250 3100 4250
Wire Wire Line
	3100 4150 2500 4150
Wire Wire Line
	2500 4150 2500 5500
Wire Wire Line
	3100 5000 3100 4450
Wire Wire Line
	3100 4350 2600 4350
Wire Wire Line
	2600 4350 2600 5650
Wire Wire Line
	3850 5350 3850 3400
Connection ~ 3850 3400
Wire Wire Line
	4000 5350 4000 3500
Connection ~ 4000 3500
Wire Wire Line
	2900 3400 2900 3750
Wire Wire Line
	2900 3750 3100 3750
Wire Wire Line
	3100 3850 2300 3850
Connection ~ 2300 3850
Wire Wire Line
	3000 3500 4750 3500
Wire Wire Line
	3000 3500 3000 3950
Wire Wire Line
	3000 3950 3100 3950
Wire Wire Line
	3100 4050 2400 4050
Connection ~ 2400 4050
Wire Wire Line
	3100 1500 2900 1500
Wire Wire Line
	2900 1500 2900 1550
Wire Wire Line
	6900 5350 6850 5350
Wire Wire Line
	6900 5450 6700 5450
Wire Wire Line
	7400 5350 7450 5350
Wire Wire Line
	7400 5450 7600 5450
Wire Wire Line
	7400 5650 7400 6050
Wire Wire Line
	6900 6050 7550 6050
Wire Wire Line
	6900 5650 6900 6050
Connection ~ 7400 6050
Wire Wire Line
	3250 1000 3250 1700
Wire Wire Line
	3450 1050 3250 1050
Connection ~ 3250 1050
Wire Wire Line
	6900 5550 6700 5550
Wire Wire Line
	6700 5550 6700 5600
Wire Wire Line
	7400 5550 7600 5550
Wire Wire Line
	7600 5550 7600 5600
Wire Wire Line
	4700 3400 4700 3250
Wire Wire Line
	5700 5200 7600 5200
Wire Wire Line
	6700 5450 6700 5200
Connection ~ 4700 3400
Connection ~ 6700 5200
Wire Wire Line
	6850 5350 6850 5100
Wire Wire Line
	5800 5100 7450 5100
Wire Wire Line
	4600 3150 4600 3500
Connection ~ 4600 3500
Connection ~ 6850 5100
Wire Wire Line
	7600 5200 7600 5450
Wire Wire Line
	7450 5100 7450 5350
Wire Wire Line
	5800 5100 5800 3150
Wire Wire Line
	5800 3150 4600 3150
Wire Wire Line
	5700 5200 5700 3250
Wire Wire Line
	5700 3250 4700 3250
Wire Wire Line
	6200 3750 6200 3800
Wire Wire Line
	6600 3750 6600 3800
Wire Wire Line
	6200 4300 6200 4350
Wire Wire Line
	6600 4300 6600 4350
Wire Wire Line
	6200 4950 6200 5200
Connection ~ 6200 5200
Wire Wire Line
	6600 4950 6600 5100
Connection ~ 6600 5100
Text Notes 5000 1500 0    60   ~ 0
Note 1:  Pmod P2 (analog) pin usage\nP2.1  -->  DAC output\nP2.2  -->  DAC output\nP2.3  -->  ADC input\nP2.4  -->  ADC input
Text Notes 5850 3550 0    60   ~ 0
Note 2:  Pmod P3 (digital) pin usage\nP3.1  -->  GPIO only\nP3.2  -->  GPIO, peripheral pin select\nP3.3  -->  GPIO, peripheral pin select\nP3.4  -->  GPIO only
Text Notes 9300 1600 0    60   ~ 0
Note 3:  Pmod P4 (digital) pin usage\nP4.1  -->  GPIO only\nP4.2  -->  GPIO, peripheral pin select\nP4.3  -->  GPIO, peripheral pin select\nP4.4  -->  GPIO, peripheral pin select\nP4.7  -->  GPIO only\nP4.8  -->  GPIO, peripheral pin select\nP4.9  -->  GPIO, peripheral pin select\nP4.10 -->  GPIO, peripheral pin select
Text Notes 7700 5450 0    60   ~ 0
Note 4:  Pmod P5 (I2C) pin usage\nP5.1  -->  SCL\nP5.2  -->  SCL\nP5.3  -->  SDA\nP5.4  -->  SDA
Text Notes 700  7050 0    60   ~ 0
Note 6: Set JP1 in EN (pins 1-2) position in order to enable the DAC device.\n        Otherwise, set JP1 in DIS (pins 2-3) position.
Text Notes 700  7300 0    60   ~ 0
Note 7: Pmod P2 (analog), P3 (digital) and P5 (I2C) usage are mutually\n        exclusive: only use one of them at same time.
Text Notes 7700 5700 0    60   ~ 0
Note 5: Set JP5 and JP6 (I2C Pull-up) in ordre to use I2C function.\n        Otherwise, let JP5 and JP6 not connected.
Text Notes 700  7550 0    60   ~ 0
Note 8: Peripheral Pin Select (PPS) function allows to mux peripheral\n        input/output to MCU pins: UART, OC (PWM), IC, SPI, etc.
Text Notes 1300 3350 0    60   ~ 0
Bootloader/\nUser button
Text Notes 750  1400 0    60   ~ 0
Note 9: User LED D2 and User button SW2 are\n        mutually exclusive: only one of them can\n        be used in same time.
Text Notes 2100 1800 0    60   ~ 0
User LED
$EndSCHEMATC
