EESchema Schematic File Version 2
LIBS:power
LIBS:device
LIBS:transistors
LIBS:conn
LIBS:linear
LIBS:regul
LIBS:74xx
LIBS:cmos4000
LIBS:adc-dac
LIBS:memory
LIBS:xilinx
LIBS:special
LIBS:microcontrollers
LIBS:dsp
LIBS:microchip
LIBS:analog_switches
LIBS:motorola
LIBS:texas
LIBS:intel
LIBS:audio
LIBS:interface
LIBS:digital-audio
LIBS:philips
LIBS:display
LIBS:cypress
LIBS:siliconi
LIBS:opto
LIBS:atmel
LIBS:contrib
LIBS:valves
LIBS:TechnoBoard-cache
EELAYER 25 0
EELAYER END
$Descr A4 11693 8268
encoding utf-8
Sheet 2 3
Title "TechnoBoard Model 1"
Date "Mon 23 mar 2015"
Rev "A"
Comp "Copyright 2015, Jean-Sébastien Castonguay"
Comment1 "Licensed under the Creative Commons Attribution-ShareAlike (BY-SA) license "
Comment2 ""
Comment3 ""
Comment4 ""
$EndDescr
$Comp
L LM1084IS-3.3/NOPB U2
U 1 1 53580C83
P 9550 1850
F 0 "U2" H 9750 1650 40  0000 C CNN
F 1 "AP1117IE33G-13" H 9300 2050 40  0000 L CNN
F 2 "ok-ic-smd:SOT223" H 9550 1950 30  0000 C CIN
F 3 "" H 9550 1850 60  0000 C CNN
	1    9550 1850
	1    0    0    -1  
$EndComp
$Comp
L PIC24FJ64GB002 U1
U 1 1 53580C89
P 1850 6000
F 0 "U1" H 2350 6150 60  0000 C CNN
F 1 "PIC24FJ64GB002" H 4900 8400 60  0000 C CNN
F 2 "Sockets_DIP:DIP-28__300" H 3050 7250 60  0001 C CNN
F 3 "" H 3050 7250 60  0000 C CNN
	1    1850 6000
	1    0    0    -1  
$EndComp
$Comp
L CRYSTAL X1
U 1 1 53580C8F
P 950 6150
F 0 "X1" H 950 6300 60  0000 C CNN
F 1 "ATS080B" H 950 6000 60  0000 C CNN
F 2 "ATS080B:ATS080B" H 950 6150 60  0001 C CNN
F 3 "" H 950 6150 60  0000 C CNN
	1    950  6150
	-1   0    0    1   
$EndComp
$Comp
L CP1 C11
U 1 1 53580C95
P 10050 2350
F 0 "C11" H 10100 2450 50  0000 L CNN
F 1 "10uF" H 10100 2250 50  0000 L CNN
F 2 "Discret:C1V5" H 10050 2350 60  0001 C CNN
F 3 "" H 10050 2350 60  0000 C CNN
	1    10050 2350
	1    0    0    -1  
$EndComp
$Comp
L C C1
U 1 1 53580C9B
P 650 6500
F 0 "C1" H 650 6600 40  0000 L CNN
F 1 "22pF" H 656 6415 40  0000 L CNN
F 2 "Discret:C1" H 688 6350 30  0001 C CNN
F 3 "" H 650 6500 60  0000 C CNN
	1    650  6500
	1    0    0    -1  
$EndComp
$Comp
L LED D1
U 1 1 53580CA1
P 10850 2000
F 0 "D1" H 10850 2100 50  0000 C CNN
F 1 "475-2766-1-ND" H 11000 1900 50  0000 C CNN
F 2 "T67K:T67K" H 10850 2000 60  0001 C CNN
F 3 "" H 10850 2000 60  0000 C CNN
	1    10850 2000
	0    1    1    0   
$EndComp
$Comp
L R R5
U 1 1 53580CA7
P 10850 2550
F 0 "R5" V 10950 2550 40  0000 C CNN
F 1 "750" V 10857 2551 40  0000 C CNN
F 2 "R3_ref:R3_ref" V 10780 2550 30  0001 C CNN
F 3 "" H 10850 2550 30  0000 C CNN
	1    10850 2550
	1    0    0    -1  
$EndComp
$Comp
L SW_PUSH SW1
U 1 1 53580CAD
P 2950 1600
F 0 "SW1" H 3100 1710 50  0000 C CNN
F 1 "EG4385CT-ND" H 2950 1520 50  0000 C CNN
F 2 "smt_btn:smt_btn" H 2950 1600 60  0001 C CNN
F 3 "" H 2950 1600 60  0000 C CNN
	1    2950 1600
	1    0    0    -1  
$EndComp
$Comp
L CONN_6 P1
U 1 1 53580CB9
P 750 4100
F 0 "P1" V 700 4100 60  0000 C CNN
F 1 "CONN_6" V 800 4100 60  0000 C CNN
F 2 "Pin_Headers:Pin_Header_Straight_1x06" H 750 4100 60  0001 C CNN
F 3 "" H 750 4100 60  0000 C CNN
	1    750  4100
	-1   0    0    -1  
$EndComp
$Comp
L +3,3V #PWR01
U 1 1 53580CBF
P 10850 1700
F 0 "#PWR01" H 10850 1660 30  0001 C CNN
F 1 "+3,3V" H 10850 1810 30  0000 C CNN
F 2 "" H 10850 1700 60  0000 C CNN
F 3 "" H 10850 1700 60  0000 C CNN
	1    10850 1700
	1    0    0    -1  
$EndComp
$Comp
L GND #PWR02
U 1 1 53580CC5
P 10850 2900
F 0 "#PWR02" H 10850 2900 30  0001 C CNN
F 1 "GND" H 10850 2830 30  0001 C CNN
F 2 "" H 10850 2900 60  0000 C CNN
F 3 "" H 10850 2900 60  0000 C CNN
	1    10850 2900
	1    0    0    -1  
$EndComp
$Comp
L C C2
U 1 1 53580CCB
P 1250 6500
F 0 "C2" H 1250 6600 40  0000 L CNN
F 1 "22pF" H 1256 6415 40  0000 L CNN
F 2 "Discret:C1" H 1288 6350 30  0001 C CNN
F 3 "" H 1250 6500 60  0000 C CNN
	1    1250 6500
	1    0    0    -1  
$EndComp
$Comp
L GND #PWR03
U 1 1 53580CD1
P 1250 6850
F 0 "#PWR03" H 1250 6850 30  0001 C CNN
F 1 "GND" H 1250 6780 30  0001 C CNN
F 2 "" H 1250 6850 60  0000 C CNN
F 3 "" H 1250 6850 60  0000 C CNN
	1    1250 6850
	1    0    0    -1  
$EndComp
$Comp
L GND #PWR04
U 1 1 53580CD7
P 650 6850
F 0 "#PWR04" H 650 6850 30  0001 C CNN
F 1 "GND" H 650 6780 30  0001 C CNN
F 2 "" H 650 6850 60  0000 C CNN
F 3 "" H 650 6850 60  0000 C CNN
	1    650  6850
	1    0    0    -1  
$EndComp
$Comp
L C C5
U 1 1 53580CDD
P 2600 1850
F 0 "C5" H 2600 1950 40  0000 L CNN
F 1 "0.1uF" H 2606 1765 40  0000 L CNN
F 2 "Discret:C1" H 2638 1700 30  0001 C CNN
F 3 "" H 2600 1850 60  0000 C CNN
	1    2600 1850
	1    0    0    -1  
$EndComp
$Comp
L R R3
U 1 1 53580CE3
P 2600 1300
F 0 "R3" V 2700 1300 40  0000 C CNN
F 1 "10k" V 2607 1301 40  0000 C CNN
F 2 "R3_ref:R3_ref" V 2530 1300 30  0001 C CNN
F 3 "" H 2600 1300 30  0000 C CNN
	1    2600 1300
	1    0    0    -1  
$EndComp
$Comp
L GND #PWR05
U 1 1 53580CE9
P 2600 2150
F 0 "#PWR05" H 2600 2150 30  0001 C CNN
F 1 "GND" H 2600 2080 30  0001 C CNN
F 2 "" H 2600 2150 60  0000 C CNN
F 3 "" H 2600 2150 60  0000 C CNN
	1    2600 2150
	1    0    0    -1  
$EndComp
$Comp
L +3,3V #PWR06
U 1 1 53580CF5
P 2600 1000
F 0 "#PWR06" H 2600 960 30  0001 C CNN
F 1 "+3,3V" H 2600 1110 30  0000 C CNN
F 2 "" H 2600 1000 60  0000 C CNN
F 3 "" H 2600 1000 60  0000 C CNN
	1    2600 1000
	1    0    0    -1  
$EndComp
Text GLabel 1800 3850 0    60   BiDi ~ 0
RA0
Text GLabel 1800 4000 0    60   BiDi ~ 0
RA1
$Comp
L +3,3V #PWR07
U 1 1 53580CFD
P 1300 3050
F 0 "#PWR07" H 1300 3010 30  0001 C CNN
F 1 "+3,3V" H 1300 3160 30  0000 C CNN
F 2 "" H 1300 3050 60  0000 C CNN
F 3 "" H 1300 3050 60  0000 C CNN
	1    1300 3050
	1    0    0    -1  
$EndComp
$Comp
L GND #PWR08
U 1 1 53580D03
P 1300 4450
F 0 "#PWR08" H 1300 4450 30  0001 C CNN
F 1 "GND" H 1300 4380 30  0001 C CNN
F 2 "" H 1300 4450 60  0000 C CNN
F 3 "" H 1300 4450 60  0000 C CNN
	1    1300 4450
	1    0    0    -1  
$EndComp
$Comp
L GND #PWR09
U 1 1 53580D09
P 1950 4800
F 0 "#PWR09" H 1950 4800 30  0001 C CNN
F 1 "GND" H 1950 4730 30  0001 C CNN
F 2 "" H 1950 4800 60  0000 C CNN
F 3 "" H 1950 4800 60  0000 C CNN
	1    1950 4800
	1    0    0    -1  
$EndComp
$Comp
L C C4
U 1 1 53580D0F
P 1700 6500
F 0 "C4" H 1700 6600 40  0000 L CNN
F 1 "0.1uF" H 1706 6415 40  0000 L CNN
F 2 "Discret:C1" H 1738 6350 30  0001 C CNN
F 3 "" H 1700 6500 60  0000 C CNN
	1    1700 6500
	1    0    0    -1  
$EndComp
$Comp
L +3,3V #PWR010
U 1 1 53580D15
P 1950 5500
F 0 "#PWR010" H 1950 5460 30  0001 C CNN
F 1 "+3,3V" H 1950 5610 30  0000 C CNN
F 2 "" H 1950 5500 60  0000 C CNN
F 3 "" H 1950 5500 60  0000 C CNN
	1    1950 5500
	1    0    0    -1  
$EndComp
$Comp
L GND #PWR011
U 1 1 53580D1B
P 1700 6850
F 0 "#PWR011" H 1700 6850 30  0001 C CNN
F 1 "GND" H 1700 6780 30  0001 C CNN
F 2 "" H 1700 6850 60  0000 C CNN
F 3 "" H 1700 6850 60  0000 C CNN
	1    1700 6850
	1    0    0    -1  
$EndComp
$Comp
L +3,3V #PWR012
U 1 1 53580D21
P 1700 6200
F 0 "#PWR012" H 1700 6160 30  0001 C CNN
F 1 "+3,3V" H 1700 6310 30  0000 C CNN
F 2 "" H 1700 6200 60  0000 C CNN
F 3 "" H 1700 6200 60  0000 C CNN
	1    1700 6200
	1    0    0    -1  
$EndComp
Text GLabel 1800 4450 0    60   BiDi ~ 0
RB2
Text GLabel 1800 4600 0    60   BiDi ~ 0
RB3
Text GLabel 1800 5200 0    60   BiDi ~ 0
RB4
Text GLabel 1800 5350 0    60   BiDi ~ 0
RA4
Text GLabel 1800 5650 0    60   BiDi ~ 0
RB5
$Comp
L GND #PWR013
U 1 1 53580D2C
P 9950 4350
F 0 "#PWR013" H 9950 4350 30  0001 C CNN
F 1 "GND" H 9950 4280 30  0001 C CNN
F 2 "" H 9950 4350 60  0000 C CNN
F 3 "" H 9950 4350 60  0000 C CNN
	1    9950 4350
	1    0    0    -1  
$EndComp
$Comp
L R R4
U 1 1 53580D38
P 8900 3250
F 0 "R4" V 9000 3250 40  0000 C CNN
F 1 "10k" V 8907 3251 40  0000 C CNN
F 2 "R3_ref:R3_ref" V 8830 3250 30  0001 C CNN
F 3 "" H 8900 3250 30  0000 C CNN
	1    8900 3250
	0    -1   -1   0   
$EndComp
$Comp
L GND #PWR014
U 1 1 53580D6B
P 10050 2900
F 0 "#PWR014" H 10050 2900 30  0001 C CNN
F 1 "GND" H 10050 2830 30  0001 C CNN
F 2 "" H 10050 2900 60  0000 C CNN
F 3 "" H 10050 2900 60  0000 C CNN
	1    10050 2900
	1    0    0    -1  
$EndComp
$Comp
L GND #PWR015
U 1 1 53580D71
P 9550 2900
F 0 "#PWR015" H 9550 2900 30  0001 C CNN
F 1 "GND" H 9550 2830 30  0001 C CNN
F 2 "" H 9550 2900 60  0000 C CNN
F 3 "" H 9550 2900 60  0000 C CNN
	1    9550 2900
	1    0    0    -1  
$EndComp
$Comp
L C C6
U 1 1 53580D7B
P 7100 2700
F 0 "C6" H 7100 2800 40  0000 L CNN
F 1 "0.1uF" H 7106 2615 40  0000 L CNN
F 2 "Discret:C1" H 7138 2550 30  0001 C CNN
F 3 "" H 7100 2700 60  0000 C CNN
	1    7100 2700
	1    0    0    -1  
$EndComp
$Comp
L GND #PWR016
U 1 1 53580D81
P 7100 3050
F 0 "#PWR016" H 7100 3050 30  0001 C CNN
F 1 "GND" H 7100 2980 30  0001 C CNN
F 2 "" H 7100 3050 60  0000 C CNN
F 3 "" H 7100 3050 60  0000 C CNN
	1    7100 3050
	1    0    0    -1  
$EndComp
$Comp
L +3,3V #PWR017
U 1 1 53580D87
P 7100 2400
F 0 "#PWR017" H 7100 2360 30  0001 C CNN
F 1 "+3,3V" H 7100 2510 30  0000 C CNN
F 2 "" H 7100 2400 60  0000 C CNN
F 3 "" H 7100 2400 60  0000 C CNN
	1    7100 2400
	1    0    0    -1  
$EndComp
$Comp
L +3,3V #PWR018
U 1 1 53580D8F
P 7650 3700
F 0 "#PWR018" H 7650 3660 30  0001 C CNN
F 1 "+3,3V" H 7650 3810 30  0000 C CNN
F 2 "" H 7650 3700 60  0000 C CNN
F 3 "" H 7650 3700 60  0000 C CNN
	1    7650 3700
	1    0    0    -1  
$EndComp
$Comp
L GND #PWR019
U 1 1 53580D95
P 7650 3900
F 0 "#PWR019" H 7650 3900 30  0001 C CNN
F 1 "GND" H 7650 3830 30  0001 C CNN
F 2 "" H 7650 3900 60  0000 C CNN
F 3 "" H 7650 3900 60  0000 C CNN
	1    7650 3900
	1    0    0    -1  
$EndComp
$Comp
L +3,3V #PWR020
U 1 1 53580DA0
P 7650 4450
F 0 "#PWR020" H 7650 4410 30  0001 C CNN
F 1 "+3,3V" H 7650 4560 30  0000 C CNN
F 2 "" H 7650 4450 60  0000 C CNN
F 3 "" H 7650 4450 60  0000 C CNN
	1    7650 4450
	1    0    0    -1  
$EndComp
$Comp
L C C7
U 1 1 53580DA7
P 7450 2700
F 0 "C7" H 7450 2800 40  0000 L CNN
F 1 "0.1uF" H 7456 2615 40  0000 L CNN
F 2 "Discret:C1" H 7488 2550 30  0001 C CNN
F 3 "" H 7450 2700 60  0000 C CNN
	1    7450 2700
	1    0    0    -1  
$EndComp
$Comp
L GND #PWR021
U 1 1 53580DAD
P 7450 3050
F 0 "#PWR021" H 7450 3050 30  0001 C CNN
F 1 "GND" H 7450 2980 30  0001 C CNN
F 2 "" H 7450 3050 60  0000 C CNN
F 3 "" H 7450 3050 60  0000 C CNN
	1    7450 3050
	1    0    0    -1  
$EndComp
$Comp
L +3,3V #PWR022
U 1 1 53580DB3
P 7450 2400
F 0 "#PWR022" H 7450 2360 30  0001 C CNN
F 1 "+3,3V" H 7450 2510 30  0000 C CNN
F 2 "" H 7450 2400 60  0000 C CNN
F 3 "" H 7450 2400 60  0000 C CNN
	1    7450 2400
	1    0    0    -1  
$EndComp
$Comp
L CP1 C8
U 1 1 53580DBB
P 8350 5100
F 0 "C8" H 8400 5200 50  0000 L CNN
F 1 "10uF" H 8400 5000 50  0000 L CNN
F 2 "Discret:C1V5" H 8350 5100 60  0001 C CNN
F 3 "" H 8350 5100 60  0000 C CNN
	1    8350 5100
	1    0    0    -1  
$EndComp
$Comp
L GND #PWR023
U 1 1 53580DC5
P 8350 5350
F 0 "#PWR023" H 8350 5350 30  0001 C CNN
F 1 "GND" H 8350 5280 30  0001 C CNN
F 2 "" H 8350 5350 60  0000 C CNN
F 3 "" H 8350 5350 60  0000 C CNN
	1    8350 5350
	1    0    0    -1  
$EndComp
Text GLabel 7750 4000 2    60   BiDi ~ 0
RB15
Text GLabel 7750 4150 2    60   BiDi ~ 0
RB14
Text GLabel 7750 4300 2    60   BiDi ~ 0
RB13
Text GLabel 7750 5200 2    60   BiDi ~ 0
RB9
Text GLabel 7750 5350 2    60   BiDi ~ 0
RB8
Text GLabel 7750 5500 2    60   BiDi ~ 0
RB7
$Comp
L +5V #PWR024
U 1 1 53586677
P 9800 3100
F 0 "#PWR024" H 9800 3190 20  0001 C CNN
F 1 "+5V" H 9800 3190 30  0000 C CNN
F 2 "" H 9800 3100 60  0000 C CNN
F 3 "" H 9800 3100 60  0000 C CNN
	1    9800 3100
	1    0    0    -1  
$EndComp
Wire Wire Line
	650  4900 650  6300
Wire Wire Line
	1250 5050 1250 6300
Wire Wire Line
	650  6700 650  6850
Wire Wire Line
	1250 6700 1250 6850
Wire Wire Line
	10850 2800 10850 2900
Wire Wire Line
	10850 2200 10850 2300
Wire Wire Line
	10850 1800 10850 1700
Wire Wire Line
	1100 4150 2000 4150
Wire Wire Line
	1100 4250 2000 4250
Wire Wire Line
	2000 4250 2000 4300
Wire Wire Line
	2600 2050 2600 2150
Wire Wire Line
	2600 1000 2600 1050
Wire Wire Line
	2000 3850 1800 3850
Wire Wire Line
	2000 4000 1800 4000
Wire Wire Line
	1300 3950 1100 3950
Wire Wire Line
	1300 3050 1300 3950
Wire Wire Line
	1100 4050 1300 4050
Wire Wire Line
	1300 4050 1300 4450
Wire Wire Line
	2000 4900 650  4900
Connection ~ 650  6150
Wire Wire Line
	2000 5050 1250 5050
Connection ~ 1250 6150
Wire Wire Line
	1950 4800 1950 4750
Wire Wire Line
	1950 4750 2000 4750
Wire Wire Line
	2000 5500 1950 5500
Wire Wire Line
	1700 6200 1700 6300
Wire Wire Line
	1700 6700 1700 6850
Wire Wire Line
	1800 4450 2000 4450
Wire Wire Line
	1800 4600 2000 4600
Wire Wire Line
	1800 5200 2000 5200
Wire Wire Line
	1800 5350 2000 5350
Wire Wire Line
	1800 5650 2000 5650
Wire Wire Line
	7600 4750 10500 4750
Wire Wire Line
	7600 4600 10350 4600
Wire Wire Line
	9550 2100 9550 2900
Wire Wire Line
	10050 2550 10050 2900
Wire Wire Line
	7100 2400 7100 2500
Wire Wire Line
	7100 2900 7100 3050
Wire Wire Line
	7600 3700 7650 3700
Wire Wire Line
	7600 3850 7650 3850
Wire Wire Line
	7650 3850 7650 3900
Wire Wire Line
	7600 4450 7650 4450
Wire Wire Line
	7450 2400 7450 2500
Wire Wire Line
	7450 2900 7450 3050
Wire Wire Line
	7600 5050 8200 5050
Wire Wire Line
	8200 5050 8200 5300
Wire Wire Line
	8200 5300 8350 5300
Wire Wire Line
	8350 5300 8350 5350
Connection ~ 8350 5300
Wire Wire Line
	7600 4000 7750 4000
Wire Wire Line
	7600 4150 7750 4150
Wire Wire Line
	7600 4300 7750 4300
Wire Wire Line
	7600 5200 7750 5200
Wire Wire Line
	7600 5500 7750 5500
Wire Wire Line
	1100 1600 1100 3850
Wire Wire Line
	2000 1600 2000 3700
Connection ~ 2600 1600
Wire Wire Line
	8600 5650 7600 5650
NoConn ~ 1100 4350
Wire Wire Line
	9950 3450 9950 4350
Wire Wire Line
	7600 4900 8350 4900
Wire Wire Line
	8600 5650 8600 3250
Wire Wire Line
	8600 3250 8650 3250
Wire Wire Line
	7750 5350 7600 5350
$Comp
L R R2
U 1 1 53A06EA4
P 2300 1600
F 0 "R2" V 2380 1600 40  0000 C CNN
F 1 "1k" V 2307 1601 40  0000 C CNN
F 2 "R3_ref:R3_ref" V 2230 1600 30  0001 C CNN
F 3 "" H 2300 1600 30  0000 C CNN
	1    2300 1600
	0    -1   -1   0   
$EndComp
Wire Wire Line
	2550 1600 2650 1600
Wire Wire Line
	2600 1550 2600 1650
$Comp
L R R1
U 1 1 53A06FE5
P 1550 1600
F 0 "R1" V 1630 1600 40  0000 C CNN
F 1 "200" V 1557 1601 40  0000 C CNN
F 2 "R3_ref:R3_ref" V 1480 1600 30  0001 C CNN
F 3 "" H 1550 1600 30  0000 C CNN
	1    1550 1600
	0    -1   -1   0   
$EndComp
Wire Wire Line
	1800 1600 2050 1600
$Comp
L GND #PWR025
U 1 1 53A0703B
P 3300 2150
F 0 "#PWR025" H 3300 2150 30  0001 C CNN
F 1 "GND" H 3300 2080 30  0001 C CNN
F 2 "" H 3300 2150 60  0000 C CNN
F 3 "" H 3300 2150 60  0000 C CNN
	1    3300 2150
	1    0    0    -1  
$EndComp
Wire Wire Line
	3250 1600 3300 1600
Wire Wire Line
	3300 1600 3300 2150
$Comp
L C C3
U 1 1 53A07098
P 1550 3300
F 0 "C3" H 1550 3400 40  0000 L CNN
F 1 "0.1uF" H 1556 3215 40  0000 L CNN
F 2 "Discret:C1" H 1588 3150 30  0001 C CNN
F 3 "" H 1550 3300 60  0000 C CNN
	1    1550 3300
	1    0    0    -1  
$EndComp
Connection ~ 2000 1600
$Comp
L GND #PWR026
U 1 1 53A0719E
P 1550 3550
F 0 "#PWR026" H 1550 3550 30  0001 C CNN
F 1 "GND" H 1550 3480 30  0001 C CNN
F 2 "" H 1550 3550 60  0000 C CNN
F 3 "" H 1550 3550 60  0000 C CNN
	1    1550 3550
	1    0    0    -1  
$EndComp
Wire Wire Line
	1550 3100 1300 3100
Connection ~ 1300 3100
Wire Wire Line
	1550 3500 1550 3550
Wire Wire Line
	1100 1600 1300 1600
Wire Wire Line
	8450 1800 9150 1800
Connection ~ 9150 1800
Connection ~ 8850 1800
$Comp
L GND #PWR027
U 1 1 53A07BEB
P 10450 2900
F 0 "#PWR027" H 10450 2900 30  0001 C CNN
F 1 "GND" H 10450 2830 30  0001 C CNN
F 2 "" H 10450 2900 60  0000 C CNN
F 3 "" H 10450 2900 60  0000 C CNN
	1    10450 2900
	1    0    0    -1  
$EndComp
Wire Wire Line
	10450 2550 10450 2900
Wire Wire Line
	10450 1800 10450 2150
Connection ~ 10450 1800
Wire Wire Line
	10050 2150 10050 1800
Connection ~ 10050 1800
Wire Wire Line
	9950 1800 10850 1800
Connection ~ 10850 1800
$Comp
L CP1 C9
U 1 1 53A07F60
P 8450 2350
F 0 "C9" H 8500 2450 50  0000 L CNN
F 1 "10uF" H 8500 2250 50  0000 L CNN
F 2 "Discret:C1V5" H 8450 2350 60  0001 C CNN
F 3 "" H 8450 2350 60  0000 C CNN
	1    8450 2350
	1    0    0    -1  
$EndComp
$Comp
L GND #PWR028
U 1 1 53A07F66
P 8450 2900
F 0 "#PWR028" H 8450 2900 30  0001 C CNN
F 1 "GND" H 8450 2830 30  0001 C CNN
F 2 "" H 8450 2900 60  0000 C CNN
F 3 "" H 8450 2900 60  0000 C CNN
	1    8450 2900
	1    0    0    -1  
$EndComp
$Comp
L GND #PWR029
U 1 1 53A07F73
P 8850 2900
F 0 "#PWR029" H 8850 2900 30  0001 C CNN
F 1 "GND" H 8850 2830 30  0001 C CNN
F 2 "" H 8850 2900 60  0000 C CNN
F 3 "" H 8850 2900 60  0000 C CNN
	1    8850 2900
	1    0    0    -1  
$EndComp
Wire Wire Line
	8450 1800 8450 2150
Wire Wire Line
	8850 2150 8850 1800
Wire Wire Line
	8450 2550 8450 2900
Wire Wire Line
	8850 2550 8850 2900
Wire Wire Line
	9150 3250 10500 3250
Connection ~ 9150 3250
Connection ~ 9100 4600
$Comp
L GND #PWR030
U 1 1 53A0946A
P 9100 5450
F 0 "#PWR030" H 9100 5450 30  0001 C CNN
F 1 "GND" H 9100 5380 30  0001 C CNN
F 2 "" H 9100 5450 60  0000 C CNN
F 3 "" H 9100 5450 60  0000 C CNN
	1    9100 5450
	1    0    0    -1  
$EndComp
$Comp
L GND #PWR031
U 1 1 53A09470
P 9450 5450
F 0 "#PWR031" H 9450 5450 30  0001 C CNN
F 1 "GND" H 9450 5380 30  0001 C CNN
F 2 "" H 9450 5450 60  0000 C CNN
F 3 "" H 9450 5450 60  0000 C CNN
	1    9450 5450
	1    0    0    -1  
$EndComp
$Comp
L USB J1
U 1 1 53A1BA65
P 10700 3900
F 0 "J1" H 10650 4300 60  0000 C CNN
F 1 "USB-B1HSB6" V 10450 4050 60  0000 C CNN
F 2 "Connect:USB_B" H 10700 3900 60  0001 C CNN
F 3 "" H 10700 3900 60  0000 C CNN
	1    10700 3900
	0    1    1    0   
$EndComp
Wire Wire Line
	9150 1800 9150 3250
Wire Wire Line
	10500 3250 10500 3500
Wire Wire Line
	10350 4600 10350 4250
Wire Wire Line
	10500 4750 10500 4250
Wire Wire Line
	9800 3100 9800 3250
Connection ~ 9800 3250
Wire Wire Line
	10350 3450 10350 3500
Wire Wire Line
	9950 3450 10350 3450
Wire Wire Line
	10250 3500 10250 3450
Connection ~ 10250 3450
Wire Wire Line
	10250 4250 9950 4250
Connection ~ 9950 4250
$Comp
L C C10
U 1 1 53A1C804
P 8850 2350
F 0 "C10" H 8850 2450 40  0000 L CNN
F 1 "0.1uF" H 8856 2265 40  0000 L CNN
F 2 "Discret:C1" H 8888 2200 30  0001 C CNN
F 3 "" H 8850 2350 60  0000 C CNN
	1    8850 2350
	1    0    0    -1  
$EndComp
$Comp
L C C12
U 1 1 53A1C80A
P 10450 2350
F 0 "C12" H 10450 2450 40  0000 L CNN
F 1 "0.1uF" H 10456 2265 40  0000 L CNN
F 2 "Discret:C1" H 10488 2200 30  0001 C CNN
F 3 "" H 10450 2350 60  0000 C CNN
	1    10450 2350
	1    0    0    -1  
$EndComp
$Comp
L VR VR3
U 1 1 54FA5374
P 9100 5100
F 0 "VR3" V 9160 5054 50  0000 C TNN
F 1 "CG0603MLC-05LE" V 9000 5100 50  0000 C CNN
F 2 "Resistors_SMD:R_0603_HandSoldering" H 9450 4600 60  0000 C CNN
F 3 "" H 9100 5100 60  0000 C CNN
	1    9100 5100
	1    0    0    -1  
$EndComp
Wire Wire Line
	9100 4600 9100 4850
Wire Wire Line
	9100 5350 9100 5450
$Comp
L VR VR1
U 1 1 54FA5C85
P 9450 5100
F 0 "VR1" V 9510 5054 50  0000 C TNN
F 1 "CG0603MLC-05LE" V 9350 5100 50  0000 C CNN
F 2 "Resistors_SMD:R_0603_HandSoldering" H 9450 4500 60  0000 C CNN
F 3 "" H 9450 5100 60  0000 C CNN
	1    9450 5100
	1    0    0    -1  
$EndComp
Wire Wire Line
	9450 5350 9450 5450
Wire Wire Line
	9450 4850 9450 4750
Connection ~ 9450 4750
Text Notes 2800 1400 0    60   ~ 0
Reset button
Text Notes 600  3750 0    60   ~ 0
ICSP\nconnector
$EndSCHEMATC
