(export (version D)
  (design
    (source /home/jsc/Documents/cegep/technoboard/hw/board/TechnoBoard.sch)
    (date "lun 23 mar 2015 15:43:59 EDT")
    (tool "Eeschema (2015-03-05 BZR 5480)-product")
    (sheet (number 1) (name /) (tstamps /)
      (title_block
        (title "TechnoBoard Model 1")
        (company "Copyright 2015, Jean-Sébastien Castonguay")
        (rev A)
        (date "TBD 2015")
        (source TechnoBoard.sch)
        (comment (number 1) (value "Licensed under the Creative Commons Attribution-ShareAlike (BY-SA) license "))
        (comment (number 2) (value ""))
        (comment (number 3) (value ""))
        (comment (number 4) (value ""))))
    (sheet (number 2) (name "/MCU, Power supply and comm/") (tstamps /5358078D/)
      (title_block
        (title "TechnoBoard Model 1")
        (company "Copyright 2015, Jean-Sébastien Castonguay")
        (rev A)
        (date "TBD 2015")
        (source MCU.sch)
        (comment (number 1) (value "Licensed under the Creative Commons Attribution-ShareAlike (BY-SA) license "))
        (comment (number 2) (value ""))
        (comment (number 3) (value ""))
        (comment (number 4) (value ""))))
    (sheet (number 3) (name "/PMOD, LED and Button/") (tstamps /53581084/)
      (title_block
        (title "TechnoBoard Model 1")
        (company "Copyright 2015, Jean-Sébastien Castonguay")
        (rev A)
        (date "TBD 2015")
        (source pmod.sch)
        (comment (number 1) (value "Licensed under the Creative Commons Attribution-ShareAlike (BY-SA) license "))
        (comment (number 2) (value ""))
        (comment (number 3) (value ""))
        (comment (number 4) (value "")))))
  (components
    (comp (ref U2)
      (value AP1117IE33G-13)
      (footprint ok-ic-smd:SOT223)
      (libsource (lib regul) (part LM1084IS-3.3/NOPB))
      (sheetpath (names "/MCU, Power supply and comm/") (tstamps /5358078D/))
      (tstamp 53580C83))
    (comp (ref U1)
      (value PIC24FJ64GB002)
      (footprint Sockets_DIP:DIP-28__300)
      (libsource (lib pic24fj64gb002) (part PIC24FJ64GB002))
      (sheetpath (names "/MCU, Power supply and comm/") (tstamps /5358078D/))
      (tstamp 53580C89))
    (comp (ref X1)
      (value ATS080B)
      (footprint ATS080B:ATS080B)
      (libsource (lib device) (part CRYSTAL))
      (sheetpath (names "/MCU, Power supply and comm/") (tstamps /5358078D/))
      (tstamp 53580C8F))
    (comp (ref C11)
      (value 10uF)
      (footprint Discret:C1V5)
      (libsource (lib device) (part CP1))
      (sheetpath (names "/MCU, Power supply and comm/") (tstamps /5358078D/))
      (tstamp 53580C95))
    (comp (ref C1)
      (value 22pF)
      (footprint Discret:C1)
      (libsource (lib device) (part C))
      (sheetpath (names "/MCU, Power supply and comm/") (tstamps /5358078D/))
      (tstamp 53580C9B))
    (comp (ref D1)
      (value 475-2766-1-ND)
      (footprint T67K:T67K)
      (libsource (lib device) (part LED))
      (sheetpath (names "/MCU, Power supply and comm/") (tstamps /5358078D/))
      (tstamp 53580CA1))
    (comp (ref R5)
      (value 750)
      (footprint R3_ref:R3_ref)
      (libsource (lib device) (part R))
      (sheetpath (names "/MCU, Power supply and comm/") (tstamps /5358078D/))
      (tstamp 53580CA7))
    (comp (ref SW1)
      (value EG4385CT-ND)
      (footprint smt_btn:smt_btn)
      (libsource (lib device) (part SW_PUSH))
      (sheetpath (names "/MCU, Power supply and comm/") (tstamps /5358078D/))
      (tstamp 53580CAD))
    (comp (ref P1)
      (value CONN_6)
      (footprint Pin_Headers:Pin_Header_Straight_1x06)
      (libsource (lib TechnoBoard-cache) (part CONN_6))
      (sheetpath (names "/MCU, Power supply and comm/") (tstamps /5358078D/))
      (tstamp 53580CB9))
    (comp (ref C2)
      (value 22pF)
      (footprint Discret:C1)
      (libsource (lib device) (part C))
      (sheetpath (names "/MCU, Power supply and comm/") (tstamps /5358078D/))
      (tstamp 53580CCB))
    (comp (ref C5)
      (value 0.1uF)
      (footprint Discret:C1)
      (libsource (lib device) (part C))
      (sheetpath (names "/MCU, Power supply and comm/") (tstamps /5358078D/))
      (tstamp 53580CDD))
    (comp (ref R3)
      (value 10k)
      (footprint R3_ref:R3_ref)
      (libsource (lib device) (part R))
      (sheetpath (names "/MCU, Power supply and comm/") (tstamps /5358078D/))
      (tstamp 53580CE3))
    (comp (ref C4)
      (value 0.1uF)
      (footprint Discret:C1)
      (libsource (lib device) (part C))
      (sheetpath (names "/MCU, Power supply and comm/") (tstamps /5358078D/))
      (tstamp 53580D0F))
    (comp (ref R4)
      (value 10k)
      (footprint R3_ref:R3_ref)
      (libsource (lib device) (part R))
      (sheetpath (names "/MCU, Power supply and comm/") (tstamps /5358078D/))
      (tstamp 53580D38))
    (comp (ref C6)
      (value 0.1uF)
      (footprint Discret:C1)
      (libsource (lib device) (part C))
      (sheetpath (names "/MCU, Power supply and comm/") (tstamps /5358078D/))
      (tstamp 53580D7B))
    (comp (ref C7)
      (value 0.1uF)
      (footprint Discret:C1)
      (libsource (lib device) (part C))
      (sheetpath (names "/MCU, Power supply and comm/") (tstamps /5358078D/))
      (tstamp 53580DA7))
    (comp (ref C8)
      (value 10uF)
      (footprint Discret:C1V5)
      (libsource (lib device) (part CP1))
      (sheetpath (names "/MCU, Power supply and comm/") (tstamps /5358078D/))
      (tstamp 53580DBB))
    (comp (ref R2)
      (value 1k)
      (footprint R3_ref:R3_ref)
      (libsource (lib device) (part R))
      (sheetpath (names "/MCU, Power supply and comm/") (tstamps /5358078D/))
      (tstamp 53A06EA4))
    (comp (ref R1)
      (value 200)
      (footprint R3_ref:R3_ref)
      (libsource (lib device) (part R))
      (sheetpath (names "/MCU, Power supply and comm/") (tstamps /5358078D/))
      (tstamp 53A06FE5))
    (comp (ref C3)
      (value 0.1uF)
      (footprint Discret:C1)
      (libsource (lib device) (part C))
      (sheetpath (names "/MCU, Power supply and comm/") (tstamps /5358078D/))
      (tstamp 53A07098))
    (comp (ref C9)
      (value 10uF)
      (footprint Discret:C1V5)
      (libsource (lib device) (part CP1))
      (sheetpath (names "/MCU, Power supply and comm/") (tstamps /5358078D/))
      (tstamp 53A07F60))
    (comp (ref J1)
      (value USB-B1HSB6)
      (footprint Connect:USB_B)
      (libsource (lib conn) (part USB))
      (sheetpath (names "/MCU, Power supply and comm/") (tstamps /5358078D/))
      (tstamp 53A1BA65))
    (comp (ref C10)
      (value 0.1uF)
      (footprint Discret:C1)
      (libsource (lib device) (part C))
      (sheetpath (names "/MCU, Power supply and comm/") (tstamps /5358078D/))
      (tstamp 53A1C804))
    (comp (ref C12)
      (value 0.1uF)
      (footprint Discret:C1)
      (libsource (lib device) (part C))
      (sheetpath (names "/MCU, Power supply and comm/") (tstamps /5358078D/))
      (tstamp 53A1C80A))
    (comp (ref VR3)
      (value CG0603MLC-05LE)
      (footprint Resistors_SMD:R_0603_HandSoldering)
      (libsource (lib device) (part VR))
      (sheetpath (names "/MCU, Power supply and comm/") (tstamps /5358078D/))
      (tstamp 54FA5374))
    (comp (ref VR1)
      (value CG0603MLC-05LE)
      (footprint Resistors_SMD:R_0603_HandSoldering)
      (libsource (lib device) (part VR))
      (sheetpath (names "/MCU, Power supply and comm/") (tstamps /5358078D/))
      (tstamp 54FA5C85))
    (comp (ref U3)
      (value MCP4822)
      (footprint Sockets_DIP:DIP-8__300)
      (libsource (lib mcp4822) (part MCP4822))
      (sheetpath (names "/PMOD, LED and Button/") (tstamps /53581084/))
      (tstamp 5358149F))
    (comp (ref D2)
      (value 475-2766-1-ND)
      (footprint T67K:T67K)
      (libsource (lib device) (part LED))
      (sheetpath (names "/PMOD, LED and Button/") (tstamps /53581084/))
      (tstamp 53581527))
    (comp (ref SW2)
      (value EG4385CT-ND)
      (footprint smt_btn:smt_btn)
      (libsource (lib device) (part SW_PUSH))
      (sheetpath (names "/PMOD, LED and Button/") (tstamps /53581084/))
      (tstamp 5358155E))
    (comp (ref P2)
      (value PMOD)
      (footprint Socket_Strips:Socket_Strip_Angled_1x06)
      (libsource (lib TechnoBoard-cache) (part CONN_6))
      (sheetpath (names "/PMOD, LED and Button/") (tstamps /53581084/))
      (tstamp 535816C0))
    (comp (ref P4)
      (value PMOD2)
      (footprint PMOD2:PMOD2)
      (libsource (lib TechnoBoard-cache) (part CONN_12))
      (sheetpath (names "/PMOD, LED and Button/") (tstamps /53581084/))
      (tstamp 535816DB))
    (comp (ref JP1)
      (value JUMPER3)
      (footprint Pin_Headers:Pin_Header_Straight_1x03)
      (libsource (lib device) (part JUMPER3))
      (sheetpath (names "/PMOD, LED and Button/") (tstamps /53581084/))
      (tstamp 535817E1))
    (comp (ref JP2)
      (value JUMPER3)
      (footprint Pin_Headers:Pin_Header_Straight_1x03)
      (libsource (lib device) (part JUMPER3))
      (sheetpath (names "/PMOD, LED and Button/") (tstamps /53581084/))
      (tstamp 535817ED))
    (comp (ref R8)
      (value 750)
      (footprint R3_ref:R3_ref)
      (libsource (lib device) (part R))
      (sheetpath (names "/PMOD, LED and Button/") (tstamps /53581084/))
      (tstamp 535817FB))
    (comp (ref R9)
      (value 10k)
      (footprint R3_ref:R3_ref)
      (libsource (lib device) (part R))
      (sheetpath (names "/PMOD, LED and Button/") (tstamps /53581084/))
      (tstamp 535869EA))
    (comp (ref R7)
      (value 200)
      (footprint R3_ref:R3_ref)
      (libsource (lib device) (part R))
      (sheetpath (names "/PMOD, LED and Button/") (tstamps /53581084/))
      (tstamp 53586CE7))
    (comp (ref P3)
      (value PMOD)
      (footprint Socket_Strips:Socket_Strip_Angled_1x06)
      (libsource (lib TechnoBoard-cache) (part CONN_6))
      (sheetpath (names "/PMOD, LED and Button/") (tstamps /53581084/))
      (tstamp 53587341))
    (comp (ref JP3)
      (value JUMPER3)
      (footprint Pin_Headers:Pin_Header_Straight_1x03)
      (libsource (lib device) (part JUMPER3))
      (sheetpath (names "/PMOD, LED and Button/") (tstamps /53581084/))
      (tstamp 53587347))
    (comp (ref JP4)
      (value JUMPER3)
      (footprint Pin_Headers:Pin_Header_Straight_1x03)
      (libsource (lib device) (part JUMPER3))
      (sheetpath (names "/PMOD, LED and Button/") (tstamps /53581084/))
      (tstamp 53587377))
    (comp (ref U4)
      (value AOZ8105CI)
      (footprint Housings_SOT-23_SOT-143_TSOT-6:SOT-23-6)
      (libsource (lib protect_tbd) (part PROTECT_TBD))
      (sheetpath (names "/PMOD, LED and Button/") (tstamps /53581084/))
      (tstamp 535F0DD9))
    (comp (ref U6)
      (value AOZ8105CI)
      (footprint Housings_SOT-23_SOT-143_TSOT-6:SOT-23-6)
      (libsource (lib protect_tbd) (part PROTECT_TBD))
      (sheetpath (names "/PMOD, LED and Button/") (tstamps /53581084/))
      (tstamp 535F1026))
    (comp (ref U5)
      (value AOZ8105CI)
      (footprint Housings_SOT-23_SOT-143_TSOT-6:SOT-23-6)
      (libsource (lib protect_tbd) (part PROTECT_TBD))
      (sheetpath (names "/PMOD, LED and Button/") (tstamps /53581084/))
      (tstamp 535F103C))
    (comp (ref C13)
      (value 0.1uF)
      (footprint Discret:C1)
      (libsource (lib device) (part C))
      (sheetpath (names "/PMOD, LED and Button/") (tstamps /53581084/))
      (tstamp 53A077CB))
    (comp (ref R6)
      (value 10k)
      (footprint R3_ref:R3_ref)
      (libsource (lib device) (part R))
      (sheetpath (names "/PMOD, LED and Button/") (tstamps /53581084/))
      (tstamp 53A079CF))
    (comp (ref RP1)
      (value 4116R-1-221LF-ND)
      (footprint Sockets_DIP:DIP-16__300)
      (libsource (lib device) (part R_PACK8))
      (sheetpath (names "/PMOD, LED and Button/") (tstamps /53581084/))
      (tstamp 53A1929F))
    (comp (ref RR1)
      (value 4608X-102-221LF)
      (footprint Pin_Headers:Pin_Header_Straight_1x08)
      (libsource (lib RR4_SIP) (part RR4_SIP))
      (sheetpath (names "/PMOD, LED and Button/") (tstamps /53581084/))
      (tstamp 53A1D6A8))
    (comp (ref P5)
      (value PMOD_I2C)
      (footprint Pin_Headers:Pin_Header_Straight_2x04)
      (libsource (lib conn) (part CONN_02X04))
      (sheetpath (names "/PMOD, LED and Button/") (tstamps /53581084/))
      (tstamp 54F9C2D5))
    (comp (ref R11)
      (value 2k2)
      (footprint Resistors_SMD:R_1206_HandSoldering)
      (libsource (lib device) (part R))
      (sheetpath (names "/PMOD, LED and Button/") (tstamps /53581084/))
      (tstamp 550780C9))
    (comp (ref R10)
      (value 2k2)
      (footprint Resistors_SMD:R_1206_HandSoldering)
      (libsource (lib device) (part R))
      (sheetpath (names "/PMOD, LED and Button/") (tstamps /53581084/))
      (tstamp 5507859C))
    (comp (ref JP5)
      (value JUMPER)
      (footprint Pin_Headers:Pin_Header_Straight_1x02)
      (libsource (lib device) (part JUMPER))
      (sheetpath (names "/PMOD, LED and Button/") (tstamps /53581084/))
      (tstamp 5507A32F))
    (comp (ref JP6)
      (value JUMPER)
      (footprint Pin_Headers:Pin_Header_Straight_1x02)
      (libsource (lib device) (part JUMPER))
      (sheetpath (names "/PMOD, LED and Button/") (tstamps /53581084/))
      (tstamp 5507A41F)))
  (libparts
    (libpart (lib device) (part C)
      (description "Condensateur non polarise")
      (footprints
        (fp SM*)
        (fp C?)
        (fp C1-1))
      (fields
        (field (name Reference) C)
        (field (name Value) C))
      (pins
        (pin (num 1) (name ~) (type passive))
        (pin (num 2) (name ~) (type passive))))
    (libpart (lib device) (part CP1)
      (description "Condensateur polarise")
      (footprints
        (fp CP*)
        (fp SM*))
      (fields
        (field (name Reference) C)
        (field (name Value) CP1))
      (pins
        (pin (num 1) (name ~) (type passive))
        (pin (num 2) (name ~) (type passive))))
    (libpart (lib device) (part CRYSTAL)
      (fields
        (field (name Reference) X)
        (field (name Value) CRYSTAL))
      (pins
        (pin (num 1) (name 1) (type passive))
        (pin (num 2) (name 2) (type passive))))
    (libpart (lib device) (part JUMPER)
      (fields
        (field (name Reference) JP)
        (field (name Value) JUMPER))
      (pins
        (pin (num 1) (name 1) (type passive))
        (pin (num 2) (name 2) (type passive))))
    (libpart (lib device) (part JUMPER3)
      (fields
        (field (name Reference) JP)
        (field (name Value) JUMPER3))
      (pins
        (pin (num 1) (name 1) (type passive))
        (pin (num 2) (name 2) (type passive))
        (pin (num 3) (name 3) (type passive))))
    (libpart (lib device) (part LED)
      (footprints
        (fp LED-3MM)
        (fp LED-5MM)
        (fp LED-10MM)
        (fp LED-0603)
        (fp LED-0805)
        (fp LED-1206)
        (fp LEDV))
      (fields
        (field (name Reference) D)
        (field (name Value) LED))
      (pins
        (pin (num 1) (name A) (type passive))
        (pin (num 2) (name K) (type passive))))
    (libpart (lib device) (part R)
      (description Resistance)
      (footprints
        (fp R?)
        (fp SM0603)
        (fp SM0805)
        (fp R?-*)
        (fp SM1206))
      (fields
        (field (name Reference) R)
        (field (name Value) R))
      (pins
        (pin (num 1) (name ~) (type passive))
        (pin (num 2) (name ~) (type passive))))
    (libpart (lib device) (part R_PACK8)
      (description "8 resistors Pack")
      (fields
        (field (name Reference) RP)
        (field (name Value) R_PACK8))
      (pins
        (pin (num 1) (name P1) (type passive))
        (pin (num 2) (name P2) (type passive))
        (pin (num 3) (name P3) (type passive))
        (pin (num 4) (name P4) (type passive))
        (pin (num 5) (name P5) (type passive))
        (pin (num 6) (name P6) (type passive))
        (pin (num 7) (name P7) (type passive))
        (pin (num 8) (name P8) (type passive))
        (pin (num 9) (name R8) (type passive))
        (pin (num 10) (name R7) (type passive))
        (pin (num 11) (name R6) (type passive))
        (pin (num 12) (name R5) (type passive))
        (pin (num 13) (name R4) (type passive))
        (pin (num 14) (name R3) (type passive))
        (pin (num 15) (name R2) (type passive))
        (pin (num 16) (name R1) (type passive))))
    (libpart (lib device) (part SW_PUSH)
      (description "Push Button")
      (fields
        (field (name Reference) SW)
        (field (name Value) SW_PUSH))
      (pins
        (pin (num 1) (name 1) (type passive))
        (pin (num 2) (name 2) (type passive))))
    (libpart (lib device) (part VR)
      (description VARISTANCE)
      (fields
        (field (name Reference) VR)
        (field (name Value) VR))
      (pins
        (pin (num 1) (name ~) (type passive))
        (pin (num 2) (name ~) (type passive))))
    (libpart (lib conn) (part CONN_02X04)
      (footprints
        (fp Pin_Header_Straight_2X04)
        (fp Pin_Header_Angled_2X04)
        (fp Socket_Strip_Straight_2X04)
        (fp Socket_Strip_Angled_2X04))
      (fields
        (field (name Reference) P)
        (field (name Value) CONN_02X04))
      (pins
        (pin (num 1) (name P1) (type passive))
        (pin (num 2) (name P2) (type passive))
        (pin (num 3) (name P3) (type passive))
        (pin (num 4) (name P4) (type passive))
        (pin (num 5) (name P5) (type passive))
        (pin (num 6) (name P6) (type passive))
        (pin (num 7) (name P7) (type passive))
        (pin (num 8) (name P8) (type passive))))
    (libpart (lib conn) (part USB)
      (fields
        (field (name Reference) J)
        (field (name Value) USB))
      (pins
        (pin (num 1) (name Vbus) (type power_out))
        (pin (num 2) (name D-) (type BiDi))
        (pin (num 3) (name D+) (type BiDi))
        (pin (num 4) (name GND) (type power_in))
        (pin (num 5) (name Shield_1) (type passive))
        (pin (num 6) (name Shield_2) (type passive))))
    (libpart (lib regul) (part LM1084IS-3.3/NOPB)
      (aliases
        (alias LM1084IS-5.0/NOPB))
      (description "LM1084IS-3.3, 5A 27V Linear Regulator, Fixed Output 3.3V, TO-263")
      (docs http://www.ti.com/lit/ds/symlink/lm1084.pdf)
      (footprints
        (fp TO*))
      (fields
        (field (name Reference) U)
        (field (name Value) LM1084IS-3.3/NOPB)
        (field (name Footprint) TO-263))
      (pins
        (pin (num 1) (name GND) (type power_in))
        (pin (num 2) (name OUT) (type power_out))
        (pin (num 3) (name IN) (type input))))
    (libpart (lib mcp4822) (part MCP4822)
      (fields
        (field (name Reference) U)
        (field (name Value) MCP4822))
      (pins
        (pin (num 1) (name VDD) (type power_in))
        (pin (num 2) (name ~CS) (type input))
        (pin (num 3) (name SCK) (type input))
        (pin (num 4) (name SDI) (type input))
        (pin (num 5) (name ~LDAC) (type input))
        (pin (num 6) (name VOUTB) (type output))
        (pin (num 7) (name VSS) (type power_in))
        (pin (num 8) (name VOUTA) (type output))))
    (libpart (lib pic24fj64gb002) (part PIC24FJ64GB002)
      (fields
        (field (name Reference) U)
        (field (name Value) PIC24FJ64GB002))
      (pins
        (pin (num 1) (name ~MCLR) (type input))
        (pin (num 2) (name PGED3_AN0_C3INC_VREF+_ASDA1_RP5_PMD7_CTED1_VBUSVLD_VCMPST1_CN2_RA0) (type BiDi))
        (pin (num 3) (name PGEC3_AN1_C3IND_VREF-_ASCL1_RP6_PMD6_CTED2_SESSVLD_VCMPST2_CN3_RA1) (type BiDi))
        (pin (num 4) (name PGED1_AN2_C2INB_DPH_RP0_PMD0_CN4_RB0) (type BiDi))
        (pin (num 5) (name PGEC1_AN3_C2INA_DMH_RP1_PMD1_CN5_RB1) (type BiDi))
        (pin (num 6) (name AN4_C1INB_DPLN_SDA2_RP2_PMD2_CN6_RB2) (type BiDi))
        (pin (num 7) (name AN5_C1INA_DMLN_RTCC_SCL2_RP3_PMWR_CN7_RB3) (type BiDi))
        (pin (num 8) (name VSS) (type power_in))
        (pin (num 9) (name OSCI_CLKI_C1IND_PMCS1_CN30_RA2) (type BiDi))
        (pin (num 10) (name OSCO_CLKO_PMA0_CN29_RA3) (type BiDi))
        (pin (num 11) (name SOSCI_C2IND_RP4_PMBE_CN1_RB4) (type BiDi))
        (pin (num 12) (name SOSCO_SCLKI_T1CK_C2INC_PMA1_CN0_RA4) (type BiDi))
        (pin (num 13) (name VDD) (type power_in))
        (pin (num 14) (name TMS_USBID_CN27_RB5) (type BiDi))
        (pin (num 15) (name VBUS) (type input))
        (pin (num 16) (name TDI_RP7_PMD5_INT0_CN23_RB7) (type BiDi))
        (pin (num 17) (name TCK_USBOEN_SCL1_RP8_PMD4_CN22_RB8) (type BiDi))
        (pin (num 18) (name TDO_SDA1_RP9_PMD3_RCV_CN21_RB9) (type BiDi))
        (pin (num 19) (name DISVREG) (type BiDi))
        (pin (num 20) (name VCAP_VDDCORE) (type BiDi))
        (pin (num 21) (name PGED2_D+_VPIO_RP10_CN16_RB10) (type BiDi))
        (pin (num 22) (name PGEC2_D-_VMIO_RP11_CN15_RB11) (type BiDi))
        (pin (num 23) (name VUSB) (type power_in))
        (pin (num 24) (name AN11_C1INC_RP13_PMRD_REFO_SESSEND_CN13_RB13) (type BiDi))
        (pin (num 25) (name AN10_C3INB_CVREF_VCPCON_VBUSON_RP14_CN12_RB14) (type BiDi))
        (pin (num 26) (name AN9_C3INA_VBUSCHG_RP15_VBUSST_CN11_RB15) (type BiDi))
        (pin (num 27) (name VSS) (type power_in))
        (pin (num 28) (name VDD) (type power_in))))
    (libpart (lib protect_tbd) (part PROTECT_TBD)
      (fields
        (field (name Reference) U)
        (field (name Value) PROTECT_TBD))
      (pins
        (pin (num 1) (name CH1) (type input))
        (pin (num 2) (name GND) (type power_in))
        (pin (num 3) (name CH2) (type input))
        (pin (num 4) (name CH3) (type input))
        (pin (num 5) (name VDD) (type power_in))
        (pin (num 6) (name CH4) (type input))))
    (libpart (lib RR4_SIP) (part RR4_SIP)
      (fields
        (field (name Reference) RR)
        (field (name Value) RR4_SIP))
      (pins
        (pin (num 1) (name COM) (type passive))
        (pin (num 2) (name 2) (type passive))
        (pin (num 3) (name 3) (type passive))
        (pin (num 4) (name 4) (type passive))
        (pin (num 5) (name 5) (type passive))
        (pin (num 6) (name 6) (type passive))
        (pin (num 7) (name 7) (type passive))
        (pin (num 8) (name 8) (type passive))))
    (libpart (lib TechnoBoard-cache) (part CONN_12)
      (fields
        (field (name Reference) P)
        (field (name Value) CONN_12))
      (pins
        (pin (num 1) (name P1) (type passive))
        (pin (num 2) (name P2) (type passive))
        (pin (num 3) (name P3) (type passive))
        (pin (num 4) (name P4) (type passive))
        (pin (num 5) (name P5) (type passive))
        (pin (num 6) (name P6) (type passive))
        (pin (num 7) (name P7) (type passive))
        (pin (num 8) (name P8) (type passive))
        (pin (num 9) (name P9) (type passive))
        (pin (num 10) (name P10) (type passive))
        (pin (num 11) (name P11) (type passive))
        (pin (num 12) (name P12) (type passive))))
    (libpart (lib TechnoBoard-cache) (part CONN_6)
      (fields
        (field (name Reference) P)
        (field (name Value) CONN_6))
      (pins
        (pin (num 1) (name 1) (type passive))
        (pin (num 2) (name 2) (type passive))
        (pin (num 3) (name 3) (type passive))
        (pin (num 4) (name 4) (type passive))
        (pin (num 5) (name 5) (type passive))
        (pin (num 6) (name 6) (type passive)))))
  (libraries
    (library (logical device)
      (uri /usr/local/share/kicad/library/device.lib))
    (library (logical conn)
      (uri /usr/local/share/kicad/library/conn.lib))
    (library (logical regul)
      (uri /usr/local/share/kicad/library/regul.lib))
    (library (logical pic24fj64gb002)
      (uri Documents/cegep/technoboard/hw/lib/pic24fj64gb002.lib))
    (library (logical mcp4822)
      (uri Documents/cegep/technoboard/hw/lib/mcp4822.lib))
    (library (logical protect_tbd)
      (uri Documents/cegep/technoboard/hw/lib/protect_tbd.lib))
    (library (logical RR4_SIP)
      (uri Documents/cegep/technoboard/hw/lib/RR4_SIP.lib))
    (library (logical TechnoBoard-cache)
      (uri /home/jsc/Documents/cegep/technoboard/hw/board/TechnoBoard-cache.lib)))
  (nets
    (net (code 1) (name RB13)
      (node (ref U1) (pin 24))
      (node (ref RP1) (pin 4)))
    (net (code 2) (name "Net-(P1-Pad6)")
      (node (ref P1) (pin 6)))
    (net (code 3) (name "Net-(C5-Pad1)")
      (node (ref SW1) (pin 1))
      (node (ref R2) (pin 2))
      (node (ref C5) (pin 1))
      (node (ref R3) (pin 2)))
    (net (code 4) (name "Net-(R1-Pad2)")
      (node (ref R2) (pin 1))
      (node (ref U1) (pin 1))
      (node (ref R1) (pin 2)))
    (net (code 5) (name RB7)
      (node (ref RP1) (pin 1))
      (node (ref U1) (pin 16)))
    (net (code 6) (name RB9)
      (node (ref U1) (pin 18))
      (node (ref RP1) (pin 3)))
    (net (code 7) (name "Net-(C8-Pad1)")
      (node (ref U1) (pin 20))
      (node (ref C8) (pin 1)))
    (net (code 8) (name RB14)
      (node (ref RR1) (pin 7))
      (node (ref U1) (pin 25)))
    (net (code 9) (name RB15)
      (node (ref U1) (pin 26))
      (node (ref RR1) (pin 5)))
    (net (code 10) (name "Net-(P1-Pad1)")
      (node (ref R1) (pin 1))
      (node (ref P1) (pin 1)))
    (net (code 11) (name GND)
      (node (ref U1) (pin 19))
      (node (ref SW1) (pin 2))
      (node (ref P3) (pin 5))
      (node (ref U4) (pin 2))
      (node (ref R5) (pin 2))
      (node (ref C1) (pin 2))
      (node (ref P1) (pin 3))
      (node (ref U1) (pin 8))
      (node (ref C5) (pin 2))
      (node (ref C11) (pin 2))
      (node (ref C2) (pin 2))
      (node (ref C6) (pin 2))
      (node (ref C7) (pin 2))
      (node (ref C8) (pin 2))
      (node (ref U1) (pin 27))
      (node (ref C4) (pin 2))
      (node (ref VR1) (pin 2))
      (node (ref J1) (pin 6))
      (node (ref J1) (pin 5))
      (node (ref J1) (pin 4))
      (node (ref VR3) (pin 2))
      (node (ref U2) (pin 1))
      (node (ref C13) (pin 2))
      (node (ref C12) (pin 2))
      (node (ref P5) (pin 5))
      (node (ref P5) (pin 6))
      (node (ref U5) (pin 2))
      (node (ref C10) (pin 2))
      (node (ref SW2) (pin 1))
      (node (ref U3) (pin 5))
      (node (ref U3) (pin 7))
      (node (ref P2) (pin 5))
      (node (ref P4) (pin 5))
      (node (ref C9) (pin 2))
      (node (ref C3) (pin 2))
      (node (ref P4) (pin 11))
      (node (ref U6) (pin 2)))
    (net (code 12) (name RB8)
      (node (ref U1) (pin 17))
      (node (ref RP1) (pin 2)))
    (net (code 13) (name "Net-(R4-Pad1)")
      (node (ref U1) (pin 15))
      (node (ref R4) (pin 1)))
    (net (code 14) (name RA1)
      (node (ref RR1) (pin 4))
      (node (ref U1) (pin 3))
      (node (ref U3) (pin 3)))
    (net (code 15) (name RA0)
      (node (ref RR1) (pin 2))
      (node (ref U1) (pin 2))
      (node (ref U3) (pin 4)))
    (net (code 16) (name RB5)
      (node (ref U1) (pin 14))
      (node (ref JP1) (pin 1))
      (node (ref R7) (pin 1))
      (node (ref R6) (pin 2)))
    (net (code 17) (name RA4)
      (node (ref RP1) (pin 5))
      (node (ref U1) (pin 12)))
    (net (code 18) (name RB4)
      (node (ref U1) (pin 11))
      (node (ref RP1) (pin 6)))
    (net (code 19) (name RB3)
      (node (ref RP1) (pin 7))
      (node (ref U1) (pin 7)))
    (net (code 20) (name RB2)
      (node (ref U1) (pin 6))
      (node (ref RP1) (pin 8)))
    (net (code 21) (name "Net-(J1-Pad3)")
      (node (ref U1) (pin 21))
      (node (ref J1) (pin 3))
      (node (ref VR1) (pin 1)))
    (net (code 22) (name "Net-(J1-Pad2)")
      (node (ref J1) (pin 2))
      (node (ref VR3) (pin 1))
      (node (ref U1) (pin 22)))
    (net (code 23) (name +5V)
      (node (ref J1) (pin 1))
      (node (ref U2) (pin 3))
      (node (ref U3) (pin 1))
      (node (ref C10) (pin 1))
      (node (ref JP2) (pin 1))
      (node (ref C9) (pin 1))
      (node (ref C13) (pin 1))
      (node (ref JP3) (pin 1))
      (node (ref JP4) (pin 1))
      (node (ref R4) (pin 2)))
    (net (code 24) (name +3.3V)
      (node (ref D2) (pin 1))
      (node (ref U2) (pin 2))
      (node (ref JP4) (pin 3))
      (node (ref U1) (pin 13))
      (node (ref U1) (pin 23))
      (node (ref U1) (pin 28))
      (node (ref C11) (pin 1))
      (node (ref R3) (pin 1))
      (node (ref D1) (pin 1))
      (node (ref U4) (pin 5))
      (node (ref P1) (pin 2))
      (node (ref R10) (pin 1))
      (node (ref R11) (pin 1))
      (node (ref U5) (pin 5))
      (node (ref U6) (pin 5))
      (node (ref R6) (pin 1))
      (node (ref C3) (pin 1))
      (node (ref JP3) (pin 3))
      (node (ref JP2) (pin 3))
      (node (ref R9) (pin 1))
      (node (ref P5) (pin 8))
      (node (ref P5) (pin 7))
      (node (ref C12) (pin 1))
      (node (ref C6) (pin 1))
      (node (ref C7) (pin 1))
      (node (ref C4) (pin 1)))
    (net (code 25) (name "Net-(D1-Pad2)")
      (node (ref D1) (pin 2))
      (node (ref R5) (pin 1)))
    (net (code 26) (name "Net-(P1-Pad5)")
      (node (ref U1) (pin 5))
      (node (ref P1) (pin 5)))
    (net (code 27) (name "Net-(P1-Pad4)")
      (node (ref P1) (pin 4))
      (node (ref U1) (pin 4)))
    (net (code 28) (name "Net-(C1-Pad1)")
      (node (ref C1) (pin 1))
      (node (ref X1) (pin 2))
      (node (ref U1) (pin 9)))
    (net (code 29) (name "Net-(C2-Pad1)")
      (node (ref X1) (pin 1))
      (node (ref U1) (pin 10))
      (node (ref C2) (pin 1)))
    (net (code 30) (name "Net-(P4-Pad1)")
      (node (ref U5) (pin 1))
      (node (ref P4) (pin 1))
      (node (ref RP1) (pin 16)))
    (net (code 31) (name "Net-(P4-Pad2)")
      (node (ref P4) (pin 2))
      (node (ref U5) (pin 3))
      (node (ref RP1) (pin 15)))
    (net (code 32) (name "Net-(P2-Pad1)")
      (node (ref U3) (pin 8))
      (node (ref P2) (pin 1)))
    (net (code 33) (name "Net-(P2-Pad2)")
      (node (ref P2) (pin 2))
      (node (ref U3) (pin 6)))
    (net (code 34) (name "Net-(P4-Pad3)")
      (node (ref P4) (pin 3))
      (node (ref U5) (pin 4))
      (node (ref RP1) (pin 14)))
    (net (code 35) (name "Net-(P4-Pad10)")
      (node (ref P4) (pin 10))
      (node (ref RP1) (pin 9))
      (node (ref U6) (pin 6)))
    (net (code 36) (name "Net-(P4-Pad9)")
      (node (ref RP1) (pin 10))
      (node (ref U6) (pin 4))
      (node (ref P4) (pin 9)))
    (net (code 37) (name "Net-(P4-Pad8)")
      (node (ref RP1) (pin 11))
      (node (ref P4) (pin 8))
      (node (ref U6) (pin 3)))
    (net (code 38) (name "Net-(P4-Pad4)")
      (node (ref P4) (pin 4))
      (node (ref U5) (pin 6))
      (node (ref RP1) (pin 13)))
    (net (code 39) (name "Net-(JP3-Pad2)")
      (node (ref JP3) (pin 2))
      (node (ref P3) (pin 6)))
    (net (code 40) (name "Net-(JP2-Pad2)")
      (node (ref P2) (pin 6))
      (node (ref JP2) (pin 2)))
    (net (code 41) (name "Net-(JP1-Pad2)")
      (node (ref JP1) (pin 2))
      (node (ref U3) (pin 2)))
    (net (code 42) (name "Net-(JP4-Pad2)")
      (node (ref JP4) (pin 2))
      (node (ref P4) (pin 12))
      (node (ref P4) (pin 6)))
    (net (code 43) (name "Net-(R7-Pad2)")
      (node (ref SW2) (pin 2))
      (node (ref R7) (pin 2))
      (node (ref R8) (pin 2)))
    (net (code 44) (name "Net-(JP6-Pad1)")
      (node (ref JP6) (pin 1))
      (node (ref R11) (pin 2)))
    (net (code 45) (name "Net-(JP5-Pad1)")
      (node (ref JP5) (pin 1))
      (node (ref R10) (pin 2)))
    (net (code 46) (name "Net-(P4-Pad7)")
      (node (ref RP1) (pin 12))
      (node (ref U6) (pin 1))
      (node (ref P4) (pin 7)))
    (net (code 47) (name "Net-(P2-Pad4)")
      (node (ref P2) (pin 4))
      (node (ref U4) (pin 6))
      (node (ref P3) (pin 4))
      (node (ref RR1) (pin 8)))
    (net (code 48) (name "Net-(P2-Pad3)")
      (node (ref U4) (pin 4))
      (node (ref P3) (pin 3))
      (node (ref P2) (pin 3))
      (node (ref RR1) (pin 6)))
    (net (code 49) (name "Net-(JP6-Pad2)")
      (node (ref U4) (pin 3))
      (node (ref P3) (pin 2))
      (node (ref RR1) (pin 3))
      (node (ref P5) (pin 2))
      (node (ref JP6) (pin 2))
      (node (ref P5) (pin 1)))
    (net (code 50) (name "Net-(JP5-Pad2)")
      (node (ref P5) (pin 3))
      (node (ref P5) (pin 4))
      (node (ref JP5) (pin 2))
      (node (ref RR1) (pin 1))
      (node (ref P3) (pin 1))
      (node (ref U4) (pin 1)))
    (net (code 51) (name "Net-(JP1-Pad3)")
      (node (ref JP1) (pin 3))
      (node (ref R9) (pin 2)))
    (net (code 52) (name "Net-(D2-Pad2)")
      (node (ref R8) (pin 1))
      (node (ref D2) (pin 2)))))