M48
INCH,TZ
T1C0.025
T2C0.032
T3C0.040
T4C0.091
T5C0.118
%
G90
G05
T1
X46920Y-24480
X48320Y-24480
X48700Y-34400
X50600Y-36000
X54000Y-23000
X56105Y-45675
X58000Y-23200
X58590Y-45640
X59000Y-48200
X64800Y-32200
X65800Y-37000
X70400Y-28800
X70400Y-33400
X70466Y-35816
X71400Y-47000
X71852Y-35860
X71855Y-34090
X75000Y-47000
X75950Y-33075
T2
X48863Y-29700
X48863Y-30700
X49600Y-48100
X49600Y-49100
X49600Y-50100
X49650Y-29700
X49650Y-30700
X50900Y-39200
X51100Y-26000
X51100Y-28800
X51300Y-35000
X51300Y-36800
X51400Y-32100
X51400Y-33100
X51700Y-48000
X52300Y-35000
X52300Y-36800
X52700Y-48000
X53200Y-32100
X53200Y-33100
X53700Y-48000
X53900Y-39200
X54100Y-26000
X54100Y-28800
X54700Y-48000
X54900Y-36200
X54900Y-41200
X55100Y-26000
X55100Y-43800
X55600Y-32100
X55600Y-33100
X55700Y-48000
X55900Y-36200
X55900Y-41200
X56100Y-43800
X56700Y-48000
X57100Y-28100
X57100Y-29100
X57100Y-30100
X57100Y-31100
X57100Y-32100
X57100Y-33100
X57100Y-34100
X57100Y-35100
X57100Y-36100
X57100Y-37100
X57100Y-38100
X57100Y-39100
X57100Y-40100
X57100Y-41100
X57100Y-43800
X58100Y-26000
X58100Y-43800
X59100Y-43800
X60100Y-28100
X60100Y-29100
X60100Y-30100
X60100Y-31100
X60100Y-32100
X60100Y-33100
X60100Y-34100
X60100Y-35100
X60100Y-36100
X60100Y-37100
X60100Y-38100
X60100Y-39100
X60100Y-40100
X60100Y-41100
X60100Y-43800
X60200Y-24000
X60200Y-25000
X60200Y-26000
X61100Y-43800
X61500Y-29200
X61600Y-30700
X61600Y-31700
X61600Y-33500
X61600Y-34500
X62100Y-43800
X62500Y-29200
X62800Y-46200
X62800Y-47200
X62800Y-48200
X63000Y-22900
X63000Y-25900
X63320Y-31580
X63320Y-33580
X64300Y-41900
X64300Y-44900
X64800Y-22900
X64800Y-25900
X65300Y-41900
X65300Y-44900
X65500Y-48000
X65900Y-29100
X65900Y-30100
X65900Y-31100
X65900Y-32100
X65900Y-33100
X65900Y-34100
X65900Y-35100
X65900Y-36100
X66200Y-39700
X66200Y-40700
X66300Y-41900
X66300Y-44900
X66500Y-48000
X67300Y-41900
X67300Y-44900
X67500Y-48000
X68500Y-48000
X68700Y-42200
X68700Y-43400
X68900Y-29100
X68900Y-30100
X68900Y-31100
X68900Y-32100
X68900Y-33100
X68900Y-34100
X68900Y-35100
X68900Y-36100
X69200Y-44900
X69200Y-45900
X69500Y-48000
X70500Y-48000
X71700Y-42200
X71700Y-43400
X71900Y-48400
X72400Y-32000
X73200Y-37100
X73200Y-38100
X73200Y-39100
X73200Y-40100
X73200Y-41100
X73200Y-42100
X73400Y-32000
X74400Y-32000
X74900Y-48400
X75600Y-42300
X75600Y-43300
T3
X47600Y-38600
X47600Y-39600
X47600Y-41700
X47600Y-42700
X49800Y-41700
X49800Y-42700
X50800Y-41700
X50800Y-42700
X51800Y-41700
X51800Y-42700
X52800Y-41700
X52800Y-42700
X73100Y-24500
X73100Y-25500
X73100Y-26500
X73100Y-27500
X73100Y-28500
X73100Y-29500
X74100Y-24500
X74100Y-25500
X74100Y-26500
X74100Y-27500
X74100Y-28500
X74100Y-29500
T4
X47800Y-27838
X47800Y-32562
T5
X47100Y-22500
X47100Y-50700
X75700Y-22500
X75700Y-50700
T0
M30
