PCBNEW-LibModule-V1  jeu 19 jun 2014 13:33:32 EDT
# encoding utf-8
Units mm
$INDEX
smt_btn
$EndINDEX
$MODULE smt_btn
Po 0 0 0 15 53A31EC5 00000000 ~~
Li smt_btn
Sc 0
AR 
Op 0 0 0
T0 4.572 -6.096 1 1 0 0.15 N V 21 N "smt_btn"
T1 5.08 2.032 1 1 0 0.15 N V 21 N "VAL**"
DC 4.572 -2.032 3.048 -3.556 0.15 21
DS 1.016 -5.08 8.128 -5.08 0.15 21
DS 8.128 -5.08 8.128 1.016 0.15 21
DS 8.128 1.016 1.016 1.016 0.15 21
DS 1.016 1.016 1.016 -5.08 0.15 21
$PAD
Sh "1" R 3 1 0 0 0
Dr 0 0 0
At SMD N 00888000
Ne 0 ""
Po 0 0
$EndPAD
$PAD
Sh "1" R 3 1 0 0 0
Dr 0 0 0
At SMD N 00888000
Ne 0 ""
Po 9 0
$EndPAD
$PAD
Sh "2" R 3 1 0 0 0
Dr 0 0 0
At SMD N 00888000
Ne 0 ""
Po 0 -4
$EndPAD
$PAD
Sh "2" R 3 1 0 0 0
Dr 0 0 0
At SMD N 00888000
Ne 0 ""
Po 9 -4
$EndPAD
$EndMODULE smt_btn
$EndLIBRARY
