{
  "type": "minecraft:crafting_shaped",
  "pattern": [
    " B ",
    "CCC",
    " I "
  ],
  "key": {
    "B": {
      "item": "create:andesite_casing"
    },
    "C": {
      "item": "supplementaries:rope"
    },
    "I": {
      "tag": "forge:plates/iron"
    }
  },
  "result": {
    "item": "create:rope_pulley"
  }
}