{
	"id": "generate-distro",
	"source": 
	{
		"path": "C:\\Code.Max\\workspaces\\php\\codemax\\generate-distro",
		"ignore": {
			"files": [
				"\\.buildpath",
				"\\.gitignore",
				"\\composer.lock",
				"\\.project"
			],
		"folders": [
				"\\.settings",
				"\\tests",
				"\\.git"
			]	
		}
	},
	"destination": 
	{
		"path": "C:\\Code.Max\\workspaces\\php\\codemax\\generate-distro\\tests\\dist"
	}
}