"","fecha_YW","producto","mes","fecha_lun","fecha_YM","precio_promedio","ingresos_lyj","ingresos_sem","anio","hs_frio_acumuladas_Y","precipitacion_efectiva_Y","meses_desde_cosecha","produccion"
"1","2013-00","Manzana",1,2013-01-03,"2013-01",44.5238095238097,97668,129464,"2013","Horas insuficientes","Precipitación alta",0,45626
"2","2013-01","Manzana",1,2013-01-07,"2013-01",43.8623365211502,144150,266109,"2013","Horas insuficientes","Precipitación alta",0,45626
"3","2013-02","Manzana",1,2013-01-14,"2013-01",42.1041666666667,111577,250806,"2013","Horas insuficientes","Precipitación alta",0,45626
"4","2013-03","Manzana",1,2013-01-21,"2013-01",43.416666666667,169754,369402,"2013","Horas insuficientes","Precipitación alta",0,45626
"5","2013-04","Manzana",1,2013-01-28,"2013-01",35.1373255969949,149080,268174,"2013","Horas insuficientes","Precipitación alta",0,45626
"6","2013-05","Manzana",2,2013-02-04,"2013-02",29.3439658660657,184528,308497,"2013","Horas insuficientes","Precipitación alta",1,45626
"7","2013-06","Manzana",2,2013-02-11,"2013-02",32.2046532710615,158659,285359,"2013","Horas insuficientes","Precipitación alta",1,45626
"8","2013-07","Manzana",2,2013-02-18,"2013-02",33.8573214208078,153340,289790,"2013","Horas insuficientes","Precipitación alta",1,45626
"9","2013-08","Manzana",2,2013-02-25,"2013-02",32.6167953383357,168452,299420,"2013","Horas insuficientes","Precipitación alta",1,45626
"10","2013-09","Manzana",3,2013-03-04,"2013-03",31.7854544462678,168797,307628,"2013","Horas insuficientes","Precipitación alta",2,45626
"11","2013-10","Manzana",3,2013-03-11,"2013-03",33.2564876293495,193307,340688,"2013","Horas insuficientes","Precipitación alta",2,45626
"12","2013-11","Manzana",3,2013-03-18,"2013-03",34.6437744070461,177459,297791,"2013","Horas insuficientes","Precipitación alta",2,45626
"13","2013-12","Manzana",3,2013-03-25,"2013-03",34.96875,108972,168130,"2013","Horas insuficientes","Precipitación alta",2,45626
"14","2013-13","Manzana",4,2013-04-01,"2013-04",34.4907772258706,239221,382888,"2013","Horas insuficientes","Precipitación alta",3,45626
"15","2013-14","Manzana",4,2013-04-08,"2013-04",34.58701470221,200225,370615,"2013","Horas insuficientes","Precipitación alta",3,45626
"16","2013-15","Manzana",4,2013-04-15,"2013-04",34.0054134693265,164894,302860,"2013","Horas insuficientes","Precipitación alta",3,45626
"17","2013-16","Manzana",4,2013-04-22,"2013-04",32.433268205479,206133,333595,"2013","Horas insuficientes","Precipitación alta",3,45626
"18","2013-17","Manzana",4,2013-04-29,"2013-04",32.0555555555557,217380,281721,"2013","Horas insuficientes","Precipitación alta",3,45626
"19","2013-18","Manzana",5,2013-05-06,"2013-05",33.5383600720946,249996,421309,"2013","Horas insuficientes","Precipitación alta",4,45626
"20","2013-19","Manzana",5,2013-05-13,"2013-05",35.0158930201463,155562,268970,"2013","Horas insuficientes","Precipitación alta",4,45626
"21","2013-20","Manzana",5,2013-05-20,"2013-05",35.7,163316,262648,"2013","Horas insuficientes","Precipitación alta",4,45626
"22","2013-21","Manzana",5,2013-05-27,"2013-05",34.0441112700949,182758,277346,"2013","Horas insuficientes","Precipitación alta",4,45626
"23","2013-22","Manzana",6,2013-06-03,"2013-06",33.6875,77350,261279,"2013","Horas insuficientes","Precipitación alta",5,45626
"24","2013-23","Manzana",6,2013-06-10,"2013-06",33.96875,183620,306298,"2013","Horas insuficientes","Precipitación alta",5,45626
"25","2013-24","Manzana",6,2013-06-17,"2013-06",33.897834255189,199507,328117,"2013","Horas insuficientes","Precipitación alta",5,45626
"26","2013-25","Manzana",6,2013-06-24,"2013-06",34.5223214285715,200522,357000,"2013","Horas insuficientes","Precipitación alta",5,45626
"27","2013-26","Manzana",7,2013-07-01,"2013-07",34.3020833333333,176434,301094,"2013","Horas insuficientes","Precipitación alta",6,45626
"28","2013-27","Manzana",7,2013-07-08,"2013-07",34.6145833333333,193280,305610,"2013","Horas insuficientes","Precipitación alta",6,45626
"29","2013-28","Manzana",7,2013-07-15,"2013-07",34.8705357142858,177526,305996,"2013","Horas insuficientes","Precipitación alta",6,45626
"30","2013-29","Manzana",7,2013-07-22,"2013-07",35.4643158183569,180920,299374,"2013","Horas insuficientes","Precipitación alta",6,45626
"31","2013-30","Manzana",7,2013-07-29,"2013-07",35.3125,72974,372960,"2013","Horas insuficientes","Precipitación alta",6,45626
"32","2013-31","Manzana",8,2013-08-05,"2013-08",35.5694444444445,192048,336312,"2013","Horas insuficientes","Precipitación alta",7,45626
"33","2013-32","Manzana",8,2013-08-12,"2013-08",35.5694444444445,206294,339154,"2013","Horas insuficientes","Precipitación alta",7,45626
"34","2013-33","Manzana",8,2013-08-19,"2013-08",37.0178182676988,212769,328551,"2013","Horas insuficientes","Precipitación alta",7,45626
"35","2013-34","Manzana",8,2013-08-26,"2013-08",37.9416666666667,188091,305533,"2013","Horas insuficientes","Precipitación alta",7,45626
"36","2013-35","Manzana",9,2013-09-02,"2013-09",37.42360302942,212758,354658,"2013","Horas insuficientes","Precipitación alta",8,45626
"37","2013-36","Manzana",9,2013-09-09,"2013-09",38.1333333333333,208274,356706,"2013","Horas insuficientes","Precipitación alta",8,45626
"38","2013-37","Manzana",9,2013-09-16,"2013-09",38.9333333333333,203840,313166,"2013","Horas insuficientes","Precipitación alta",8,45626
"39","2013-38","Manzana",9,2013-09-23,"2013-09",40.3147184566653,201313,312946,"2013","Horas insuficientes","Precipitación alta",8,45626
"40","2013-39","Manzana",9,2013-09-30,"2013-09",40.061097956353,215807,326746,"2013","Horas insuficientes","Precipitación alta",8,45626
"41","2013-40","Manzana",10,2013-10-07,"2013-10",40.1,167651,324500,"2013","Horas insuficientes","Precipitación alta",9,45626
"42","2013-41","Manzana",10,2013-10-14,"2013-10",40.1,218391,366775,"2013","Horas insuficientes","Precipitación alta",9,45626
"43","2013-42","Manzana",10,2013-10-21,"2013-10",41.6087928548006,216516,344932,"2013","Horas insuficientes","Precipitación alta",9,45626
"44","2013-43","Manzana",10,2013-10-28,"2013-10",42.924107142857,208986,336973,"2013","Horas insuficientes","Precipitación alta",9,45626
"45","2013-44","Manzana",11,2013-11-04,"2013-11",43.40625,236077,336815,"2013","Horas insuficientes","Precipitación alta",10,45626
"46","2013-45","Manzana",11,2013-11-11,"2013-11",42.2467664238094,238941,369421,"2013","Horas insuficientes","Precipitación alta",10,45626
"47","2013-46","Manzana",11,2013-11-18,"2013-11",40.450892857143,232303,320466,"2013","Horas insuficientes","Precipitación alta",10,45626
"48","2013-47","Manzana",11,2013-11-25,"2013-11",39.138392857143,197609,302764,"2013","Horas insuficientes","Precipitación alta",10,45626
"49","2013-48","Manzana",12,2013-12-02,"2013-12",39.325892857143,15990,174113,"2013","Horas insuficientes","Precipitación alta",11,45626
"50","2013-49","Manzana",12,2013-12-09,"2013-12",39.325892857143,113276,329126,"2013","Horas insuficientes","Precipitación alta",11,45626
"51","2013-50","Manzana",12,2013-12-16,"2013-12",38.90625,166161,344921,"2013","Horas insuficientes","Precipitación alta",11,45626
"52","2013-51","Manzana",12,2013-12-23,"2013-12",39.34375,129223,206589,"2013","Horas insuficientes","Precipitación alta",11,45626
"53","2013-52","Manzana",12,2013-12-30,"2013-12",39.34375,122880,130860,"2013","Horas insuficientes","Precipitación alta",11,45626
"54","2014-00","Manzana",1,2014-01-02,"2014-01",43.7380952380953,42560,122638,"2014","Horas suficientes","Precipitación alta",0,52762
"55","2014-01","Manzana",1,2014-01-06,"2014-01",42.7463608140346,210494,304306,"2014","Horas suficientes","Precipitación alta",0,52762
"56","2014-02","Manzana",1,2014-01-13,"2014-01",43.6090907418188,113872,197708,"2014","Horas suficientes","Precipitación alta",0,52762
"57","2014-03","Manzana",1,2014-01-20,"2014-01",39.75,68420,166691,"2014","Horas suficientes","Precipitación alta",0,52762
"58","2014-04","Manzana",1,2014-01-27,"2014-01",40.2642030568385,156109,257137,"2014","Horas suficientes","Precipitación alta",0,52762
"59","2014-05","Manzana",2,2014-02-03,"2014-02",39.1497117311713,248148,307316,"2014","Horas suficientes","Precipitación alta",1,52762
"60","2014-06","Manzana",2,2014-02-10,"2014-02",38.3,141942,282112,"2014","Horas suficientes","Precipitación alta",1,52762
"61","2014-07","Manzana",2,2014-02-17,"2014-02",34.2560488560212,155641,269157,"2014","Horas suficientes","Precipitación alta",1,52762
"62","2014-08","Manzana",2,2014-02-24,"2014-02",28.9681174497612,208106,323592,"2014","Horas suficientes","Precipitación alta",1,52762
"63","2014-09","Manzana",3,2014-03-03,"2014-03",28.5337954245905,185885,347021,"2014","Horas suficientes","Precipitación alta",2,52762
"64","2014-10","Manzana",3,2014-03-10,"2014-03",23.8075591081979,182462,395410,"2014","Horas suficientes","Precipitación alta",2,52762
"65","2014-11","Manzana",3,2014-03-17,"2014-03",24,254755,462351,"2014","Horas suficientes","Precipitación alta",2,52762
"66","2014-12","Manzana",3,2014-03-24,"2014-03",21.8645446257588,81810,262857,"2014","Horas suficientes","Precipitación alta",2,52762
"67","2014-13","Manzana",3,2014-03-31,"2014-03",21.9787507632378,204174,354889,"2014","Horas suficientes","Precipitación alta",2,52762
"68","2014-14","Manzana",4,2014-04-07,"2014-04",22.4464766219484,265067,402733,"2014","Horas suficientes","Precipitación alta",3,52762
"69","2014-15","Manzana",4,2014-04-14,"2014-04",22.53125,110762,214502,"2014","Horas suficientes","Precipitación alta",3,52762
"70","2014-16","Manzana",4,2014-04-21,"2014-04",22.8410076884645,216168,379626,"2014","Horas suficientes","Precipitación alta",3,52762
"71","2014-17","Manzana",4,2014-04-28,"2014-04",22.1537749924236,257378,309530,"2014","Horas suficientes","Precipitación alta",3,52762
"72","2014-18","Manzana",5,2014-05-05,"2014-05",21.8151583041114,207891,406375,"2014","Horas suficientes","Precipitación alta",4,52762
"73","2014-19","Manzana",5,2014-05-12,"2014-05",21.7416666666667,196906,316462,"2014","Horas suficientes","Precipitación alta",4,52762
"74","2014-20","Manzana",5,2014-05-19,"2014-05",22.1034114292116,154703,334173,"2014","Horas suficientes","Precipitación alta",4,52762
"75","2014-21","Manzana",5,2014-05-26,"2014-05",21.3427344305349,122858,311800,"2014","Horas suficientes","Precipitación alta",4,52762
"76","2014-22","Manzana",6,2014-06-02,"2014-06",21.8846765048666,158735,343544,"2014","Horas suficientes","Precipitación alta",5,52762
"77","2014-23","Manzana",6,2014-06-09,"2014-06",22.025,141406,289717,"2014","Horas suficientes","Precipitación alta",5,52762
"78","2014-24","Manzana",6,2014-06-16,"2014-06",21.3459239705795,178347,284058,"2014","Horas suficientes","Precipitación alta",5,52762
"79","2014-25","Manzana",6,2014-06-23,"2014-06",20.9246952045391,89828,260557,"2014","Horas suficientes","Precipitación alta",5,52762
"80","2014-26","Manzana",6,2014-06-30,"2014-06",21.1770833333332,172103,254685,"2014","Horas suficientes","Precipitación alta",5,52762
"81","2014-27","Manzana",7,2014-07-07,"2014-07",21.8113986231894,211835,308941,"2014","Horas suficientes","Precipitación alta",6,52762
"82","2014-28","Manzana",7,2014-07-14,"2014-07",22.4565180887225,189948,294330,"2014","Horas suficientes","Precipitación alta",6,52762
"83","2014-29","Manzana",7,2014-07-21,"2014-07",22.9016217701949,271198,371853,"2014","Horas suficientes","Precipitación alta",6,52762
"84","2014-30","Manzana",7,2014-07-28,"2014-07",22.9027245780577,240241,365919,"2014","Horas suficientes","Precipitación alta",6,52762
"85","2014-31","Manzana",8,2014-08-04,"2014-08",23.1516473665869,242961,389639,"2014","Horas suficientes","Precipitación alta",7,52762
"86","2014-32","Manzana",8,2014-08-11,"2014-08",23.2083333333333,243628,406400,"2014","Horas suficientes","Precipitación alta",7,52762
"87","2014-33","Manzana",8,2014-08-18,"2014-08",23.2083333333333,153497,366966,"2014","Horas suficientes","Precipitación alta",7,52762
"88","2014-34","Manzana",8,2014-08-25,"2014-08",22.9940476190475,131150,338577,"2014","Horas suficientes","Precipitación alta",7,52762
"89","2014-35","Manzana",9,2014-09-01,"2014-09",22.9929635228817,204064,397845,"2014","Horas suficientes","Precipitación alta",8,52762
"90","2014-36","Manzana",9,2014-09-08,"2014-09",23.4544272710711,198822,398513,"2014","Horas suficientes","Precipitación alta",8,52762
"91","2014-37","Manzana",9,2014-09-15,"2014-09",23.6319444444445,275090,434838,"2014","Horas suficientes","Precipitación alta",8,52762
"92","2014-38","Manzana",9,2014-09-22,"2014-09",23.6319444444445,236701,416364,"2014","Horas suficientes","Precipitación alta",8,52762
"93","2014-39","Manzana",9,2014-09-29,"2014-09",23.1319444444445,180605,402965,"2014","Horas suficientes","Precipitación alta",8,52762
"94","2014-40","Manzana",10,2014-10-06,"2014-10",23.1449446135753,283804,456628,"2014","Horas suficientes","Precipitación alta",9,52762
"95","2014-41","Manzana",10,2014-10-13,"2014-10",22.9489667596467,262900,427270,"2014","Horas suficientes","Precipitación alta",9,52762
"96","2014-42","Manzana",10,2014-10-20,"2014-10",23.4645075407287,260607,451248,"2014","Horas suficientes","Precipitación alta",9,52762
"97","2014-43","Manzana",10,2014-10-27,"2014-10",25.3169312792475,246227,445648,"2014","Horas suficientes","Precipitación alta",9,52762
"98","2014-44","Manzana",11,2014-11-03,"2014-11",25.4036385083023,220420,407180,"2014","Horas suficientes","Precipitación alta",10,52762
"99","2014-45","Manzana",11,2014-11-10,"2014-11",25.55494136421,227544,419173,"2014","Horas suficientes","Precipitación alta",10,52762
"100","2014-46","Manzana",11,2014-11-17,"2014-11",25.2524763303149,189788,421583,"2014","Horas suficientes","Precipitación alta",10,52762
"101","2014-47","Manzana",11,2014-11-24,"2014-11",28.7202941887462,193901,361567,"2014","Horas suficientes","Precipitación alta",10,52762
"102","2014-48","Manzana",12,2014-12-01,"2014-12",31.0333333333335,226660,370952,"2014","Horas suficientes","Precipitación alta",11,52762
"103","2014-49","Manzana",12,2014-12-08,"2014-12",30.965246375868,228186,391784,"2014","Horas suficientes","Precipitación alta",11,52762
"104","2014-50","Manzana",12,2014-12-15,"2014-12",30.992648077786,228117,378380,"2014","Horas suficientes","Precipitación alta",11,52762
"105","2014-51","Manzana",12,2014-12-22,"2014-12",31.5,137576,270840,"2014","Horas suficientes","Precipitación alta",11,52762
"106","2014-52","Manzana",12,2014-12-29,"2014-12",31.75,126649,186424,"2014","Horas suficientes","Precipitación alta",11,52762
"107","2015-00","Manzana",1,2015-01-01,"2015-01",NA,0,87152,"2015","Horas insuficientes","Precipitación baja",0,55454
"108","2015-01","Manzana",1,2015-01-05,"2015-01",30.6,201642,309478,"2015","Horas insuficientes","Precipitación baja",0,55454
"109","2015-02","Manzana",1,2015-01-12,"2015-01",30.3902095084609,208488,386062,"2015","Horas insuficientes","Precipitación baja",0,55454
"110","2015-03","Manzana",1,2015-01-19,"2015-01",28.5424871032797,198177,389458,"2015","Horas insuficientes","Precipitación baja",0,55454
"111","2015-04","Manzana",1,2015-01-26,"2015-01",27.1666666666665,207150,403792,"2015","Horas insuficientes","Precipitación baja",0,55454
"112","2015-05","Manzana",2,2015-02-02,"2015-02",25.9677055981973,247931,395589,"2015","Horas insuficientes","Precipitación baja",1,55454
"113","2015-06","Manzana",2,2015-02-09,"2015-02",25.0446741672301,223361,413177,"2015","Horas insuficientes","Precipitación baja",1,55454
"114","2015-07","Manzana",2,2015-02-16,"2015-02",25.9556875379051,225893,355266,"2015","Horas insuficientes","Precipitación baja",1,55454
"115","2015-08","Manzana",2,2015-02-23,"2015-02",25.6324517050718,205094,375292,"2015","Horas insuficientes","Precipitación baja",1,55454
"116","2015-09","Manzana",3,2015-03-02,"2015-03",23.9502838456773,218820,385656,"2015","Horas insuficientes","Precipitación baja",2,55454
"117","2015-10","Manzana",3,2015-03-09,"2015-03",21.6666666666667,192028,404441,"2015","Horas insuficientes","Precipitación baja",2,55454
"118","2015-11","Manzana",3,2015-03-16,"2015-03",21.0477038083227,229404,434098,"2015","Horas insuficientes","Precipitación baja",2,55454
"119","2015-12","Manzana",3,2015-03-23,"2015-03",19.304944073804,222138,387260,"2015","Horas insuficientes","Precipitación baja",2,55454
"120","2015-13","Manzana",3,2015-03-30,"2015-03",18.6666666666667,131038,207986,"2015","Horas insuficientes","Precipitación baja",2,55454
"121","2015-14","Manzana",4,2015-04-06,"2015-04",18.3807788463352,232148,439732,"2015","Horas insuficientes","Precipitación baja",3,55454
"122","2015-15","Manzana",4,2015-04-13,"2015-04",18.5320662612718,249226,419452,"2015","Horas insuficientes","Precipitación baja",3,55454
"123","2015-16","Manzana",4,2015-04-20,"2015-04",18.9206349206347,224935,392636,"2015","Horas insuficientes","Precipitación baja",3,55454
"124","2015-17","Manzana",4,2015-04-27,"2015-04",21.0238095238097,176193,349830,"2015","Horas insuficientes","Precipitación baja",3,55454
"125","2015-18","Manzana",5,2015-05-04,"2015-05",20.9583333333333,226261,401677,"2015","Horas insuficientes","Precipitación baja",4,55454
"126","2015-19","Manzana",5,2015-05-11,"2015-05",20.2615338034137,213486,369808,"2015","Horas insuficientes","Precipitación baja",4,55454
"127","2015-20","Manzana",5,2015-05-18,"2015-05",20.2477654288955,231240,383066,"2015","Horas insuficientes","Precipitación baja",4,55454
"128","2015-21","Manzana",5,2015-05-25,"2015-05",20.4166666666667,216680,372184,"2015","Horas insuficientes","Precipitación baja",4,55454
"129","2015-22","Manzana",6,2015-06-01,"2015-06",20.4166666666667,213062,371372,"2015","Horas insuficientes","Precipitación baja",5,55454
"130","2015-23","Manzana",6,2015-06-08,"2015-06",21.7708333333335,249901,420172,"2015","Horas insuficientes","Precipitación baja",5,55454
"131","2015-24","Manzana",6,2015-06-15,"2015-06",21.7708333333335,192757,358907,"2015","Horas insuficientes","Precipitación baja",5,55454
"132","2015-25","Manzana",6,2015-06-22,"2015-06",21.2282286918905,177815,341135,"2015","Horas insuficientes","Precipitación baja",5,55454
"133","2015-26","Manzana",6,2015-06-29,"2015-06",20.1531157664239,157333,288974,"2015","Horas insuficientes","Precipitación baja",5,55454
"134","2015-27","Manzana",7,2015-07-06,"2015-07",19.844696969697,165302,332811,"2015","Horas insuficientes","Precipitación baja",6,55454
"135","2015-28","Manzana",7,2015-07-13,"2015-07",19.844696969697,180095,333018,"2015","Horas insuficientes","Precipitación baja",6,55454
"136","2015-29","Manzana",7,2015-07-20,"2015-07",19.844696969697,217548,392717,"2015","Horas insuficientes","Precipitación baja",6,55454
"137","2015-30","Manzana",7,2015-07-27,"2015-07",20.083154260295,227730,375980,"2015","Horas insuficientes","Precipitación baja",6,55454
"138","2015-31","Manzana",8,2015-08-03,"2015-08",20.3042522875641,199171,335105,"2015","Horas insuficientes","Precipitación baja",7,55454
"139","2015-32","Manzana",8,2015-08-10,"2015-08",20.5757575757577,152246,404476,"2015","Horas insuficientes","Precipitación baja",7,55454
"140","2015-33","Manzana",8,2015-08-17,"2015-08",21.0755767086143,160590,357667,"2015","Horas insuficientes","Precipitación baja",7,55454
"141","2015-34","Manzana",8,2015-08-24,"2015-08",20.6212121212122,167854,296904,"2015","Horas insuficientes","Precipitación baja",7,55454
"142","2015-35","Manzana",8,2015-08-31,"2015-08",21.3863636363638,211777,388329,"2015","Horas insuficientes","Precipitación baja",7,55454
"143","2015-36","Manzana",9,2015-09-07,"2015-09",21.211183526677,251648,413932,"2015","Horas insuficientes","Precipitación baja",8,55454
"144","2015-37","Manzana",9,2015-09-14,"2015-09",21.9848484848485,193406,341853,"2015","Horas insuficientes","Precipitación baja",8,55454
"145","2015-38","Manzana",9,2015-09-21,"2015-09",21.9848484848485,242268,395118,"2015","Horas insuficientes","Precipitación baja",8,55454
"146","2015-39","Manzana",9,2015-09-28,"2015-09",21.9848484848485,212756,427415,"2015","Horas insuficientes","Precipitación baja",8,55454
"147","2015-40","Manzana",10,2015-10-05,"2015-10",21.9848484848485,204800,427694,"2015","Horas insuficientes","Precipitación baja",9,55454
"148","2015-41","Manzana",10,2015-10-12,"2015-10",21.9848484848485,246030,431270,"2015","Horas insuficientes","Precipitación baja",9,55454
"149","2015-42","Manzana",10,2015-10-19,"2015-10",21.9848484848485,199133,387790,"2015","Horas insuficientes","Precipitación baja",9,55454
"150","2015-43","Manzana",10,2015-10-26,"2015-10",30.2444444444445,194251,422058,"2015","Horas insuficientes","Precipitación baja",9,55454
"151","2015-44","Manzana",11,2015-11-02,"2015-11",26.5625,117568,387717,"2015","Horas insuficientes","Precipitación baja",10,55454
"152","2015-45","Manzana",11,2015-11-09,"2015-11",25.4089631819202,227171,453989,"2015","Horas insuficientes","Precipitación baja",10,55454
"153","2015-46","Manzana",11,2015-11-16,"2015-11",28.4307880676564,254252,415521,"2015","Horas insuficientes","Precipitación baja",10,55454
"154","2015-47","Manzana",11,2015-11-23,"2015-11",30.2444444444445,218727,391891,"2015","Horas insuficientes","Precipitación baja",10,55454
"155","2015-48","Manzana",11,2015-11-30,"2015-11",30.2444444444445,258940,443572,"2015","Horas insuficientes","Precipitación baja",10,55454
"156","2015-49","Manzana",12,2015-12-07,"2015-12",29.5666666666665,141207,396391,"2015","Horas insuficientes","Precipitación baja",11,55454
"157","2015-50","Manzana",12,2015-12-14,"2015-12",32.1780301769775,171714,397264,"2015","Horas insuficientes","Precipitación baja",11,55454
"158","2015-51","Manzana",12,2015-12-21,"2015-12",36.0560485426326,234671,276661,"2015","Horas insuficientes","Precipitación baja",11,55454
"159","2015-52","Manzana",12,2015-12-28,"2015-12",37.7666666666665,194955,247337,"2015","Horas insuficientes","Precipitación baja",11,55454
"160","2016-01","Manzana",1,2016-01-04,"2016-01",37.7666666666665,192746,324702,"2016","Horas insuficientes","Precipitación baja",0,37675
"161","2016-02","Manzana",1,2016-01-11,"2016-01",38.754146704393,177418,356536,"2016","Horas insuficientes","Precipitación baja",0,37675
"162","2016-03","Manzana",1,2016-01-18,"2016-01",47.5262881009146,171551,308441,"2016","Horas insuficientes","Precipitación baja",0,37675
"163","2016-04","Manzana",1,2016-01-25,"2016-01",48.1223896756851,160708,326994,"2016","Horas insuficientes","Precipitación baja",0,37675
"164","2016-05","Manzana",2,2016-02-01,"2016-02",44.6131492145133,214644,341113,"2016","Horas insuficientes","Precipitación baja",1,37675
"165","2016-06","Manzana",2,2016-02-08,"2016-02",44.7997932267799,178940,339831,"2016","Horas insuficientes","Precipitación baja",1,37675
"166","2016-07","Manzana",2,2016-02-15,"2016-02",38.2838710894141,185586,332826,"2016","Horas insuficientes","Precipitación baja",1,37675
"167","2016-08","Manzana",2,2016-02-22,"2016-02",37.2923143939025,205462,361994,"2016","Horas insuficientes","Precipitación baja",1,37675
"168","2016-09","Manzana",2,2016-02-29,"2016-02",42.5,177680,343530,"2016","Horas insuficientes","Precipitación baja",1,37675
"169","2016-10","Manzana",3,2016-03-07,"2016-03",42.828260060108,200528,367822,"2016","Horas insuficientes","Precipitación baja",2,37675
"170","2016-11","Manzana",3,2016-03-14,"2016-03",44.5085074216507,239749,420465,"2016","Horas insuficientes","Precipitación baja",2,37675
"171","2016-12","Manzana",3,2016-03-21,"2016-03",NA,127674,185202,"2016","Horas insuficientes","Precipitación baja",2,37675
"172","2016-13","Manzana",3,2016-03-28,"2016-03",42.3385545511905,215725,394231,"2016","Horas insuficientes","Precipitación baja",2,37675
"173","2016-14","Manzana",4,2016-04-04,"2016-04",41.1585281500767,197422,373761,"2016","Horas insuficientes","Precipitación baja",3,37675
"174","2016-15","Manzana",4,2016-04-11,"2016-04",41.0345678341484,202430,385260,"2016","Horas insuficientes","Precipitación baja",3,37675
"175","2016-16","Manzana",4,2016-04-18,"2016-04",41.4318118140812,196608,351903,"2016","Horas insuficientes","Precipitación baja",3,37675
"176","2016-17","Manzana",4,2016-04-25,"2016-04",42.0767084837482,216544,373244,"2016","Horas insuficientes","Precipitación baja",3,37675
"177","2016-18","Manzana",5,2016-05-02,"2016-05",42.1708510168781,156286,301179,"2016","Horas insuficientes","Precipitación baja",4,37675
"178","2016-19","Manzana",5,2016-05-09,"2016-05",41.9479166666667,96340,335840,"2016","Horas insuficientes","Precipitación baja",4,37675
"179","2016-20","Manzana",5,2016-05-16,"2016-05",41.9479166666667,129618,267772,"2016","Horas insuficientes","Precipitación baja",4,37675
"180","2016-21","Manzana",5,2016-05-23,"2016-05",41.9479166666668,113057,283567,"2016","Horas insuficientes","Precipitación baja",4,37675
"181","2016-22","Manzana",5,2016-05-30,"2016-05",41.9479166666667,143154,277645,"2016","Horas insuficientes","Precipitación baja",4,37675
"182","2016-23","Manzana",6,2016-06-06,"2016-06",42.2771144349802,129778,297922,"2016","Horas insuficientes","Precipitación baja",5,37675
"183","2016-24","Manzana",6,2016-06-13,"2016-06",42.404761904762,155667,284049,"2016","Horas insuficientes","Precipitación baja",5,37675
"184","2016-25","Manzana",6,2016-06-20,"2016-06",42.404761904762,100116,233846,"2016","Horas insuficientes","Precipitación baja",5,37675
"185","2016-26","Manzana",6,2016-06-27,"2016-06",42.6440828957408,132625,209905,"2016","Horas insuficientes","Precipitación baja",5,37675
"186","2016-27","Manzana",7,2016-07-04,"2016-07",42.8869047619048,165006,268146,"2016","Horas insuficientes","Precipitación baja",6,37675
"187","2016-28","Manzana",7,2016-07-11,"2016-07",46.2489078546789,126008,238253,"2016","Horas insuficientes","Precipitación baja",6,37675
"188","2016-29","Manzana",7,2016-07-18,"2016-07",44.7976190476188,71051,240476,"2016","Horas insuficientes","Precipitación baja",6,37675
"189","2016-30","Manzana",7,2016-07-25,"2016-07",46.0642326346309,165654,270105,"2016","Horas insuficientes","Precipitación baja",6,37675
"190","2016-31","Manzana",8,2016-08-01,"2016-08",47.2916666666667,147629,290521,"2016","Horas insuficientes","Precipitación baja",7,37675
"191","2016-32","Manzana",8,2016-08-08,"2016-08",47.3412384314295,151416,293376,"2016","Horas insuficientes","Precipitación baja",7,37675
"192","2016-33","Manzana",8,2016-08-15,"2016-08",49.1035418628374,169920,280837,"2016","Horas insuficientes","Precipitación baja",7,37675
"193","2016-34","Manzana",8,2016-08-22,"2016-08",48.4761904761905,40290,254851,"2016","Horas insuficientes","Precipitación baja",7,37675
"194","2016-35","Manzana",8,2016-08-29,"2016-08",48.3928571428573,109265,313709,"2016","Horas insuficientes","Precipitación baja",7,37675
"195","2016-36","Manzana",9,2016-09-05,"2016-09",48.3452380952382,106687,293547,"2016","Horas insuficientes","Precipitación baja",8,37675
"196","2016-37","Manzana",9,2016-09-12,"2016-09",47.9643746544241,153126,326626,"2016","Horas insuficientes","Precipitación baja",8,37675
"197","2016-38","Manzana",9,2016-09-19,"2016-09",47.9855582688915,163800,276092,"2016","Horas insuficientes","Precipitación baja",8,37675
"198","2016-39","Manzana",9,2016-09-26,"2016-09",47.557006370403,181220,317440,"2016","Horas insuficientes","Precipitación baja",8,37675
"199","2016-40","Manzana",10,2016-10-03,"2016-10",46.8165473147133,179940,335148,"2016","Horas insuficientes","Precipitación baja",9,37675
"200","2016-41","Manzana",10,2016-10-10,"2016-10",48.6634120118383,162990,323830,"2016","Horas insuficientes","Precipitación baja",9,37675
"201","2016-42","Manzana",10,2016-10-17,"2016-10",50.857142857143,158947,291163,"2016","Horas insuficientes","Precipitación baja",9,37675
"202","2016-43","Manzana",10,2016-10-24,"2016-10",51.0745656759349,149000,286673,"2016","Horas insuficientes","Precipitación baja",9,37675
"203","2016-44","Manzana",10,2016-10-31,"2016-10",51.357142857143,193499,253817,"2016","Horas insuficientes","Precipitación baja",9,37675
"204","2016-45","Manzana",11,2016-11-07,"2016-11",53.3025245177282,185580,321360,"2016","Horas insuficientes","Precipitación baja",10,37675
"205","2016-46","Manzana",11,2016-11-14,"2016-11",54.5618161264713,144855,300241,"2016","Horas insuficientes","Precipitación baja",10,37675
"206","2016-47","Manzana",11,2016-11-21,"2016-11",59.875,116977,272911,"2016","Horas insuficientes","Precipitación baja",10,37675
"207","2016-48","Manzana",11,2016-11-28,"2016-11",60.5252988411866,110803,262315,"2016","Horas insuficientes","Precipitación baja",10,37675
"208","2016-49","Manzana",12,2016-12-05,"2016-12",60.6661769470292,134929,243766,"2016","Horas insuficientes","Precipitación baja",11,37675
"209","2016-50","Manzana",12,2016-12-12,"2016-12",63.407492790009,107875,205682,"2016","Horas insuficientes","Precipitación baja",11,37675
"210","2016-51","Manzana",12,2016-12-19,"2016-12",63.0993865190024,132613,235378,"2016","Horas insuficientes","Precipitación baja",11,37675
"211","2016-52","Manzana",12,2016-12-26,"2016-12",62.0281359118989,111690,198893,"2016","Horas insuficientes","Precipitación baja",11,37675
"212","2017-01","Manzana",1,2017-01-02,"2017-01",56.8123583086136,88661,192037,"2017","Horas insuficientes","Precipitación baja",0,62000
"213","2017-02","Manzana",1,2017-01-09,"2017-01",57.266063868311,86527,177947,"2017","Horas insuficientes","Precipitación baja",0,62000
"214","2017-03","Manzana",1,2017-01-16,"2017-01",53.2104495542817,141644,261459,"2017","Horas insuficientes","Precipitación baja",0,62000
"215","2017-04","Manzana",1,2017-01-23,"2017-01",42.4212781535249,166631,301471,"2017","Horas insuficientes","Precipitación baja",0,62000
"216","2017-05","Manzana",1,2017-01-30,"2017-01",29.1625600125769,165382,354161,"2017","Horas insuficientes","Precipitación baja",0,62000
"217","2017-06","Manzana",2,2017-02-06,"2017-02",28.9846766317686,197623,393271,"2017","Horas insuficientes","Precipitación baja",1,62000
"218","2017-07","Manzana",2,2017-02-13,"2017-02",25.4266008609005,176327,375455,"2017","Horas insuficientes","Precipitación baja",1,62000
"219","2017-08","Manzana",2,2017-02-20,"2017-02",23.2247154961807,215580,373940,"2017","Horas insuficientes","Precipitación baja",1,62000
"220","2017-09","Manzana",2,2017-02-27,"2017-02",24.8333333333333,167558,333131,"2017","Horas insuficientes","Precipitación baja",1,62000
"221","2017-10","Manzana",3,2017-03-06,"2017-03",23.014880952381,206304,477893,"2017","Horas insuficientes","Precipitación baja",2,62000
"222","2017-11","Manzana",3,2017-03-13,"2017-03",24.3333333333333,263255,485076,"2017","Horas insuficientes","Precipitación baja",2,62000
"223","2017-12","Manzana",3,2017-03-20,"2017-03",23.4114419295717,224796,431515,"2017","Horas insuficientes","Precipitación baja",2,62000
"224","2017-13","Manzana",3,2017-03-27,"2017-03",23.8716047339553,305143,468898,"2017","Horas insuficientes","Precipitación baja",2,62000
"225","2017-14","Manzana",4,2017-04-03,"2017-04",24.75,181445,497076,"2017","Horas insuficientes","Precipitación baja",3,62000
"226","2017-15","Manzana",4,2017-04-10,"2017-04",24.0666666666667,114343,225180,"2017","Horas insuficientes","Precipitación baja",3,62000
"227","2017-16","Manzana",4,2017-04-17,"2017-04",24.0666666666667,282315,484482,"2017","Horas insuficientes","Precipitación baja",3,62000
"228","2017-17","Manzana",4,2017-04-24,"2017-04",24.6980420031416,228967,362651,"2017","Horas insuficientes","Precipitación baja",3,62000
"229","2017-18","Manzana",5,2017-05-01,"2017-05",27.7555555555557,63057,313902,"2017","Horas insuficientes","Precipitación baja",4,62000
"230","2017-19","Manzana",5,2017-05-08,"2017-05",27.7555555555557,218956,434760,"2017","Horas insuficientes","Precipitación baja",4,62000
"231","2017-20","Manzana",5,2017-05-15,"2017-05",24.955277230713,184317,282410,"2017","Horas insuficientes","Precipitación baja",4,62000
"232","2017-21","Manzana",5,2017-05-22,"2017-05",22.5836020759875,227169,330390,"2017","Horas insuficientes","Precipitación baja",4,62000
"233","2017-22","Manzana",5,2017-05-29,"2017-05",22.9,151146,328996,"2017","Horas insuficientes","Precipitación baja",4,62000
"234","2017-23","Manzana",6,2017-06-05,"2017-06",23.0525479195886,199640,343167,"2017","Horas insuficientes","Precipitación baja",5,62000
"235","2017-24","Manzana",6,2017-06-12,"2017-06",23.2333333333332,240220,363809,"2017","Horas insuficientes","Precipitación baja",5,62000
"236","2017-25","Manzana",6,2017-06-19,"2017-06",23.2333333333332,201410,321521,"2017","Horas insuficientes","Precipitación baja",5,62000
"237","2017-26","Manzana",6,2017-06-26,"2017-06",23.2333333333332,176332,355605,"2017","Horas insuficientes","Precipitación baja",5,62000
"238","2017-27","Manzana",7,2017-07-03,"2017-07",23.3259452451306,165830,291962,"2017","Horas insuficientes","Precipitación baja",6,62000
"239","2017-28","Manzana",7,2017-07-10,"2017-07",23.4166666666667,210891,373592,"2017","Horas insuficientes","Precipitación baja",6,62000
"240","2017-29","Manzana",7,2017-07-17,"2017-07",27.6833333333333,157344,305735,"2017","Horas insuficientes","Precipitación baja",6,62000
"241","2017-30","Manzana",7,2017-07-24,"2017-07",27.7833333333332,144707,358665,"2017","Horas insuficientes","Precipitación baja",6,62000
"242","2017-31","Manzana",7,2017-07-31,"2017-07",28.0833333333333,188556,356203,"2017","Horas insuficientes","Precipitación baja",6,62000
"243","2017-32","Manzana",8,2017-08-07,"2017-08",28.0833333333333,229525,426091,"2017","Horas insuficientes","Precipitación baja",7,62000
"244","2017-33","Manzana",8,2017-08-14,"2017-08",29.4481017752336,221154,403881,"2017","Horas insuficientes","Precipitación baja",7,62000
"245","2017-34","Manzana",8,2017-08-21,"2017-08",29.5833333333335,229732,349562,"2017","Horas insuficientes","Precipitación baja",7,62000
"246","2017-35","Manzana",8,2017-08-28,"2017-08",29.5833333333335,211965,394225,"2017","Horas insuficientes","Precipitación baja",7,62000
"247","2017-36","Manzana",9,2017-09-04,"2017-09",29.2513501126862,197726,443838,"2017","Horas insuficientes","Precipitación baja",8,62000
"248","2017-37","Manzana",9,2017-09-11,"2017-09",29.0903068422841,225569,418680,"2017","Horas insuficientes","Precipitación baja",8,62000
"249","2017-38","Manzana",9,2017-09-18,"2017-09",29.0762834972153,213094,399331,"2017","Horas insuficientes","Precipitación baja",8,62000
"250","2017-39","Manzana",9,2017-09-25,"2017-09",29.1031746031748,212057,400626,"2017","Horas insuficientes","Precipitación baja",8,62000
"251","2017-40","Manzana",10,2017-10-02,"2017-10",29.1031746031748,285318,444489,"2017","Horas insuficientes","Precipitación baja",9,62000
"252","2017-41","Manzana",10,2017-10-09,"2017-10",31.6080001817977,266300,480246,"2017","Horas insuficientes","Precipitación baja",9,62000
"253","2017-42","Manzana",10,2017-10-16,"2017-10",35.25,295401,442783,"2017","Horas insuficientes","Precipitación baja",9,62000
"254","2017-43","Manzana",10,2017-10-23,"2017-10",38.7320306245277,304056,473338,"2017","Horas insuficientes","Precipitación baja",9,62000
"255","2017-44","Manzana",10,2017-10-30,"2017-10",42.767857142857,130236,380144,"2017","Horas insuficientes","Precipitación baja",9,62000
"256","2017-45","Manzana",11,2017-11-06,"2017-11",42.767857142857,220333,540012,"2017","Horas insuficientes","Precipitación baja",10,62000
"257","2017-46","Manzana",11,2017-11-13,"2017-11",43.8517146085368,314488,519807,"2017","Horas insuficientes","Precipitación baja",10,62000
"258","2017-47","Manzana",11,2017-11-20,"2017-11",47.5833333333335,250478,490237,"2017","Horas insuficientes","Precipitación baja",10,62000
"259","2017-48","Manzana",11,2017-11-27,"2017-11",43.25,207229,418667,"2017","Horas insuficientes","Precipitación baja",10,62000
"260","2017-49","Manzana",12,2017-12-04,"2017-12",45.2334754045501,198492,512884,"2017","Horas insuficientes","Precipitación baja",11,62000
"261","2017-50","Manzana",12,2017-12-11,"2017-12",47.1666666666665,195711,429712,"2017","Horas insuficientes","Precipitación baja",11,62000
"262","2017-51","Manzana",12,2017-12-18,"2017-12",47.1666666666665,272855,518928,"2017","Horas insuficientes","Precipitación baja",11,62000
"263","2017-52","Manzana",12,2017-12-25,"2017-12",47.1666666666665,109480,360862,"2017","Horas insuficientes","Precipitación baja",11,62000
"264","2018-00","Manzana",1,2018-01-01,"2018-01",45.2916666666665,98019,294811,"2018","Horas insuficientes","Precipitación baja",0,47500
"265","2018-01","Manzana",1,2018-01-08,"2018-01",44.9950873176044,195226,395488,"2018","Horas insuficientes","Precipitación baja",0,47500
"266","2018-02","Manzana",1,2018-01-15,"2018-01",41.4419841918345,252106,462022,"2018","Horas insuficientes","Precipitación baja",0,47500
"267","2018-03","Manzana",1,2018-01-22,"2018-01",39.833333333333,222421,446448,"2018","Horas insuficientes","Precipitación baja",0,47500
"268","2018-04","Manzana",1,2018-01-29,"2018-01",37.7301748647818,266606,498656,"2018","Horas insuficientes","Precipitación baja",0,47500
"269","2018-05","Manzana",2,2018-02-05,"2018-02",37.619047619048,259877,484037,"2018","Horas insuficientes","Precipitación baja",1,47500
"270","2018-06","Manzana",2,2018-02-12,"2018-02",37.4930919083869,209013,409658,"2018","Horas insuficientes","Precipitación baja",1,47500
"271","2018-07","Manzana",2,2018-02-19,"2018-02",37.4763967728229,183566,360525,"2018","Horas insuficientes","Precipitación baja",1,47500
"272","2018-08","Manzana",2,2018-02-26,"2018-02",37.8666666666665,214242,438794,"2018","Horas insuficientes","Precipitación baja",1,47500
"273","2018-09","Manzana",3,2018-03-05,"2018-03",39.960015583888,210046,435560,"2018","Horas insuficientes","Precipitación baja",2,47500
"274","2018-10","Manzana",3,2018-03-12,"2018-03",37.5,190940,430482,"2018","Horas insuficientes","Precipitación baja",2,47500
"275","2018-11","Manzana",3,2018-03-19,"2018-03",37.2624069687549,208129,421227,"2018","Horas insuficientes","Precipitación baja",2,47500
"276","2018-12","Manzana",3,2018-03-26,"2018-03",36.4285714285714,82922,185300,"2018","Horas insuficientes","Precipitación baja",2,47500
"277","2018-13","Manzana",4,2018-04-02,"2018-04",38.7887631939269,319402,505423,"2018","Horas insuficientes","Precipitación baja",3,47500
"278","2018-14","Manzana",4,2018-04-09,"2018-04",37.9120666636409,264402,452554,"2018","Horas insuficientes","Precipitación baja",3,47500
"279","2018-15","Manzana",4,2018-04-16,"2018-04",37.9490128957819,261455,419646,"2018","Horas insuficientes","Precipitación baja",3,47500
"280","2018-16","Manzana",4,2018-04-23,"2018-04",38.8333333333332,198615,358267,"2018","Horas insuficientes","Precipitación baja",3,47500
"281","2018-17","Manzana",4,2018-04-30,"2018-04",39.402777777778,179145,349068,"2018","Horas insuficientes","Precipitación baja",3,47500
"282","2018-18","Manzana",5,2018-05-07,"2018-05",39.402777777778,231814,453031,"2018","Horas insuficientes","Precipitación baja",4,47500
"283","2018-19","Manzana",5,2018-05-14,"2018-05",39.402777777778,227271,423937,"2018","Horas insuficientes","Precipitación baja",4,47500
"284","2018-20","Manzana",5,2018-05-21,"2018-05",43.2916666666667,164644,349646,"2018","Horas insuficientes","Precipitación baja",4,47500
"285","2018-21","Manzana",5,2018-05-28,"2018-05",43.2854660948143,179961,339294,"2018","Horas insuficientes","Precipitación baja",4,47500
"286","2018-22","Manzana",6,2018-06-04,"2018-06",43.2777777777777,178695,380168,"2018","Horas insuficientes","Precipitación baja",5,47500
"287","2018-23","Manzana",6,2018-06-11,"2018-06",43.192300444466,105627,333554,"2018","Horas insuficientes","Precipitación baja",5,47500
"288","2018-24","Manzana",6,2018-06-18,"2018-06",43.4143137601847,158244,326176,"2018","Horas insuficientes","Precipitación baja",5,47500
"289","2018-25","Manzana",6,2018-06-25,"2018-06",43.3541666666667,190116,348687,"2018","Horas insuficientes","Precipitación baja",5,47500
"290","2018-26","Manzana",7,2018-07-02,"2018-07",47.2951385807366,180286,318396,"2018","Horas insuficientes","Precipitación baja",6,47500
"291","2018-27","Manzana",7,2018-07-09,"2018-07",47.3003479999608,125963,305291,"2018","Horas insuficientes","Precipitación baja",6,47500
"292","2018-28","Manzana",7,2018-07-16,"2018-07",48.2343636859563,214388,337004,"2018","Horas insuficientes","Precipitación baja",6,47500
"293","2018-29","Manzana",7,2018-07-23,"2018-07",47.315476190476,169354,317715,"2018","Horas insuficientes","Precipitación baja",6,47500
"294","2018-30","Manzana",7,2018-07-30,"2018-07",43.5357142857142,148179,348409,"2018","Horas insuficientes","Precipitación baja",6,47500
"295","2018-31","Manzana",8,2018-08-06,"2018-08",44.9713243053669,261511,383895,"2018","Horas insuficientes","Precipitación baja",7,47500
"296","2018-32","Manzana",8,2018-08-13,"2018-08",46.2460543905886,174540,349260,"2018","Horas insuficientes","Precipitación baja",7,47500
"297","2018-33","Manzana",8,2018-08-20,"2018-08",44.7857142857142,121734,338645,"2018","Horas insuficientes","Precipitación baja",7,47500
"298","2018-34","Manzana",8,2018-08-27,"2018-08",46.388888888889,209202,363214,"2018","Horas insuficientes","Precipitación baja",7,47500
"299","2018-35","Manzana",9,2018-09-03,"2018-09",46.388888888889,237015,447315,"2018","Horas insuficientes","Precipitación baja",8,47500
"300","2018-36","Manzana",9,2018-09-10,"2018-09",46.388888888889,214038,418698,"2018","Horas insuficientes","Precipitación baja",8,47500
"301","2018-37","Manzana",9,2018-09-17,"2018-09",45.9575708047031,211634,383838,"2018","Horas insuficientes","Precipitación baja",8,47500
"302","2018-38","Manzana",9,2018-09-24,"2018-09",45.920634920635,218387,389496,"2018","Horas insuficientes","Precipitación baja",8,47500
"303","2018-39","Manzana",10,2018-10-01,"2018-10",46.2423411147887,186061,409600,"2018","Horas insuficientes","Precipitación baja",9,47500
"304","2018-40","Manzana",10,2018-10-08,"2018-10",47.031746031746,222248,425294,"2018","Horas insuficientes","Precipitación baja",9,47500
"305","2018-41","Manzana",10,2018-10-15,"2018-10",47.031746031746,217742,405268,"2018","Horas insuficientes","Precipitación baja",9,47500
"306","2018-42","Manzana",10,2018-10-22,"2018-10",47.1148781599651,236255,434596,"2018","Horas insuficientes","Precipitación baja",9,47500
"307","2018-43","Manzana",10,2018-10-29,"2018-10",46.5723308758209,261834,397510,"2018","Horas insuficientes","Precipitación baja",9,47500
"308","2018-44","Manzana",11,2018-11-05,"2018-11",47.095238095238,242858,463374,"2018","Horas insuficientes","Precipitación baja",10,47500
"309","2018-45","Manzana",11,2018-11-12,"2018-11",47.388888888889,223850,421881,"2018","Horas insuficientes","Precipitación baja",10,47500
"310","2018-46","Manzana",11,2018-11-19,"2018-11",51.5833333333335,249865,426267,"2018","Horas insuficientes","Precipitación baja",10,47500
"311","2018-47","Manzana",11,2018-11-26,"2018-11",57.6032519334777,198181,372229,"2018","Horas insuficientes","Precipitación baja",10,47500
"312","2018-48","Manzana",12,2018-12-03,"2018-12",57.4942876226305,220086,412298,"2018","Horas insuficientes","Precipitación baja",11,47500
"313","2018-49","Manzana",12,2018-12-10,"2018-12",57.7914942848412,209443,397368,"2018","Horas insuficientes","Precipitación baja",11,47500
"314","2018-50","Manzana",12,2018-12-17,"2018-12",62.2015021513701,157574,432899,"2018","Horas insuficientes","Precipitación baja",11,47500
"315","2018-51","Manzana",12,2018-12-24,"2018-12",69.4375,111788,302144,"2018","Horas insuficientes","Precipitación baja",11,47500
"316","2018-52","Manzana",12,2018-12-31,"2018-12",NA,9140,9140,"2018","Horas insuficientes","Precipitación baja",11,47500
"317","2019-00","Manzana",1,2019-01-03,"2019-01",69.4375,83190,228984,"2019","Horas insuficientes","Precipitación baja",0,60000
"318","2019-01","Manzana",1,2019-01-07,"2019-01",60.4488397188928,140160,323735,"2019","Horas insuficientes","Precipitación baja",0,60000
"319","2019-02","Manzana",1,2019-01-14,"2019-01",58.0555555555555,153803,338238,"2019","Horas insuficientes","Precipitación baja",0,60000
"320","2019-03","Manzana",1,2019-01-21,"2019-01",51.25,176351,379342,"2019","Horas insuficientes","Precipitación baja",0,60000
"321","2019-04","Manzana",1,2019-01-28,"2019-01",48.3926431111933,232331,398950,"2019","Horas insuficientes","Precipitación baja",0,60000
"322","2019-05","Manzana",2,2019-02-04,"2019-02",47.3352962079293,196990,406876,"2019","Horas insuficientes","Precipitación baja",1,60000
"323","2019-06","Manzana",2,2019-02-11,"2019-02",45.6384714576204,188188,360788,"2019","Horas insuficientes","Precipitación baja",1,60000
"324","2019-07","Manzana",2,2019-02-18,"2019-02",39.3721872529344,153468,388173,"2019","Horas insuficientes","Precipitación baja",1,60000
"325","2019-08","Manzana",2,2019-02-25,"2019-02",33.8120115064481,160229,399927,"2019","Horas insuficientes","Precipitación baja",1,60000
"326","2019-09","Manzana",3,2019-03-04,"2019-03",31.0208333333333,159360,417531,"2019","Horas insuficientes","Precipitación baja",2,60000
"327","2019-10","Manzana",3,2019-03-11,"2019-03",31.0208333333333,213184,425622,"2019","Horas insuficientes","Precipitación baja",2,60000
"328","2019-11","Manzana",3,2019-03-18,"2019-03",29.1709213019353,233985,413990,"2019","Horas insuficientes","Precipitación baja",2,60000
"329","2019-12","Manzana",3,2019-03-25,"2019-03",27.7570279854136,102744,393626,"2019","Horas insuficientes","Precipitación baja",2,60000
"330","2019-13","Manzana",4,2019-04-01,"2019-04",27.8125,189475,448630,"2019","Horas insuficientes","Precipitación baja",3,60000
"331","2019-14","Manzana",4,2019-04-08,"2019-04",27.8855466456415,284421,491162,"2019","Horas insuficientes","Precipitación baja",3,60000
"332","2019-15","Manzana",4,2019-04-15,"2019-04",NA,102024,242225,"2019","Horas insuficientes","Precipitación baja",3,60000
"333","2019-16","Manzana",4,2019-04-22,"2019-04",28.2134229136544,242757,515138,"2019","Horas insuficientes","Precipitación baja",3,60000
"334","2019-17","Manzana",4,2019-04-29,"2019-04",27.0284092182754,278813,403853,"2019","Horas insuficientes","Precipitación baja",3,60000
"335","2019-18","Manzana",5,2019-05-06,"2019-05",24.3541666666667,255331,499572,"2019","Horas insuficientes","Precipitación baja",4,60000
"336","2019-19","Manzana",5,2019-05-13,"2019-05",24.3541666666667,279296,443996,"2019","Horas insuficientes","Precipitación baja",4,60000
"337","2019-20","Manzana",5,2019-05-20,"2019-05",24.3541666666667,135771,398357,"2019","Horas insuficientes","Precipitación baja",4,60000
"338","2019-21","Manzana",5,2019-05-27,"2019-05",24.3541666666667,219401,441868,"2019","Horas insuficientes","Precipitación baja",4,60000
"339","2019-22","Manzana",6,2019-06-03,"2019-06",24.3541666666667,223591,479630,"2019","Horas insuficientes","Precipitación baja",5,60000
"340","2019-23","Manzana",6,2019-06-10,"2019-06",24.0625,264633,458217,"2019","Horas insuficientes","Precipitación baja",5,60000
"341","2019-24","Manzana",6,2019-06-17,"2019-06",23.9864892149842,193638,338059,"2019","Horas insuficientes","Precipitación baja",5,60000
"342","2019-25","Manzana",6,2019-06-24,"2019-06",23.888888888889,207928,378997,"2019","Horas insuficientes","Precipitación baja",5,60000
"343","2019-26","Manzana",7,2019-07-01,"2019-07",23.6276315612582,190091,351043,"2019","Horas insuficientes","Precipitación baja",6,60000
"344","2019-27","Manzana",7,2019-07-08,"2019-07",23.3055555555557,210827,370043,"2019","Horas insuficientes","Precipitación baja",6,60000
"345","2019-28","Manzana",7,2019-07-15,"2019-07",23.3055555555557,130336,372387,"2019","Horas insuficientes","Precipitación baja",6,60000
"346","2019-29","Manzana",7,2019-07-22,"2019-07",26.0416666666667,190054,393060,"2019","Horas insuficientes","Precipitación baja",6,60000
"347","2019-30","Manzana",7,2019-07-29,"2019-07",26.2962962962963,212497,392458,"2019","Horas insuficientes","Precipitación baja",6,60000
"348","2019-31","Manzana",8,2019-08-05,"2019-08",29.286135208787,186740,427562,"2019","Horas insuficientes","Precipitación baja",7,60000
"349","2019-32","Manzana",8,2019-08-12,"2019-08",33.6944444444443,204189,418860,"2019","Horas insuficientes","Precipitación baja",7,60000
"350","2019-33","Manzana",8,2019-08-19,"2019-08",33.6944444444443,206990,370346,"2019","Horas insuficientes","Precipitación baja",7,60000
"351","2019-34","Manzana",8,2019-08-26,"2019-08",33.6944444444443,176113,368052,"2019","Horas insuficientes","Precipitación baja",7,60000
"352","2019-35","Manzana",9,2019-09-02,"2019-09",33.7040639339309,229168,475394,"2019","Horas insuficientes","Precipitación baja",8,60000
"353","2019-36","Manzana",9,2019-09-09,"2019-09",33.7152777777777,204838,384532,"2019","Horas insuficientes","Precipitación baja",8,60000
"354","2019-37","Manzana",9,2019-09-16,"2019-09",33.8892693283207,236386,423962,"2019","Horas insuficientes","Precipitación baja",8,60000
"355","2019-38","Manzana",9,2019-09-23,"2019-09",34.1319444444443,255075,419158,"2019","Horas insuficientes","Precipitación baja",8,60000
"356","2019-39","Manzana",9,2019-09-30,"2019-09",34.6180555555557,239660,519258,"2019","Horas insuficientes","Precipitación baja",8,60000
"357","2019-40","Manzana",10,2019-10-07,"2019-10",34.6180555555557,205813,484524,"2019","Horas insuficientes","Precipitación baja",9,60000
"358","2019-41","Manzana",10,2019-10-14,"2019-10",34.6180555555557,162788,435263,"2019","Horas insuficientes","Precipitación baja",9,60000
"359","2019-42","Manzana",10,2019-10-21,"2019-10",34.6180555555557,222107,439937,"2019","Horas insuficientes","Precipitación baja",9,60000
"360","2019-43","Manzana",10,2019-10-28,"2019-10",34.6180555555557,299886,423046,"2019","Horas insuficientes","Precipitación baja",9,60000
"361","2019-44","Manzana",11,2019-11-04,"2019-11",34.7489208200466,292165,500047,"2019","Horas insuficientes","Precipitación baja",10,60000
"362","2019-45","Manzana",11,2019-11-11,"2019-11",34.8680555555557,162759,552986,"2019","Horas insuficientes","Precipitación baja",10,60000
"363","2019-46","Manzana",11,2019-11-18,"2019-11",36.624203849067,275937,572447,"2019","Horas insuficientes","Precipitación baja",10,60000
"364","2019-47","Manzana",11,2019-11-25,"2019-11",35.9761904761903,152703,514109,"2019","Horas insuficientes","Precipitación baja",10,60000
"365","2019-48","Manzana",12,2019-12-02,"2019-12",35.9761904761903,195014,454278,"2019","Horas insuficientes","Precipitación baja",11,60000
"366","2019-49","Manzana",12,2019-12-09,"2019-12",35.9761904761903,217079,466559,"2019","Horas insuficientes","Precipitación baja",11,60000
"367","2019-50","Manzana",12,2019-12-16,"2019-12",36.4206349206347,302326,496907,"2019","Horas insuficientes","Precipitación baja",11,60000
"368","2019-51","Manzana",12,2019-12-23,"2019-12",36.4206349206347,177050,362564,"2019","Horas insuficientes","Precipitación baja",11,60000
"369","2019-52","Manzana",12,2019-12-30,"2019-12",36.4206349206347,108618,126529,"2019","Horas insuficientes","Precipitación baja",11,60000
"370","2020-00","Manzana",1,2020-01-02,"2020-01",36.4206349206347,71078,153552,"2020","Horas insuficientes","Precipitación baja",0,52500
"371","2020-01","Manzana",1,2020-01-06,"2020-01",36.4206349206347,169151,381406,"2020","Horas insuficientes","Precipitación baja",0,52500
"372","2020-02","Manzana",1,2020-01-13,"2020-01",36.4206349206347,209327,422351,"2020","Horas insuficientes","Precipitación baja",0,52500
"373","2020-03","Manzana",1,2020-01-20,"2020-01",35.4887797485099,191082,405098,"2020","Horas insuficientes","Precipitación baja",0,52500
"374","2020-04","Manzana",1,2020-01-27,"2020-01",35.2869805960039,164339,401263,"2020","Horas insuficientes","Precipitación baja",0,52500
"375","2020-05","Manzana",2,2020-02-03,"2020-02",36.3794725131284,242728,422218,"2020","Horas insuficientes","Precipitación baja",1,52500
"376","2020-06","Manzana",2,2020-02-10,"2020-02",37.0897122887627,207316,396617,"2020","Horas insuficientes","Precipitación baja",1,52500
"377","2020-07","Manzana",2,2020-02-17,"2020-02",39.3921422115359,227914,378979,"2020","Horas insuficientes","Precipitación baja",1,52500
"378","2020-08","Manzana",2,2020-02-24,"2020-02",38.1666666666667,164172,256218,"2020","Horas insuficientes","Precipitación baja",1,52500
"379","2020-09","Manzana",3,2020-03-02,"2020-03",38.7358937061971,170381,391680,"2020","Horas insuficientes","Precipitación baja",2,52500
"380","2020-10","Manzana",3,2020-03-09,"2020-03",38.75,211484,372158,"2020","Horas insuficientes","Precipitación baja",2,52500
"381","2020-11","Manzana",3,2020-03-16,"2020-03",38.4650887621538,186566,379902,"2020","Horas insuficientes","Precipitación baja",2,52500
"382","2020-12","Manzana",3,2020-03-23,"2020-03",39.7041029443568,161835,334544,"2020","Horas insuficientes","Precipitación baja",2,52500
"383","2020-13","Manzana",3,2020-03-30,"2020-03",39.6656678983566,178887,354310,"2020","Horas insuficientes","Precipitación baja",2,52500
"384","2020-14","Manzana",4,2020-04-06,"2020-04",44.722222222222,164637,286931,"2020","Horas insuficientes","Precipitación baja",3,52500
"385","2020-15","Manzana",4,2020-04-13,"2020-04",49.7219371085833,208981,391789,"2020","Horas insuficientes","Precipitación baja",3,52500
"386","2020-16","Manzana",4,2020-04-20,"2020-04",49.6933207916465,237519,373448,"2020","Horas insuficientes","Precipitación baja",3,52500
"387","2020-17","Manzana",4,2020-04-27,"2020-04",47.2098601661938,279083,375537,"2020","Horas insuficientes","Precipitación baja",3,52500
"388","2020-18","Manzana",5,2020-05-04,"2020-05",47.3393361065323,205058,391292,"2020","Horas insuficientes","Precipitación baja",4,52500
"389","2020-19","Manzana",5,2020-05-11,"2020-05",46.7516895803946,189988,356856,"2020","Horas insuficientes","Precipitación baja",4,52500
"390","2020-20","Manzana",5,2020-05-18,"2020-05",47.7777777777778,179538,307810,"2020","Horas insuficientes","Precipitación baja",4,52500
"391","2020-21","Manzana",5,2020-05-25,"2020-05",46.868133141639,162991,313583,"2020","Horas insuficientes","Precipitación baja",4,52500
"392","2020-22","Manzana",6,2020-06-01,"2020-06",49.9661620141871,149729,342010,"2020","Horas insuficientes","Precipitación baja",5,52500
"393","2020-23","Manzana",6,2020-06-08,"2020-06",50.1657299729813,195690,350823,"2020","Horas insuficientes","Precipitación baja",5,52500
"394","2020-24","Manzana",6,2020-06-15,"2020-06",55.8809523809525,154283,321115,"2020","Horas insuficientes","Precipitación baja",5,52500
"395","2020-25","Manzana",6,2020-06-22,"2020-06",55.8981181593009,132192,302080,"2020","Horas insuficientes","Precipitación baja",5,52500
"396","2020-26","Manzana",6,2020-06-29,"2020-06",55.9166666666667,175337,352555,"2020","Horas insuficientes","Precipitación baja",5,52500
"397","2020-27","Manzana",7,2020-07-06,"2020-07",55.8355803332848,205830,367832,"2020","Horas insuficientes","Precipitación baja",6,52500
"398","2020-28","Manzana",7,2020-07-13,"2020-07",55.75,218021,332981,"2020","Horas insuficientes","Precipitación baja",6,52500
"399","2020-29","Manzana",7,2020-07-20,"2020-07",55.75,147726,358259,"2020","Horas insuficientes","Precipitación baja",6,52500
"400","2020-30","Manzana",7,2020-07-27,"2020-07",55.9646220479575,198676,451072,"2020","Horas insuficientes","Precipitación baja",6,52500
"401","2020-31","Manzana",8,2020-08-03,"2020-08",56.377218384659,193265,369557,"2020","Horas insuficientes","Precipitación baja",7,52500
"402","2020-32","Manzana",8,2020-08-10,"2020-08",56.138888888889,183885,367933,"2020","Horas insuficientes","Precipitación baja",7,52500
"403","2020-33","Manzana",8,2020-08-17,"2020-08",56.3738691790345,210921,373784,"2020","Horas insuficientes","Precipitación baja",7,52500
"404","2020-34","Manzana",8,2020-08-24,"2020-08",56.6166666666667,195336,294519,"2020","Horas insuficientes","Precipitación baja",7,52500
"405","2020-35","Manzana",8,2020-08-31,"2020-08",56.6166666666667,128506,297508,"2020","Horas insuficientes","Precipitación baja",7,52500
"406","2020-36","Manzana",9,2020-09-07,"2020-09",56.2777777777777,217613,404202,"2020","Horas insuficientes","Precipitación baja",8,52500
"407","2020-37","Manzana",9,2020-09-14,"2020-09",56.4314107327406,221153,533431,"2020","Horas insuficientes","Precipitación baja",8,52500
"408","2020-38","Manzana",9,2020-09-21,"2020-09",57.0473940454264,211199,388247,"2020","Horas insuficientes","Precipitación baja",8,52500
"409","2020-39","Manzana",9,2020-09-28,"2020-09",57.825,209386,349081,"2020","Horas insuficientes","Precipitación baja",8,52500
"410","2020-40","Manzana",10,2020-10-05,"2020-10",58.5568319279174,246902,451461,"2020","Horas insuficientes","Precipitación baja",9,52500
"411","2020-41","Manzana",10,2020-10-12,"2020-10",58.888888888889,214649,388881,"2020","Horas insuficientes","Precipitación baja",9,52500
"412","2020-42","Manzana",10,2020-10-19,"2020-10",59.4444444444445,215264,381197,"2020","Horas insuficientes","Precipitación baja",9,52500
"413","2020-43","Manzana",10,2020-10-26,"2020-10",62.5833333333333,217371,446328,"2020","Horas insuficientes","Precipitación baja",9,52500
"414","2020-44","Manzana",11,2020-11-02,"2020-11",62.5833333333333,102188,404815,"2020","Horas insuficientes","Precipitación baja",10,52500
"415","2020-45","Manzana",11,2020-11-09,"2020-11",68.0891246484254,221306,389148,"2020","Horas insuficientes","Precipitación baja",10,52500
"416","2020-46","Manzana",11,2020-11-16,"2020-11",66.9930555555555,166412,357565,"2020","Horas insuficientes","Precipitación baja",10,52500
"417","2020-47","Manzana",11,2020-11-23,"2020-11",66.9930555555555,164036,360374,"2020","Horas insuficientes","Precipitación baja",10,52500
"418","2020-48","Manzana",11,2020-11-30,"2020-11",70.9205079334993,189933,387589,"2020","Horas insuficientes","Precipitación baja",10,52500
"419","2020-49","Manzana",12,2020-12-07,"2020-12",73.5685178055105,264269,492548,"2020","Horas insuficientes","Precipitación baja",11,52500
"420","2020-50","Manzana",12,2020-12-14,"2020-12",78.0625,131110,326852,"2020","Horas insuficientes","Precipitación baja",11,52500
"421","2020-51","Manzana",12,2020-12-21,"2020-12",76.6041666666667,110355,197313,"2020","Horas insuficientes","Precipitación baja",11,52500
"422","2020-52","Manzana",12,2020-12-28,"2020-12",76.9459215661673,158914,224482,"2020","Horas insuficientes","Precipitación baja",11,52500
"423","2021-01","Manzana",1,2021-01-04,"2021-01",78.4555822912626,99874,262287,"2021","Horas insuficientes","Precipitación baja",0,56000
"424","2021-02","Manzana",1,2021-01-11,"2021-01",80.2464193922811,150586,253247,"2021","Horas insuficientes","Precipitación baja",0,56000
"425","2021-03","Manzana",1,2021-01-18,"2021-01",81.0872351714465,123150,261358,"2021","Horas insuficientes","Precipitación baja",0,56000
"426","2021-04","Manzana",1,2021-01-25,"2021-01",78.0095341710342,155013,285528,"2021","Horas insuficientes","Precipitación baja",0,56000
"427","2021-05","Manzana",2,2021-02-01,"2021-02",76.3482609376471,171185,305754,"2021","Horas insuficientes","Precipitación baja",1,56000
"428","2021-06","Manzana",2,2021-02-08,"2021-02",67.6666939062872,180775,317232,"2021","Horas insuficientes","Precipitación baja",1,56000
"429","2021-07","Manzana",2,2021-02-15,"2021-02",59.5833333333333,101277,241917,"2021","Horas insuficientes","Precipitación baja",1,56000
"430","2021-08","Manzana",2,2021-02-22,"2021-02",55.8529501094734,62420,201927,"2021","Horas insuficientes","Precipitación baja",1,56000
"431","2021-09","Manzana",3,2021-03-01,"2021-03",47.0020383514089,150755,297627,"2021","Horas insuficientes","Precipitación baja",2,56000
"432","2021-10","Manzana",3,2021-03-08,"2021-03",43.5075914067341,203322,369026,"2021","Horas insuficientes","Precipitación baja",2,56000
"433","2021-11","Manzana",3,2021-03-15,"2021-03",36.4048338090075,164360,288961,"2021","Horas insuficientes","Precipitación baja",2,56000
"434","2021-12","Manzana",3,2021-03-22,"2021-03",32.7780676202484,150552,284833,"2021","Horas insuficientes","Precipitación baja",2,56000
"435","2021-13","Manzana",3,2021-03-29,"2021-03",26.8181818181817,117559,191780,"2021","Horas insuficientes","Precipitación baja",2,56000
"436","2021-14","Manzana",4,2021-04-05,"2021-04",26.7423128853009,211577,406709,"2021","Horas insuficientes","Precipitación baja",3,56000
"437","2021-15","Manzana",4,2021-04-12,"2021-04",27.4217441528862,161153,259484,"2021","Horas insuficientes","Precipitación baja",3,56000
"438","2021-16","Manzana",4,2021-04-19,"2021-04",27.5641025641027,126164,205469,"2021","Horas insuficientes","Precipitación baja",3,56000
"439","2021-17","Manzana",4,2021-04-26,"2021-04",27.3114328319078,81368,201247,"2021","Horas insuficientes","Precipitación baja",3,56000
"440","2021-18","Manzana",5,2021-05-03,"2021-05",28.1666666666667,124950,284150,"2021","Horas insuficientes","Precipitación baja",4,56000
"441","2021-19","Manzana",5,2021-05-10,"2021-05",28.1666666666667,119754,250970,"2021","Horas insuficientes","Precipitación baja",4,56000
"442","2021-20","Manzana",5,2021-05-17,"2021-05",27.6420635256877,141621,268447,"2021","Horas insuficientes","Precipitación baja",4,56000
"443","2021-21","Manzana",5,2021-05-24,"2021-05",27.392857142857,86250,270460,"2021","Horas insuficientes","Precipitación baja",4,56000
"444","2021-22","Manzana",5,2021-05-31,"2021-05",26.1789666822672,136340,297480,"2021","Horas insuficientes","Precipitación baja",4,56000
"445","2021-23","Manzana",6,2021-06-07,"2021-06",26.138888888889,196001,321675,"2021","Horas insuficientes","Precipitación baja",5,56000
"446","2021-24","Manzana",6,2021-06-14,"2021-06",25.9529643773264,115220,266410,"2021","Horas insuficientes","Precipitación baja",5,56000
"447","2021-25","Manzana",6,2021-06-21,"2021-06",25.638888888889,111606.4,238832.4,"2021","Horas insuficientes","Precipitación baja",5,56000
"448","2021-26","Manzana",6,2021-06-28,"2021-06",25.8784279498078,65880,160858,"2021","Horas insuficientes","Precipitación baja",5,56000
"449","2021-27","Manzana",7,2021-07-05,"2021-07",26.0795454545455,109600,274890,"2021","Horas insuficientes","Precipitación baja",6,56000
"450","2021-28","Manzana",7,2021-07-12,"2021-07",27.443181818182,47280,225430,"2021","Horas insuficientes","Precipitación baja",6,56000
"451","2021-29","Manzana",7,2021-07-19,"2021-07",26.882681197479,95200,240300,"2021","Horas insuficientes","Precipitación baja",6,56000
"452","2021-30","Manzana",7,2021-07-26,"2021-07",26.9375,110766,287234,"2021","Horas insuficientes","Precipitación baja",6,56000
"453","2021-31","Manzana",8,2021-08-02,"2021-08",26.9375,98800,246556,"2021","Horas insuficientes","Precipitación baja",7,56000
"454","2021-32","Manzana",8,2021-08-09,"2021-08",26.9375,129912,278812,"2021","Horas insuficientes","Precipitación baja",7,56000
"455","2021-33","Manzana",8,2021-08-16,"2021-08",26.9375,162820,326508,"2021","Horas insuficientes","Precipitación baja",7,56000
"456","2021-34","Manzana",8,2021-08-23,"2021-08",27.9516622811456,98810,244336,"2021","Horas insuficientes","Precipitación baja",7,56000
"457","2021-35","Manzana",8,2021-08-30,"2021-08",29.125,55160,65470,"2021","Horas insuficientes","Precipitación baja",7,56000
