<?xml version="1.0" encoding="UTF-8"?>
<svg xmlns="http://www.w3.org/2000/svg" xmlns:xlink="http://www.w3.org/1999/xlink" width="80pt" height="80pt" viewBox="0 0 80 80" version="1.1">
<g id="surface27418">
<path style=" stroke:none;fill-rule:nonzero;fill:rgb(94.509804%,73.72549%,9.803922%);fill-opacity:1;" d="M 62.398438 10.398438 C 61.957031 10.398438 61.601562 10.757812 61.601562 11.199219 C 61.601562 11.640625 61.957031 12 62.398438 12 C 62.84375 12 63.199219 11.640625 63.199219 11.199219 C 63.199219 10.757812 62.84375 10.398438 62.398438 10.398438 Z M 62.398438 10.398438 "/>
<path style=" stroke:none;fill-rule:nonzero;fill:rgb(97.647059%,85.882353%,82.352941%);fill-opacity:1;" d="M 40 9.601562 C 23.210938 9.601562 9.601562 23.210938 9.601562 40 C 9.601562 56.789062 23.210938 70.398438 40 70.398438 C 56.789062 70.398438 70.398438 56.789062 70.398438 40 C 70.398438 23.210938 56.789062 9.601562 40 9.601562 Z M 40 9.601562 "/>
<path style=" stroke:none;fill-rule:nonzero;fill:rgb(94.509804%,73.72549%,9.803922%);fill-opacity:1;" d="M 67.199219 9.601562 C 65.433594 9.601562 64 11.03125 64 12.800781 C 64 14.566406 65.433594 16 67.199219 16 C 68.96875 16 70.398438 14.566406 70.398438 12.800781 C 70.398438 11.03125 68.96875 9.601562 67.199219 9.601562 Z M 67.199219 9.601562 "/>
<path style=" stroke:none;fill-rule:nonzero;fill:rgb(93.333333%,24.313725%,32.941176%);fill-opacity:1;" d="M 11.199219 19.199219 C 10.316406 19.199219 9.601562 19.917969 9.601562 20.800781 C 9.601562 21.683594 10.316406 22.398438 11.199219 22.398438 C 12.082031 22.398438 12.800781 21.683594 12.800781 20.800781 C 12.800781 19.917969 12.082031 19.199219 11.199219 19.199219 Z M 11.199219 19.199219 "/>
<path style=" stroke:none;fill-rule:nonzero;fill:rgb(98.431373%,80.392157%,34.901961%);fill-opacity:1;" d="M 62.398438 60 C 61.515625 60 60.800781 60.714844 60.800781 61.601562 C 60.800781 62.484375 61.515625 63.199219 62.398438 63.199219 C 63.285156 63.199219 64 62.484375 64 61.601562 C 64 60.714844 63.285156 60 62.398438 60 Z M 13.601562 59.199219 C 11.832031 59.199219 10.398438 60.632812 10.398438 62.398438 C 10.398438 64.167969 11.832031 65.601562 13.601562 65.601562 C 15.367188 65.601562 16.800781 64.167969 16.800781 62.398438 C 16.800781 60.632812 15.367188 59.199219 13.601562 59.199219 Z M 13.601562 59.199219 "/>
<path style=" stroke:none;fill-rule:nonzero;fill:rgb(93.333333%,24.313725%,32.941176%);fill-opacity:1;" d="M 19.199219 64.800781 C 18.316406 64.800781 17.601562 65.515625 17.601562 66.398438 C 17.601562 67.285156 18.316406 68 19.199219 68 C 20.082031 68 20.800781 67.285156 20.800781 66.398438 C 20.800781 65.515625 20.082031 64.800781 19.199219 64.800781 Z M 19.199219 64.800781 "/>
<path style=" stroke:none;fill-rule:nonzero;fill:rgb(100%,100%,100%);fill-opacity:1;" d="M 53.1875 60.828125 C 52.089844 60.828125 51.199219 61.714844 51.199219 62.8125 C 51.199219 63.910156 52.089844 64.800781 53.1875 64.800781 C 54.285156 64.800781 55.171875 63.910156 55.171875 62.8125 C 55.171875 61.714844 54.285156 60.828125 53.1875 60.828125 Z M 12.800781 37.601562 C 12.359375 37.601562 12 37.957031 12 38.398438 C 12 38.84375 12.359375 39.199219 12.800781 39.199219 C 13.242188 39.199219 13.601562 38.84375 13.601562 38.398438 C 13.601562 37.957031 13.242188 37.601562 12.800781 37.601562 Z M 12.800781 37.601562 "/>
<path style=" stroke:none;fill-rule:nonzero;fill:rgb(94.509804%,73.72549%,9.803922%);fill-opacity:1;" d="M 68.800781 24 C 68.359375 24 68 24.359375 68 24.800781 C 68 25.242188 68.359375 25.601562 68.800781 25.601562 C 69.242188 25.601562 69.601562 25.242188 69.601562 24.800781 C 69.601562 24.359375 69.242188 24 68.800781 24 Z M 68.800781 24 "/>
<path style=" stroke:none;fill-rule:nonzero;fill:rgb(100%,100%,100%);fill-opacity:1;" d="M 64 51.199219 C 63.117188 51.199219 62.398438 51.917969 62.398438 52.800781 C 62.398438 53.683594 63.117188 54.398438 64 54.398438 C 64.882812 54.398438 65.601562 53.683594 65.601562 52.800781 C 65.601562 51.917969 64.882812 51.199219 64 51.199219 Z M 64 51.199219 "/>
<path style=" stroke:none;fill-rule:nonzero;fill:rgb(27.843137%,16.862745%,16.078431%);fill-opacity:1;" d="M 20.941406 34.898438 L 20.941406 53.199219 L 22.058594 53.199219 L 22.058594 34.898438 "/>
<path style=" stroke:none;fill-rule:nonzero;fill:rgb(59.215686%,68.235294%,78.039216%);fill-opacity:1;" d="M 16.183594 34.035156 L 40.832031 22.777344 L 65.484375 34.03125 L 40.832031 45.289062 Z M 16.183594 34.035156 "/>
<path style=" stroke:none;fill-rule:nonzero;fill:rgb(27.843137%,16.862745%,16.078431%);fill-opacity:1;" d="M 40.832031 23.390625 L 64.136719 34.03125 L 40.832031 44.671875 L 17.53125 34.035156 L 40.832031 23.390625 M 40.832031 22.160156 L 14.835938 34.035156 L 40.832031 45.90625 L 66.832031 34.03125 Z M 40.832031 22.160156 "/>
<path style=" stroke:none;fill-rule:nonzero;fill:rgb(69.019608%,75.686275%,83.137255%);fill-opacity:1;" d="M 26.960938 46.855469 L 26.960938 35.597656 L 27.011719 35.46875 C 27.625 33.964844 33.070312 32.34375 40.800781 32.34375 C 48.527344 32.34375 53.972656 33.964844 54.585938 35.46875 L 54.636719 35.597656 L 54.636719 46.855469 Z M 26.960938 46.855469 "/>
<path style=" stroke:none;fill-rule:nonzero;fill:rgb(27.843137%,16.862745%,16.078431%);fill-opacity:1;" d="M 40.800781 32.902344 C 48.882812 32.902344 53.664062 34.683594 54.070312 35.679688 L 54.078125 35.707031 L 54.078125 46.296875 L 27.519531 46.296875 L 27.519531 35.707031 L 27.53125 35.679688 C 27.9375 34.683594 32.71875 32.902344 40.800781 32.902344 M 40.800781 31.78125 C 33.386719 31.78125 27.289062 33.304688 26.492188 35.257812 L 26.398438 35.257812 L 26.398438 47.417969 L 55.199219 47.417969 L 55.199219 35.257812 L 55.105469 35.257812 C 54.308594 33.304688 48.210938 31.78125 40.800781 31.78125 Z M 40.800781 31.78125 "/>
<path style=" stroke:none;fill-rule:nonzero;fill:rgb(40%,47.45098%,56.078431%);fill-opacity:1;" d="M 40.800781 44.457031 C 33.15625 44.457031 26.960938 46.019531 26.960938 47.949219 C 26.960938 49.875 33.15625 51.441406 40.800781 51.441406 C 48.445312 51.441406 54.640625 49.875 54.640625 47.949219 C 54.640625 46.019531 48.445312 44.457031 40.800781 44.457031 Z M 40.800781 44.457031 "/>
<path style=" stroke:none;fill-rule:nonzero;fill:rgb(27.843137%,16.862745%,16.078431%);fill-opacity:1;" d="M 40.800781 45.015625 C 49.425781 45.015625 54.078125 47.097656 54.078125 47.949219 C 54.078125 48.796875 49.425781 50.878906 40.800781 50.878906 C 32.171875 50.878906 27.519531 48.800781 27.519531 47.949219 C 27.519531 47.097656 32.171875 45.015625 40.800781 45.015625 M 40.800781 43.898438 C 32.847656 43.898438 26.398438 45.710938 26.398438 47.949219 C 26.398438 50.183594 32.847656 52 40.800781 52 C 48.753906 52 55.199219 50.1875 55.199219 47.949219 C 55.199219 45.710938 48.753906 43.898438 40.800781 43.898438 Z M 40.800781 43.898438 "/>
<path style=" stroke:none;fill-rule:nonzero;fill:rgb(92.54902%,67.843137%,43.529412%);fill-opacity:1;" d="M 19.570312 54.675781 L 19.238281 53.953125 C 19.054688 53.578125 18.960938 53.1875 18.960938 52.800781 C 18.960938 51.34375 20.144531 50.160156 21.601562 50.160156 C 23.054688 50.160156 24.238281 51.34375 24.238281 52.800781 C 24.238281 53.339844 24.074219 53.859375 23.765625 54.304688 L 23.738281 54.339844 L 21.570312 58.734375 Z M 19.570312 54.675781 "/>
<path style=" stroke:none;fill-rule:nonzero;fill:rgb(27.843137%,16.862745%,16.078431%);fill-opacity:1;" d="M 21.601562 50.71875 C 22.746094 50.71875 23.679688 51.652344 23.679688 52.800781 C 23.679688 53.222656 23.550781 53.632812 23.304688 53.984375 L 23.257812 54.054688 L 23.21875 54.128906 L 21.570312 57.46875 L 20.511719 55.320312 L 20.53125 55.320312 L 19.742188 53.707031 C 19.59375 53.40625 19.519531 53.101562 19.519531 52.800781 C 19.519531 51.652344 20.453125 50.71875 21.601562 50.71875 M 21.601562 49.601562 C 19.832031 49.601562 18.398438 51.03125 18.398438 52.800781 C 18.398438 53.304688 18.527344 53.777344 18.734375 54.199219 L 18.710938 54.199219 L 21.570312 60 L 24.222656 54.625 C 24.585938 54.109375 24.800781 53.480469 24.800781 52.800781 C 24.800781 51.03125 23.367188 49.601562 21.601562 49.601562 Z M 47.933594 42.859375 C 49.425781 43.140625 50.878906 43.515625 52.273438 43.980469 C 52.484375 44.046875 52.710938 43.9375 52.78125 43.726562 C 52.847656 43.515625 52.738281 43.289062 52.527344 43.21875 C 51.097656 42.742188 49.609375 42.359375 48.082031 42.070312 C 47.863281 42.03125 47.65625 42.171875 47.613281 42.390625 C 47.574219 42.605469 47.714844 42.816406 47.933594 42.859375 Z M 43.511719 42.292969 C 44.308594 42.347656 45.097656 42.425781 45.886719 42.53125 C 46.105469 42.558594 46.304688 42.40625 46.332031 42.1875 C 46.363281 41.96875 46.207031 41.765625 45.988281 41.738281 C 45.1875 41.632812 44.378906 41.550781 43.566406 41.496094 C 43.34375 41.480469 43.15625 41.644531 43.140625 41.867188 C 43.125 42.085938 43.289062 42.277344 43.511719 42.292969 Z M 29.328125 43.980469 C 32.882812 42.796875 36.84375 42.199219 40.808594 42.199219 C 40.992188 42.199219 41.175781 42.199219 41.363281 42.203125 C 41.582031 42.207031 41.765625 42.03125 41.765625 41.808594 C 41.769531 41.589844 41.59375 41.40625 41.375 41.402344 C 41.183594 41.402344 40.996094 41.398438 40.808594 41.398438 C 36.765625 41.398438 32.722656 42.003906 29.074219 43.222656 C 28.863281 43.289062 28.75 43.515625 28.820312 43.726562 C 28.890625 43.9375 29.117188 44.050781 29.328125 43.980469 Z M 29.328125 43.980469 "/>
</g>
</svg>
