<?xml version="1.0" encoding="utf-8"?>
<!-- Generator: Adobe Illustrator 24.0.1, SVG Export Plug-In . SVG Version: 6.00 Build 0)  -->
<svg version="1.1" id="Livello_1" xmlns="http://www.w3.org/2000/svg" xmlns:xlink="http://www.w3.org/1999/xlink" x="0px" y="0px"
	 viewBox="0 0 18 24" style="enable-background:new 0 0 18 24;" xml:space="preserve">
<style type="text/css">
	.st0{fill:#035EE8;}
</style>
<path class="st0" d="M9,0C4.3,0,0.5,3.8,0.5,8.5C0.5,15.1,6.8,24,9,24c2,0,8.5-8.9,8.5-15.5C17.5,3.8,13.7,0,9,0z M8.9,14
	c-3,0-5.4-2.4-5.4-5.4s2.4-5.4,5.4-5.4s5.4,2.4,5.4,5.4S11.8,14,8.9,14z"/>
</svg>
