<?xml version="1.0" encoding="utf-8"?>
<!-- Generator: Adobe Illustrator 24.0.1, SVG Export Plug-In . SVG Version: 6.00 Build 0)  -->
<svg version="1.1" id="Livello_1" xmlns="http://www.w3.org/2000/svg" xmlns:xlink="http://www.w3.org/1999/xlink" x="0px" y="0px"
	 viewBox="0 0 1920 1080" style="enable-background:new 0 0 1920 1080;" xml:space="preserve">
<style type="text/css">
	.st0{opacity:0.1;}
	.st1{fill:#035EE8;}
	.st2{fill:#25B7B7;}
	.st3{fill:#008AE4;}
	.st4{fill:#73F9F9;}
	.st5{fill:#2DE2E6;}
	.st6{fill:#009FDD;}
	.st7{fill:#00CDEA;}
	.st8{fill:#00C4F1;}
	.st9{fill:#006BD8;}
	.st10{fill:#1769E2;}
	.st11{fill:#00C2E5;}
	.st12{fill:#00A6F0;}
	.st13{fill:#00A4F0;}
</style>
<g class="st0">
	<polygon class="st1" points="1010.5,637.4 909.3,696.4 909.3,578.4 	"/>
	<polygon class="st2" points="808.2,755.4 707,814.4 707,696.4 	"/>
	<polygon class="st3" points="909.3,696.4 808.2,755.4 808.2,637.4 	"/>
	<polygon class="st3" points="808.2,637.4 707,696.4 707,578.4 	"/>
	<polygon class="st4" points="707,696.4 808.2,755.4 808.2,637.4 	"/>
	<polygon class="st5" points="808.2,755.4 909.3,814.4 909.3,696.4 	"/>
	<polygon class="st6" points="808.2,519.5 707,578.4 707,460.5 	"/>
	<polygon class="st6" points="808.2,283.5 707,342.5 707,224.5 	"/>
	<polygon class="st7" points="808.2,165.5 707,224.5 707,106.5 	"/>
	<polygon class="st7" points="808.2,401.5 707,460.5 707,342.5 	"/>
	<polygon class="st3" points="808.2,47.6 707,106.5 707,-11.4 	"/>
	<polygon class="st8" points="707,460.5 808.2,519.5 808.2,401.5 	"/>
	<polygon class="st8" points="707,224.5 808.2,283.5 808.2,165.5 	"/>
	<polygon class="st5" points="707,342.5 808.2,401.5 808.2,283.5 	"/>
	<polygon class="st5" points="707,106.5 808.2,165.5 808.2,47.6 	"/>
	<polygon class="st9" points="707,-11.4 808.2,47.6 808.2,-70.4 	"/>
	<polygon class="st10" points="909.3,696.4 1010.5,755.4 1010.5,637.4 	"/>
	<polygon class="st2" points="706.9,814.4 605.7,873.4 605.7,755.4 	"/>
	<polygon class="st2" points="706.9,106.5 605.7,165.5 605.7,47.6 	"/>
	<polygon class="st3" points="706.9,696.4 605.7,755.4 605.7,637.4 	"/>
	<polygon class="st4" points="605.7,755.4 706.9,814.4 706.9,696.4 	"/>
	<polygon class="st6" points="706.9,578.4 605.7,637.4 605.7,519.5 	"/>
	<polygon class="st6" points="706.9,342.5 605.7,401.5 605.7,283.5 	"/>
	<polygon class="st4" points="706.9,224.5 605.7,283.5 605.7,165.5 	"/>
	<polygon class="st7" points="706.9,460.5 605.7,519.5 605.7,401.5 	"/>
	<polygon class="st3" points="706.9,-11.4 605.7,47.6 605.7,-70.4 	"/>
	<polygon class="st8" points="605.7,519.5 706.9,578.4 706.9,460.5 	"/>
	<polygon class="st8" points="605.7,637.4 706.9,696.4 706.9,578.4 	"/>
	<polygon class="st8" points="605.7,283.5 706.9,342.5 706.9,224.5 	"/>
	<polygon class="st5" points="605.7,401.5 706.9,460.5 706.9,342.5 	"/>
	<polygon class="st5" points="605.7,165.5 706.9,224.5 706.9,106.5 	"/>
	<polygon class="st10" points="605.7,47.6 706.9,106.5 706.9,-11.4 	"/>
	<polygon class="st5" points="1819.9,165.5 1718.7,224.5 1718.7,106.5 	"/>
	<polygon class="st5" points="1516.4,342.5 1415.2,401.5 1415.2,283.5 	"/>
	<polygon class="st5" points="1516.4,460.5 1415.2,519.5 1415.2,401.5 	"/>
	<polygon class="st6" points="1921.1,106.5 1819.9,165.5 1819.9,47.6 	"/>
	<polygon class="st6" points="1921.1,-11.4 1819.9,47.6 1819.9,-70.4 	"/>
	<polygon class="st6" points="1617.6,519.5 1516.4,578.4 1516.4,460.5 	"/>
	<polygon class="st6" points="1718.7,224.5 1617.6,283.5 1617.6,165.5 	"/>
	<polygon class="st6" points="1617.6,283.5 1516.4,342.5 1516.4,224.5 	"/>
	<polygon class="st6" points="1819.9,47.6 1718.7,106.5 1718.7,-11.4 	"/>
	<polygon class="st1" points="1718.7,-11.4 1617.6,47.6 1617.6,-70.4 	"/>
	<polygon class="st1" points="1516.4,224.5 1415.2,283.5 1415.2,165.5 	"/>
	<polygon class="st7" points="1921.1,224.5 1819.9,283.5 1819.9,165.5 	"/>
	<polygon class="st7" points="1617.6,165.5 1516.4,224.5 1516.4,106.5 	"/>
	<polygon class="st7" points="1617.6,401.5 1516.4,460.5 1516.4,342.5 	"/>
	<polygon class="st2" points="1718.7,342.5 1617.6,401.5 1617.6,283.5 	"/>
	<polygon class="st2" points="1516.4,106.5 1415.2,165.5 1415.2,47.6 	"/>
	<polygon class="st2" points="1718.7,106.5 1617.6,165.5 1617.6,47.6 	"/>
	<polygon class="st8" points="1819.9,283.5 1718.7,342.5 1718.7,224.5 	"/>
	<polygon class="st3" points="1617.6,47.6 1516.4,106.5 1516.4,-11.4 	"/>
	<polygon class="st3" points="1516.4,-11.1 1415.2,47.9 1415.2,-70 	"/>
	<polygon class="st5" points="1718.7,106.5 1819.9,165.5 1819.9,47.6 	"/>
	<polygon class="st11" points="1718.7,342.5 1819.9,401.5 1819.9,283.5 	"/>
	<polygon class="st11" points="1617.6,165.5 1718.7,224.5 1718.7,106.5 	"/>
	<polygon class="st4" points="1415.2,47.9 1516.4,106.9 1516.4,-11.1 	"/>
	<polygon class="st4" points="1718.7,224.5 1819.9,283.5 1819.9,165.5 	"/>
	<polygon class="st4" points="1415.2,401.5 1516.4,460.5 1516.4,342.5 	"/>
	<polygon class="st8" points="1516.4,224.5 1617.6,283.5 1617.6,165.5 	"/>
	<polygon class="st4" points="1516.4,342.5 1617.6,401.5 1617.6,283.5 	"/>
	<polygon class="st5" points="1516.4,106.5 1617.6,165.5 1617.6,47.6 	"/>
	<polygon class="st3" points="1415.2,283.5 1516.4,342.5 1516.4,224.5 	"/>
	<polygon class="st3" points="1415.2,519.5 1516.4,578.4 1516.4,460.5 	"/>
	<polygon class="st10" points="1718.7,-11.4 1819.9,47.6 1819.9,-70.4 	"/>
	<polygon class="st10" points="1819.9,47.6 1921.1,106.5 1921.1,-11.4 	"/>
	<polygon class="st10" points="1516.4,-11.4 1617.6,47.6 1617.6,-70.4 	"/>
	<polygon class="st10" points="1617.6,47.6 1718.7,106.5 1718.7,-11.4 	"/>
	<polygon class="st10" points="1415.2,165.5 1516.4,224.5 1516.4,106.5 	"/>
	<polygon class="st5" points="1212.9,165.5 1111.7,224.5 1111.7,106.5 	"/>
	<polygon class="st5" points="1212.9,401.5 1111.7,460.5 1111.7,342.5 	"/>
	<polygon class="st5" points="909.3,342.5 808.2,401.5 808.2,283.5 	"/>
	<polygon class="st5" points="909.3,460.5 808.2,519.5 808.2,401.5 	"/>
	<polygon class="st5" points="1111.7,460.5 1010.5,519.5 1010.5,401.5 	"/>
	<polygon class="st6" points="1314,106.5 1212.9,165.5 1212.9,47.6 	"/>
	<polygon class="st6" points="1314,-11.4 1212.9,47.6 1212.9,-70.4 	"/>
	<polygon class="st6" points="1314,342.5 1212.9,401.5 1212.9,283.5 	"/>
	<polygon class="st6" points="1010.5,519.5 909.3,578.4 909.3,460.5 	"/>
	<polygon class="st6" points="1314,578.4 1212.9,637.4 1212.9,519.5 	"/>
	<polygon class="st6" points="1212.9,519.5 1111.7,578.4 1111.7,460.5 	"/>
	<polygon class="st6" points="1111.7,224.5 1010.5,283.5 1010.5,165.5 	"/>
	<polygon class="st6" points="1010.5,283.5 909.3,342.5 909.3,224.5 	"/>
	<polygon class="st6" points="1212.9,47.6 1111.7,106.5 1111.7,-11.4 	"/>
	<polygon class="st1" points="1415.2,47.6 1314,106.5 1314,-11.4 	"/>
	<polygon class="st10" points="1111.7,-11.4 1010.5,47.6 1010.5,-70.4 	"/>
	<polygon class="st1" points="1415.2,519.5 1314,578.4 1314,460.5 	"/>
	<polygon class="st7" points="1314,224.5 1212.9,283.5 1212.9,165.5 	"/>
	<polygon class="st7" points="1010.5,165.5 909.3,224.5 909.3,106.5 	"/>
	<polygon class="st7" points="1010.5,401.5 909.3,460.5 909.3,342.5 	"/>
	<polygon class="st2" points="1415.2,283.5 1314,342.5 1314,224.5 	"/>
	<polygon class="st2" points="1111.7,342.5 1010.5,401.5 1010.5,283.5 	"/>
	<polygon class="st2" points="909.3,106.5 808.2,165.5 808.2,47.6 	"/>
	<polygon class="st2" points="1111.7,106.5 1010.5,165.5 1010.5,47.6 	"/>
	<polygon class="st2" points="1111.7,578.4 1010.5,637.4 1010.5,519.5 	"/>
	<polygon class="st2" points="909.3,578.4 808.2,637.4 808.2,519.5 	"/>
	<polygon class="st8" points="1212.9,283.5 1111.7,342.5 1111.7,224.5 	"/>
	<polygon class="st2" points="1415.2,401.5 1314,460.5 1314,342.5 	"/>
	<polygon class="st3" points="1415.2,165.5 1314,224.5 1314,106.5 	"/>
	<polygon class="st3" points="1010.5,47.6 909.3,106.5 909.3,-11.4 	"/>
	<polygon class="st3" points="909.3,-11.1 808.2,47.9 808.2,-70 	"/>
	<polygon class="st3" points="1314,460.5 1212.9,519.5 1212.9,401.5 	"/>
	<polygon class="st11" points="1111.7,106.5 1212.9,165.5 1212.9,47.6 	"/>
	<polygon class="st11" points="1111.7,578.4 1212.9,637.4 1212.9,519.5 	"/>
	<polygon class="st11" points="1111.7,342.5 1212.9,401.5 1212.9,283.5 	"/>
	<polygon class="st11" points="1212.9,401.5 1314,460.5 1314,342.5 	"/>
	<polygon class="st11" points="1212.9,165.5 1314,224.5 1314,106.5 	"/>
	<polygon class="st11" points="1010.5,165.5 1111.7,224.5 1111.7,106.5 	"/>
	<polygon class="st11" points="1010.5,519.5 1111.7,578.4 1111.7,460.5 	"/>
	<polygon class="st11" points="808.2,47.9 909.3,106.9 909.3,-11.1 	"/>
	<polygon class="st4" points="1111.7,224.5 1212.9,283.5 1212.9,165.5 	"/>
	<polygon class="st4" points="1010.5,401.5 1111.7,460.5 1111.7,342.5 	"/>
	<polygon class="st4" points="808.2,401.5 909.3,460.5 909.3,342.5 	"/>
	<polygon class="st8" points="1212.9,283.5 1314,342.5 1314,224.5 	"/>
	<polygon class="st8" points="909.3,460.5 1010.5,519.5 1010.5,401.5 	"/>
	<polygon class="st8" points="909.3,578.4 1010.5,637.4 1010.5,519.5 	"/>
	<polygon class="st8" points="909.3,224.5 1010.5,283.5 1010.5,165.5 	"/>
	<polygon class="st5" points="1010.5,283.5 1111.7,342.5 1111.7,224.5 	"/>
	<polygon class="st5" points="909.3,342.5 1010.5,401.5 1010.5,283.5 	"/>
	<polygon class="st5" points="909.3,106.5 1010.5,165.5 1010.5,47.6 	"/>
	<polygon class="st12" points="1314,342.5 1415.2,401.5 1415.2,283.5 	"/>
	<polygon class="st3" points="1314,460.5 1415.2,519.5 1415.2,401.5 	"/>
	<polygon class="st3" points="808.2,283.5 909.3,342.5 909.3,224.5 	"/>
	<polygon class="st10" points="808.2,519.5 909.3,578.4 909.3,460.5 	"/>
	<polygon class="st10" points="1314,106.5 1415.2,165.5 1415.2,47.6 	"/>
	<polygon class="st9" points="1111.7,-11.4 1212.9,47.6 1212.9,-70.4 	"/>
	<polygon class="st10" points="1212.9,47.6 1314,106.5 1314,-11.4 	"/>
	<polygon class="st10" points="909.3,-11.4 1010.5,47.6 1010.5,-70.4 	"/>
	<polygon class="st1" points="1010.5,47.6 1111.7,106.5 1111.7,-11.4 	"/>
	<polygon class="st10" points="1212.9,519.5 1314,578.4 1314,460.5 	"/>
	<polygon class="st1" points="808.2,165.5 909.3,224.5 909.3,106.5 	"/>
	<polygon class="st9" points="1314,-11.1 1415.2,47.9 1415.2,-70 	"/>
	<polygon class="st10" points="1314,578.4 1415.2,637.4 1415.2,519.5 	"/>
	<polygon class="st13" points="1314,224.5 1415.2,283.5 1415.2,165.5 	"/>
	<polygon class="st5" points="403.4,815 302.2,874 302.2,756.1 	"/>
	<polygon class="st6" points="504.6,756.1 403.4,815 403.4,697.1 	"/>
	<polygon class="st6" points="504.6,638.1 403.4,697.1 403.4,579.1 	"/>
	<polygon class="st6" points="504.6,992 403.4,1051 403.4,933 	"/>
	<polygon class="st6" points="302.2,874 201,933 201,815 	"/>
	<polygon class="st6" points="201,933 99.9,992 99.9,874 	"/>
	<polygon class="st6" points="403.4,697.1 302.2,756.1 302.2,638.1 	"/>
	<polygon class="st1" points="605.7,697.1 504.6,756.1 504.6,638.1 	"/>
	<polygon class="st1" points="302.2,638.1 201,697.1 201,579.1 	"/>
	<polygon class="st7" points="504.6,874 403.4,933 403.4,815 	"/>
	<polygon class="st4" points="201,815 99.9,874 99.9,756.1 	"/>
	<polygon class="st2" points="302.2,756.1 201,815 201,697.1 	"/>
	<polygon class="st8" points="403.4,933 302.2,992 302.2,874 	"/>
	<polygon class="st3" points="605.7,815 504.6,874 504.6,756.1 	"/>
	<polygon class="st3" points="201,697.1 99.9,756.1 99.9,638.1 	"/>
	<polygon class="st3" points="99.9,638.1 -1.3,697.1 -1.3,579.1 	"/>
	<polygon class="st4" points="-1.3,697.1 99.9,756.1 99.9,638.1 	"/>
	<polygon class="st5" points="302.2,874 403.4,933 403.4,815 	"/>
	<polygon class="st8" points="403.4,933 504.6,992 504.6,874 	"/>
	<polygon class="st5" points="201,933 302.2,992 302.2,874 	"/>
	<polygon class="st5" points="99.9,756.1 201,815 201,697.1 	"/>
	<polygon class="st10" points="504.6,756.1 605.7,815 605.7,697.1 	"/>
	<polygon class="st10" points="302.2,638.1 403.4,697.1 403.4,579.1 	"/>
	<polygon class="st10" points="403.4,697.1 504.6,756.1 504.6,638.1 	"/>
	<polygon class="st10" points="99.9,638.1 201,697.1 201,579.1 	"/>
	<polygon class="st9" points="201,697.1 302.2,756.1 302.2,638.1 	"/>
	<polygon class="st1" points="-1.3,815 99.9,874 99.9,756.1 	"/>
	<polygon class="st13" points="504.6,874 605.7,933 605.7,815 	"/>
	<polygon class="st5" points="504.6,166.2 403.4,225.2 403.4,107.2 	"/>
	<polygon class="st5" points="201,343.1 99.9,402.1 99.9,284.2 	"/>
	<polygon class="st5" points="201,461.1 99.9,520.1 99.9,402.1 	"/>
	<polygon class="st5" points="403.4,461.1 302.2,520.1 302.2,402.1 	"/>
	<polygon class="st6" points="605.7,107.2 504.6,166.2 504.6,48.2 	"/>
	<polygon class="st6" points="605.7,-10.8 504.6,48.2 504.6,-69.8 	"/>
	<polygon class="st6" points="605.7,343.1 504.6,402.1 504.6,284.2 	"/>
	<polygon class="st6" points="302.2,520.1 201,579.1 201,461.1 	"/>
	<polygon class="st6" points="605.7,579.1 504.6,638.1 504.6,520.1 	"/>
	<polygon class="st6" points="504.6,520.1 403.4,579.1 403.4,461.1 	"/>
	<polygon class="st6" points="302.2,284.2 201,343.1 201,225.2 	"/>
	<polygon class="st6" points="504.6,48.2 403.4,107.2 403.4,-10.8 	"/>
	<polygon class="st10" points="403.4,-10.8 302.2,48.2 302.2,-69.8 	"/>
	<polygon class="st10" points="201,225.2 99.9,284.2 99.9,166.2 	"/>
	<polygon class="st7" points="605.7,225.2 504.6,284.2 504.6,166.2 	"/>
	<polygon class="st7" points="302.2,166.2 201,225.2 201,107.2 	"/>
	<polygon class="st7" points="302.2,402.1 201,461.1 201,343.1 	"/>
	<polygon class="st2" points="403.4,343.1 302.2,402.1 302.2,284.2 	"/>
	<polygon class="st2" points="201,107.2 99.9,166.2 99.9,48.2 	"/>
	<polygon class="st2" points="403.4,107.2 302.2,166.2 302.2,48.2 	"/>
	<polygon class="st2" points="403.4,579.1 302.2,638.1 302.2,520.1 	"/>
	<polygon class="st8" points="504.6,284.2 403.4,343.1 403.4,225.2 	"/>
	<polygon class="st3" points="302.2,48.2 201,107.2 201,-10.8 	"/>
	<polygon class="st3" points="201,-10.4 99.9,48.6 99.9,-69.4 	"/>
	<polygon class="st3" points="605.7,461.1 504.6,520.1 504.6,402.1 	"/>
	<polygon class="st11" points="403.4,107.2 504.6,166.2 504.6,48.2 	"/>
	<polygon class="st11" points="403.4,579.1 504.6,638.1 504.6,520.1 	"/>
	<polygon class="st11" points="403.4,343.1 504.6,402.1 504.6,284.2 	"/>
	<polygon class="st4" points="403.4,461.1 504.6,520.1 504.6,402.1 	"/>
	<polygon class="st11" points="504.6,402.1 605.7,461.1 605.7,343.1 	"/>
	<polygon class="st11" points="504.6,166.2 605.7,225.2 605.7,107.2 	"/>
	<polygon class="st11" points="302.2,166.2 403.4,225.2 403.4,107.2 	"/>
	<polygon class="st11" points="302.2,520.1 403.4,579.1 403.4,461.1 	"/>
	<polygon class="st4" points="99.9,48.6 201,107.6 201,-10.4 	"/>
	<polygon class="st4" points="403.4,225.2 504.6,284.2 504.6,166.2 	"/>
	<polygon class="st5" points="302.2,402.1 403.4,461.1 403.4,343.1 	"/>
	<polygon class="st4" points="99.9,402.1 201,461.1 201,343.1 	"/>
	<polygon class="st8" points="504.6,284.2 605.7,343.1 605.7,225.2 	"/>
	<polygon class="st8" points="201,461.1 302.2,520.1 302.2,402.1 	"/>
	<polygon class="st8" points="201,579.1 302.2,638.1 302.2,520.1 	"/>
	<polygon class="st8" points="201,225.2 302.2,284.2 302.2,166.2 	"/>
	<polygon class="st4" points="302.2,284.2 403.4,343.1 403.4,225.2 	"/>
	<polygon class="st5" points="201,107.2 302.2,166.2 302.2,48.2 	"/>
	<polygon class="st3" points="99.9,284.2 201,343.1 201,225.2 	"/>
	<polygon class="st3" points="99.9,520.1 201,579.1 201,461.1 	"/>
	<polygon class="st10" points="403.4,-10.8 504.6,48.2 504.6,-69.8 	"/>
	<polygon class="st9" points="504.6,48.2 605.7,107.2 605.7,-10.8 	"/>
	<polygon class="st9" points="201,-10.8 302.2,48.2 302.2,-69.8 	"/>
	<polygon class="st1" points="302.2,48.2 403.4,107.2 403.4,-10.8 	"/>
	<polygon class="st10" points="504.6,520.1 605.7,579.1 605.7,461.1 	"/>
	<polygon class="st1" points="99.9,166.2 201,225.2 201,107.2 	"/>
	<polygon class="st1" points="99.9,48.2 -1.3,107.2 -1.3,-10.8 	"/>
	<polygon class="st1" points="99.9,520.1 -1.3,579.1 -1.3,461.1 	"/>
	<polygon class="st2" points="99.9,284.2 -1.3,343.1 -1.3,225.2 	"/>
	<polygon class="st2" points="99.9,402.1 -1.3,461.1 -1.3,343.1 	"/>
	<polygon class="st3" points="99.9,166.2 -1.3,225.2 -1.3,107.2 	"/>
	<polygon class="st12" points="-1.3,343.1 99.9,402.1 99.9,284.2 	"/>
	<polygon class="st3" points="-1.3,461.1 99.9,520.1 99.9,402.1 	"/>
	<polygon class="st9" points="-1.3,107.2 99.9,166.2 99.9,48.2 	"/>
	<polygon class="st9" points="-1.3,-10.4 99.9,48.6 99.9,-69.4 	"/>
	<polygon class="st10" points="-1.3,579.1 99.9,638.1 99.9,520.1 	"/>
	<polygon class="st13" points="-1.3,225.2 99.9,284.2 99.9,166.2 	"/>
</g>
</svg>
