{
  "ABIRoot": {
    "kind": "Root",
    "name": "TopLevel",
    "printedName": "TopLevel",
    "children": [
      {
        "kind": "Import",
        "name": "UIKit",
        "printedName": "UIKit",
        "declKind": "Import",
        "moduleName": "MXAutoLayout",
        "declAttributes": [
          "RawDocComment"
        ]
      },
      {
        "kind": "TypeDecl",
        "name": "MXAutoLayoutAttribute",
        "printedName": "MXAutoLayoutAttribute",
        "children": [
          {
            "kind": "Var",
            "name": "fillSuperview",
            "printedName": "fillSuperview",
            "children": [
              {
                "kind": "TypeFunc",
                "name": "Function",
                "printedName": "(MXAutoLayout.MXAutoLayoutAttribute.Type) -> MXAutoLayout.MXAutoLayoutAttribute",
                "children": [
                  {
                    "kind": "TypeNominal",
                    "name": "MXAutoLayoutAttribute",
                    "printedName": "MXAutoLayout.MXAutoLayoutAttribute",
                    "usr": "s:12MXAutoLayout0aB9AttributeO"
                  },
                  {
                    "kind": "TypeNominal",
                    "name": "Metatype",
                    "printedName": "MXAutoLayout.MXAutoLayoutAttribute.Type",
                    "children": [
                      {
                        "kind": "TypeNominal",
                        "name": "MXAutoLayoutAttribute",
                        "printedName": "MXAutoLayout.MXAutoLayoutAttribute",
                        "usr": "s:12MXAutoLayout0aB9AttributeO"
                      }
                    ]
                  }
                ]
              }
            ],
            "declKind": "EnumElement",
            "usr": "s:12MXAutoLayout0aB9AttributeO13fillSuperviewyA2CmF",
            "mangledName": "$s12MXAutoLayout0aB9AttributeO13fillSuperviewyA2CmF",
            "moduleName": "MXAutoLayout"
          },
          {
            "kind": "Var",
            "name": "fillSafeArea",
            "printedName": "fillSafeArea",
            "children": [
              {
                "kind": "TypeFunc",
                "name": "Function",
                "printedName": "(MXAutoLayout.MXAutoLayoutAttribute.Type) -> MXAutoLayout.MXAutoLayoutAttribute",
                "children": [
                  {
                    "kind": "TypeNominal",
                    "name": "MXAutoLayoutAttribute",
                    "printedName": "MXAutoLayout.MXAutoLayoutAttribute",
                    "usr": "s:12MXAutoLayout0aB9AttributeO"
                  },
                  {
                    "kind": "TypeNominal",
                    "name": "Metatype",
                    "printedName": "MXAutoLayout.MXAutoLayoutAttribute.Type",
                    "children": [
                      {
                        "kind": "TypeNominal",
                        "name": "MXAutoLayoutAttribute",
                        "printedName": "MXAutoLayout.MXAutoLayoutAttribute",
                        "usr": "s:12MXAutoLayout0aB9AttributeO"
                      }
                    ]
                  }
                ]
              }
            ],
            "declKind": "EnumElement",
            "usr": "s:12MXAutoLayout0aB9AttributeO12fillSafeAreayA2CmF",
            "mangledName": "$s12MXAutoLayout0aB9AttributeO12fillSafeAreayA2CmF",
            "moduleName": "MXAutoLayout"
          },
          {
            "kind": "Function",
            "name": "==",
            "printedName": "==(_:_:)",
            "children": [
              {
                "kind": "TypeNominal",
                "name": "Bool",
                "printedName": "Swift.Bool",
                "usr": "s:Sb"
              },
              {
                "kind": "TypeNominal",
                "name": "MXAutoLayoutAttribute",
                "printedName": "MXAutoLayout.MXAutoLayoutAttribute",
                "usr": "s:12MXAutoLayout0aB9AttributeO"
              },
              {
                "kind": "TypeNominal",
                "name": "MXAutoLayoutAttribute",
                "printedName": "MXAutoLayout.MXAutoLayoutAttribute",
                "usr": "s:12MXAutoLayout0aB9AttributeO"
              }
            ],
            "declKind": "Func",
            "usr": "s:12MXAutoLayout0aB9AttributeO2eeoiySbAC_ACtFZ",
            "mangledName": "$s12MXAutoLayout0aB9AttributeO2eeoiySbAC_ACtFZ",
            "moduleName": "MXAutoLayout",
            "static": true,
            "implicit": true,
            "funcSelfKind": "NonMutating"
          },
          {
            "kind": "Var",
            "name": "hashValue",
            "printedName": "hashValue",
            "children": [
              {
                "kind": "TypeNominal",
                "name": "Int",
                "printedName": "Swift.Int",
                "usr": "s:Si"
              }
            ],
            "declKind": "Var",
            "usr": "s:12MXAutoLayout0aB9AttributeO9hashValueSivp",
            "mangledName": "$s12MXAutoLayout0aB9AttributeO9hashValueSivp",
            "moduleName": "MXAutoLayout",
            "implicit": true,
            "accessors": [
              {
                "kind": "Accessor",
                "name": "Get",
                "printedName": "Get()",
                "children": [
                  {
                    "kind": "TypeNominal",
                    "name": "Int",
                    "printedName": "Swift.Int",
                    "usr": "s:Si"
                  }
                ],
                "declKind": "Accessor",
                "usr": "s:12MXAutoLayout0aB9AttributeO9hashValueSivg",
                "mangledName": "$s12MXAutoLayout0aB9AttributeO9hashValueSivg",
                "moduleName": "MXAutoLayout",
                "implicit": true,
                "accessorKind": "get"
              }
            ]
          },
          {
            "kind": "Function",
            "name": "hash",
            "printedName": "hash(into:)",
            "children": [
              {
                "kind": "TypeNominal",
                "name": "Void",
                "printedName": "()"
              },
              {
                "kind": "TypeNominal",
                "name": "Hasher",
                "printedName": "Swift.Hasher",
                "paramValueOwnership": "InOut",
                "usr": "s:s6HasherV"
              }
            ],
            "declKind": "Func",
            "usr": "s:12MXAutoLayout0aB9AttributeO4hash4intoys6HasherVz_tF",
            "mangledName": "$s12MXAutoLayout0aB9AttributeO4hash4intoys6HasherVz_tF",
            "moduleName": "MXAutoLayout",
            "implicit": true,
            "funcSelfKind": "NonMutating"
          }
        ],
        "declKind": "Enum",
        "usr": "s:12MXAutoLayout0aB9AttributeO",
        "mangledName": "$s12MXAutoLayout0aB9AttributeO",
        "moduleName": "MXAutoLayout",
        "declAttributes": [
          "AccessControl"
        ],
        "conformances": [
          {
            "kind": "Conformance",
            "name": "Equatable",
            "printedName": "Equatable",
            "usr": "s:SQ",
            "mangledName": "$sSQ"
          },
          {
            "kind": "Conformance",
            "name": "Hashable",
            "printedName": "Hashable",
            "usr": "s:SH",
            "mangledName": "$sSH"
          }
        ]
      },
      {
        "kind": "TypeDecl",
        "name": "MXLayoutContraint",
        "printedName": "MXLayoutContraint",
        "children": [
          {
            "kind": "Constructor",
            "name": "init",
            "printedName": "init()",
            "children": [
              {
                "kind": "TypeNominal",
                "name": "MXLayoutContraint",
                "printedName": "MXAutoLayout.MXLayoutContraint",
                "usr": "c:@M@MXAutoLayout@objc(cs)MXLayoutContraint"
              }
            ],
            "declKind": "Constructor",
            "usr": "c:@M@MXAutoLayout@objc(cs)MXLayoutContraint(im)init",
            "mangledName": "$s12MXAutoLayout17MXLayoutContraintCACycfc",
            "moduleName": "MXAutoLayout",
            "overriding": true,
            "implicit": true,
            "objc_name": "init",
            "declAttributes": [
              "Dynamic",
              "ObjC",
              "Custom",
              "Override"
            ],
            "init_kind": "Designated"
          }
        ],
        "declKind": "Class",
        "usr": "c:@M@MXAutoLayout@objc(cs)MXLayoutContraint",
        "mangledName": "$s12MXAutoLayout17MXLayoutContraintC",
        "moduleName": "MXAutoLayout",
        "declAttributes": [
          "Custom",
          "AccessControl",
          "ObjC"
        ],
        "superclassUsr": "c:objc(cs)NSLayoutConstraint",
        "inheritsConvenienceInitializers": true,
        "superclassNames": [
          "UIKit.NSLayoutConstraint",
          "ObjectiveC.NSObject"
        ],
        "conformances": [
          {
            "kind": "Conformance",
            "name": "Equatable",
            "printedName": "Equatable",
            "usr": "s:SQ",
            "mangledName": "$sSQ"
          },
          {
            "kind": "Conformance",
            "name": "Hashable",
            "printedName": "Hashable",
            "usr": "s:SH",
            "mangledName": "$sSH"
          },
          {
            "kind": "Conformance",
            "name": "CVarArg",
            "printedName": "CVarArg",
            "usr": "s:s7CVarArgP",
            "mangledName": "$ss7CVarArgP"
          },
          {
            "kind": "Conformance",
            "name": "_KeyValueCodingAndObservingPublishing",
            "printedName": "_KeyValueCodingAndObservingPublishing",
            "usr": "s:10Foundation37_KeyValueCodingAndObservingPublishingP",
            "mangledName": "$s10Foundation37_KeyValueCodingAndObservingPublishingP"
          },
          {
            "kind": "Conformance",
            "name": "_KeyValueCodingAndObserving",
            "printedName": "_KeyValueCodingAndObserving",
            "usr": "s:10Foundation27_KeyValueCodingAndObservingP",
            "mangledName": "$s10Foundation27_KeyValueCodingAndObservingP"
          },
          {
            "kind": "Conformance",
            "name": "CustomStringConvertible",
            "printedName": "CustomStringConvertible",
            "usr": "s:s23CustomStringConvertibleP",
            "mangledName": "$ss23CustomStringConvertibleP"
          },
          {
            "kind": "Conformance",
            "name": "CustomDebugStringConvertible",
            "printedName": "CustomDebugStringConvertible",
            "usr": "s:s28CustomDebugStringConvertibleP",
            "mangledName": "$ss28CustomDebugStringConvertibleP"
          }
        ]
      },
      {
        "kind": "TypeDecl",
        "name": "UIView",
        "printedName": "UIView",
        "children": [
          {
            "kind": "Function",
            "name": "addSubview",
            "printedName": "addSubview(_:autoLayoutAttribute:)",
            "children": [
              {
                "kind": "TypeNominal",
                "name": "Void",
                "printedName": "()"
              },
              {
                "kind": "TypeNominal",
                "name": "UIView",
                "printedName": "UIKit.UIView",
                "usr": "c:objc(cs)UIView"
              },
              {
                "kind": "TypeNominal",
                "name": "MXAutoLayoutAttribute",
                "printedName": "MXAutoLayout.MXAutoLayoutAttribute",
                "usr": "s:12MXAutoLayout0aB9AttributeO"
              }
            ],
            "declKind": "Func",
            "usr": "s:So6UIViewC12MXAutoLayoutE10addSubview_04autoC9AttributeyAB_AC0bcG0OtF",
            "mangledName": "$sSo6UIViewC12MXAutoLayoutE10addSubview_04autoC9AttributeyAB_AC0bcG0OtF",
            "moduleName": "MXAutoLayout",
            "declAttributes": [
              "Custom",
              "AccessControl"
            ],
            "isFromExtension": true,
            "funcSelfKind": "NonMutating"
          }
        ],
        "declKind": "Class",
        "usr": "c:objc(cs)UIView",
        "moduleName": "UIKit",
        "isOpen": true,
        "intro_iOS": "2.0",
        "objc_name": "UIView",
        "declAttributes": [
          "Available",
          "ObjC",
          "NonSendable",
          "Custom",
          "Dynamic"
        ],
        "superclassUsr": "c:objc(cs)UIResponder",
        "isExternal": true,
        "inheritsConvenienceInitializers": true,
        "superclassNames": [
          "UIKit.UIResponder",
          "ObjectiveC.NSObject"
        ],
        "conformances": [
          {
            "kind": "Conformance",
            "name": "Equatable",
            "printedName": "Equatable",
            "usr": "s:SQ",
            "mangledName": "$sSQ"
          },
          {
            "kind": "Conformance",
            "name": "Hashable",
            "printedName": "Hashable",
            "usr": "s:SH",
            "mangledName": "$sSH"
          },
          {
            "kind": "Conformance",
            "name": "CVarArg",
            "printedName": "CVarArg",
            "usr": "s:s7CVarArgP",
            "mangledName": "$ss7CVarArgP"
          },
          {
            "kind": "Conformance",
            "name": "_KeyValueCodingAndObservingPublishing",
            "printedName": "_KeyValueCodingAndObservingPublishing",
            "usr": "s:10Foundation37_KeyValueCodingAndObservingPublishingP",
            "mangledName": "$s10Foundation37_KeyValueCodingAndObservingPublishingP"
          },
          {
            "kind": "Conformance",
            "name": "_KeyValueCodingAndObserving",
            "printedName": "_KeyValueCodingAndObserving",
            "usr": "s:10Foundation27_KeyValueCodingAndObservingP",
            "mangledName": "$s10Foundation27_KeyValueCodingAndObservingP"
          },
          {
            "kind": "Conformance",
            "name": "CustomStringConvertible",
            "printedName": "CustomStringConvertible",
            "usr": "s:s23CustomStringConvertibleP",
            "mangledName": "$ss23CustomStringConvertibleP"
          },
          {
            "kind": "Conformance",
            "name": "CustomDebugStringConvertible",
            "printedName": "CustomDebugStringConvertible",
            "usr": "s:s28CustomDebugStringConvertibleP",
            "mangledName": "$ss28CustomDebugStringConvertibleP"
          },
          {
            "kind": "Conformance",
            "name": "__DefaultCustomPlaygroundQuickLookable",
            "printedName": "__DefaultCustomPlaygroundQuickLookable",
            "usr": "s:s38__DefaultCustomPlaygroundQuickLookableP",
            "mangledName": "$ss38__DefaultCustomPlaygroundQuickLookableP"
          }
        ]
      }
    ],
    "json_format_version": 8
  },
  "ConstValues": [
    {
      "filePath": "\/Users\/shubhamsingh\/Workspace\/Maximess\/MXAutoLayout\/MXAutoLayoutFramework\/MXAutoLayout\/MXAutoLayout\/UIViewExtensions.swift",
      "kind": "BooleanLiteral",
      "offset": 829,
      "length": 5,
      "value": "false"
    },
    {
      "filePath": "\/Users\/shubhamsingh\/Workspace\/Maximess\/MXAutoLayout\/MXAutoLayoutFramework\/MXAutoLayout\/MXAutoLayout\/UIViewExtensions.swift",
      "kind": "IntegerLiteral",
      "offset": 991,
      "length": 1,
      "value": "1"
    },
    {
      "filePath": "\/Users\/shubhamsingh\/Workspace\/Maximess\/MXAutoLayout\/MXAutoLayoutFramework\/MXAutoLayout\/MXAutoLayout\/UIViewExtensions.swift",
      "kind": "IntegerLiteral",
      "offset": 1004,
      "length": 1,
      "value": "0"
    },
    {
      "filePath": "\/Users\/shubhamsingh\/Workspace\/Maximess\/MXAutoLayout\/MXAutoLayoutFramework\/MXAutoLayout\/MXAutoLayout\/UIViewExtensions.swift",
      "kind": "IntegerLiteral",
      "offset": 1138,
      "length": 1,
      "value": "1"
    },
    {
      "filePath": "\/Users\/shubhamsingh\/Workspace\/Maximess\/MXAutoLayout\/MXAutoLayoutFramework\/MXAutoLayout\/MXAutoLayout\/UIViewExtensions.swift",
      "kind": "IntegerLiteral",
      "offset": 1151,
      "length": 1,
      "value": "0"
    },
    {
      "filePath": "\/Users\/shubhamsingh\/Workspace\/Maximess\/MXAutoLayout\/MXAutoLayoutFramework\/MXAutoLayout\/MXAutoLayout\/UIViewExtensions.swift",
      "kind": "IntegerLiteral",
      "offset": 1287,
      "length": 1,
      "value": "1"
    },
    {
      "filePath": "\/Users\/shubhamsingh\/Workspace\/Maximess\/MXAutoLayout\/MXAutoLayoutFramework\/MXAutoLayout\/MXAutoLayout\/UIViewExtensions.swift",
      "kind": "IntegerLiteral",
      "offset": 1300,
      "length": 1,
      "value": "0"
    },
    {
      "filePath": "\/Users\/shubhamsingh\/Workspace\/Maximess\/MXAutoLayout\/MXAutoLayoutFramework\/MXAutoLayout\/MXAutoLayout\/UIViewExtensions.swift",
      "kind": "IntegerLiteral",
      "offset": 1438,
      "length": 1,
      "value": "1"
    },
    {
      "filePath": "\/Users\/shubhamsingh\/Workspace\/Maximess\/MXAutoLayout\/MXAutoLayoutFramework\/MXAutoLayout\/MXAutoLayout\/UIViewExtensions.swift",
      "kind": "IntegerLiteral",
      "offset": 1451,
      "length": 1,
      "value": "0"
    },
    {
      "filePath": "\/Users\/shubhamsingh\/Workspace\/Maximess\/MXAutoLayout\/MXAutoLayoutFramework\/MXAutoLayout\/MXAutoLayout\/UIViewExtensions.swift",
      "kind": "BooleanLiteral",
      "offset": 1622,
      "length": 5,
      "value": "false"
    },
    {
      "filePath": "\/Users\/shubhamsingh\/Workspace\/Maximess\/MXAutoLayout\/MXAutoLayoutFramework\/MXAutoLayout\/MXAutoLayout\/UIViewExtensions.swift",
      "kind": "IntegerLiteral",
      "offset": 1804,
      "length": 1,
      "value": "1"
    },
    {
      "filePath": "\/Users\/shubhamsingh\/Workspace\/Maximess\/MXAutoLayout\/MXAutoLayoutFramework\/MXAutoLayout\/MXAutoLayout\/UIViewExtensions.swift",
      "kind": "IntegerLiteral",
      "offset": 1817,
      "length": 1,
      "value": "0"
    },
    {
      "filePath": "\/Users\/shubhamsingh\/Workspace\/Maximess\/MXAutoLayout\/MXAutoLayoutFramework\/MXAutoLayout\/MXAutoLayout\/UIViewExtensions.swift",
      "kind": "IntegerLiteral",
      "offset": 1971,
      "length": 1,
      "value": "1"
    },
    {
      "filePath": "\/Users\/shubhamsingh\/Workspace\/Maximess\/MXAutoLayout\/MXAutoLayoutFramework\/MXAutoLayout\/MXAutoLayout\/UIViewExtensions.swift",
      "kind": "IntegerLiteral",
      "offset": 1984,
      "length": 1,
      "value": "0"
    },
    {
      "filePath": "\/Users\/shubhamsingh\/Workspace\/Maximess\/MXAutoLayout\/MXAutoLayoutFramework\/MXAutoLayout\/MXAutoLayout\/UIViewExtensions.swift",
      "kind": "IntegerLiteral",
      "offset": 2140,
      "length": 1,
      "value": "1"
    },
    {
      "filePath": "\/Users\/shubhamsingh\/Workspace\/Maximess\/MXAutoLayout\/MXAutoLayoutFramework\/MXAutoLayout\/MXAutoLayout\/UIViewExtensions.swift",
      "kind": "IntegerLiteral",
      "offset": 2153,
      "length": 1,
      "value": "0"
    },
    {
      "filePath": "\/Users\/shubhamsingh\/Workspace\/Maximess\/MXAutoLayout\/MXAutoLayoutFramework\/MXAutoLayout\/MXAutoLayout\/UIViewExtensions.swift",
      "kind": "IntegerLiteral",
      "offset": 2311,
      "length": 1,
      "value": "1"
    },
    {
      "filePath": "\/Users\/shubhamsingh\/Workspace\/Maximess\/MXAutoLayout\/MXAutoLayoutFramework\/MXAutoLayout\/MXAutoLayout\/UIViewExtensions.swift",
      "kind": "IntegerLiteral",
      "offset": 2324,
      "length": 1,
      "value": "0"
    }
  ]
}