AIR LIQUIDE;162,340
AIRBUS;104,240
ALSTOM;20,990
AXA;25,830
BNP PARIBAS;49,915
BOUYGUES;33,020
CAPGEMINI;194,050
CARREFOUR;19,975
CREDIT AGRICOLE;10,312
DANONE;56,230
DASSAULT SYSTEME;42,270
ENGIE;11,316
ESSILORLUXOTTICA;162,550
EUROFINS SCIENTIFIC;90,120
HERMES INTL;1193,000
KERING;504,800
L'OREAL;345,600
LEGRAND;83,800
LVMH;618,400
MICHELIN;119,850
ORANGE;11,278
PERNOD RICARD;192,200
PUBLICIS GROUPE;57,960
RENAULT;23,320
SAFRAN;106,240
ARCELORMITTAL;27,795
UNIBAIL-RODAMCO-WESTFIELD;68,330
SAINT-GOBAIN;55,660
SANOFI;101,520
SCHNEIDER ELECTRIC;137,580
SOCIETE GENERALE;23,380
STELLANTIS;12,926
STMICROELECTRONICS;35,815
TELEPERFORMANCE;343,200
THALES;122,150
TOTALENERGIES;47,020
VEOLIA;27,800
VINCI;92,740
VIVENDI;11,170
WORLDLINE;37,910
AIR LIQUIDE;165,360
AIRBUS;110,200
ALSTOM;22,600
AXA;25,085
BNP PARIBAS;52,220
BOUYGUES;31,120
CAPGEMINI;194,150
CARREFOUR;20,680
CREDIT AGRICOLE;10,100
DANONE;56,390
DASSAULT SYSTEME;42,610
ENGIE;11,418
ESSILORLUXOTTICA;163,150
EUROFINS SCIENTIFIC;87,180
HERMES INTL;1113,500
KERING;490,150
L'OREAL;335,200
LEGRAND;84,200
LVMH;600,800
MICHELIN;121,150
ORANGE;11,580
PERNOD RICARD;195,650
PUBLICIS GROUPE;58,220
RENAULT;23,855
SAFRAN;100,840
ARCELORMITTAL;27,825
UNIBAIL-RODAMCO-WESTFIELD;70,220
SAINT-GOBAIN;55,420
SANOFI;100,180
SCHNEIDER ELECTRIC;132,980
SOCIETE GENERALE;23,395
STELLANTIS;13,048
STMICROELECTRONICS;35,875
TELEPERFORMANCE;334,300
THALES;121,800
TOTALENERGIES;49,565
VEOLIA;27,630
VINCI;92,070
VIVENDI;11,250
WORLDLINE;38,820
AIR LIQUIDE;166,040
AIRBUS;109,500
ALSTOM;22,670
AXA;24,985
BNP PARIBAS;52,380
BOUYGUES;31,170
CAPGEMINI;194,050
CARREFOUR;20,690
CREDIT AGRICOLE;10,114
DANONE;56,330
DASSAULT SYSTEME;42,885
ENGIE;11,452
ESSILORLUXOTTICA;163,550
EUROFINS SCIENTIFIC;87,440
HERMES INTL;1122,000
KERING;488,650
L'OREAL;337,450
LEGRAND;84,080
LVMH;603,100
MICHELIN;121,000
ORANGE;11,574
PERNOD RICARD;196,250
PUBLICIS GROUPE;58,520
RENAULT;23,795
SAFRAN;100,160
ARCELORMITTAL;27,305
UNIBAIL-RODAMCO-WESTFIELD;70,810
SAINT-GOBAIN;55,500
SANOFI;100,220
SCHNEIDER ELECTRIC;132,620
SOCIETE GENERALE;23,510
STELLANTIS;13,058
STMICROELECTRONICS;36,010
TELEPERFORMANCE;336,000
THALES;122,350
TOTALENERGIES;49,545
VEOLIA;27,760
VINCI;92,190
VIVENDI;11,385
WORLDLINE;38,670
AIR LIQUIDE;160,820
AIRBUS;107,500
ALSTOM;22,330
AXA;22,795
BNP PARIBAS;50,590
BOUYGUES;30,740
CAPGEMINI;183,750
CARREFOUR;20,590
CREDIT AGRICOLE;9,965
DANONE;56,100
DASSAULT SYSTEME;39,495
ENGIE;11,138
ESSILORLUXOTTICA;155,050
EUROFINS SCIENTIFIC;84,540
HERMES INTL;1042,000
KERING;457,900
L'OREAL;316,000
LEGRAND;81,280
LVMH;561,900
MICHELIN;117,100
ORANGE;11,574
PERNOD RICARD;183,200
PUBLICIS GROUPE;54,560
RENAULT;23,170
SAFRAN;95,420
ARCELORMITTAL;26,320
UNIBAIL-RODAMCO-WESTFIELD;66,880
SAINT-GOBAIN;53,530
SANOFI;97,050
SCHNEIDER ELECTRIC;127,000
SOCIETE GENERALE;22,565
STELLANTIS;13,156
STMICROELECTRONICS;34,765
TELEPERFORMANCE;317,000
THALES;121,050
TOTALENERGIES;50,600
VEOLIA;26,260
VINCI;90,390
VIVENDI;10,935
WORLDLINE;37,440
