AIR LIQUIDE;166,040
AIRBUS;109,500
ALSTOM;22,670
AXA;24,985
BNP PARIBAS;52,380
BOUYGUES;31,170
CAPGEMINI;194,050
CARREFOUR;20,690
CREDIT AGRICOLE;10,114
DANONE;56,330
DASSAULT SYSTEME;42,885
ENGIE;11,452
ESSILORLUXOTTICA;163,550
EUROFINS SCIENTIFIC;87,440
HERMES INTL;1122,000
KERING;488,650
L'OREAL;337,450
LEGRAND;84,080
LVMH;603,100
MICHELIN;121,000
ORANGE;11,574
PERNOD RICARD;196,250
PUBLICIS GROUPE;58,520
RENAULT;23,795
SAFRAN;100,160
ARCELORMITTAL;27,305
UNIBAIL-RODAMCO-WESTFIELD;70,810
SAINT-GOBAIN;55,500
SANOFI;100,220
SCHNEIDER ELECTRIC;132,620
SOCIETE GENERALE;23,510
STELLANTIS;13,058
STMICROELECTRONICS;36,010
TELEPERFORMANCE;336,000
THALES;122,350
TOTALENERGIES;49,545
VEOLIA;27,760
VINCI;92,190
VIVENDI;11,385
WORLDLINE;38,670
