AIR LIQUIDE;163,920
AIRBUS;106,540
ALSTOM;22,150
AXA;25,490
BNP PARIBAS;51,320
BOUYGUES;30,930
CAPGEMINI;194,050
CARREFOUR;16,8
CREDIT AGRICOLE;10,484
DANONE;57,400
DASSAULT SYSTEME;41,875
ENGIE;11,348
ESSILORLUXOTTICA;160,800
EUROFINS SCIENTIFIC;86,380
HERMES INTL;1129,000
KERING;490,300
L'OREAL;333,500
LEGRAND;83,360
LVMH;600,500
MICHELIN;119,400
ORANGE;11,456
PERNOD RICARD;198,350
PUBLICIS GROUPE;57,580
RENAULT;24,150
SAFRAN;100,480
ARCELORMITTAL;28,120
UNIBAIL-RODAMCO-WESTFIELD;69,000
SAINT-GOBAIN;55,310
SANOFI;101,620
SCHNEIDER ELECTRIC;131,000
SOCIETE GENERALE;23,405
STELLANTIS;12,978
STMICROELECTRONICS;35,720
TELEPERFORMANCE;330,300
THALES;124,850
TOTALENERGIES;48,800
VEOLIA;27,460
VINCI;92,730
VIVENDI;11,110
WORLDLINE;38,350
