C:\Users\HB\workspace_java\stagiaires20210128CompletAvecTestH2\src\main\java\fr\humanbooster\fx\stagiaires\dao\StagiaireDao.java
C:\Users\HB\workspace_java\stagiaires20210128CompletAvecTestH2\src\main\java\fr\humanbooster\fx\stagiaires\business\Ville.java
C:\Users\HB\workspace_java\stagiaires20210128CompletAvecTestH2\src\main\java\fr\humanbooster\fx\stagiaires\dao\ConnexionBdd.java
C:\Users\HB\workspace_java\stagiaires20210128CompletAvecTestH2\src\main\java\fr\humanbooster\fx\stagiaires\service\impl\StagiaireServiceImpl.java
C:\Users\HB\workspace_java\stagiaires20210128CompletAvecTestH2\src\main\java\fr\humanbooster\fx\stagiaires\business\Groupe.java
C:\Users\HB\workspace_java\stagiaires20210128CompletAvecTestH2\src\main\java\fr\humanbooster\fx\stagiaires\dao\impl\GroupeDaoImpl.java
C:\Users\HB\workspace_java\stagiaires20210128CompletAvecTestH2\src\main\java\fr\humanbooster\fx\stagiaires\service\StagiaireService.java
C:\Users\HB\workspace_java\stagiaires20210128CompletAvecTestH2\src\main\java\fr\humanbooster\fx\stagiaires\service\impl\VilleServiceImpl.java
C:\Users\HB\workspace_java\stagiaires20210128CompletAvecTestH2\src\main\java\fr\humanbooster\fx\stagiaires\business\Stagiaire.java
C:\Users\HB\workspace_java\stagiaires20210128CompletAvecTestH2\src\main\java\fr\humanbooster\fx\stagiaires\App.java
C:\Users\HB\workspace_java\stagiaires20210128CompletAvecTestH2\src\main\java\fr\humanbooster\fx\stagiaires\service\VilleService.java
C:\Users\HB\workspace_java\stagiaires20210128CompletAvecTestH2\src\main\java\fr\humanbooster\fx\stagiaires\service\impl\GroupeServiceImpl.java
C:\Users\HB\workspace_java\stagiaires20210128CompletAvecTestH2\src\main\java\fr\humanbooster\fx\stagiaires\dao\GroupeDao.java
C:\Users\HB\workspace_java\stagiaires20210128CompletAvecTestH2\src\main\java\fr\humanbooster\fx\stagiaires\dao\impl\VilleDaoImpl.java
C:\Users\HB\workspace_java\stagiaires20210128CompletAvecTestH2\src\main\java\fr\humanbooster\fx\stagiaires\dao\Requetes.java
C:\Users\HB\workspace_java\stagiaires20210128CompletAvecTestH2\src\main\java\fr\humanbooster\fx\stagiaires\service\GroupeService.java
C:\Users\HB\workspace_java\stagiaires20210128CompletAvecTestH2\src\main\java\fr\humanbooster\fx\stagiaires\dao\impl\StagiaireDaoImpl.java
C:\Users\HB\workspace_java\stagiaires20210128CompletAvecTestH2\src\main\java\fr\humanbooster\fx\stagiaires\dao\VilleDao.java
