-------------------------------------------------------------------------------
Test set: fr.humanbooster.fx.travel.dao.CompagnieDaoTest
-------------------------------------------------------------------------------
Tests run: 2, Failures: 0, Errors: 0, Skipped: 0, Time elapsed: 0.058 s - in fr.humanbooster.fx.travel.dao.CompagnieDaoTest
