C:\Users\HB\workspace_java\travelFx20200320\travel\src\test\java\fr\humanbooster\fx\travel\dao\VolDaoTest.java
C:\Users\HB\workspace_java\travelFx20200320\travel\src\test\java\fr\humanbooster\fx\travel\dao\AeroportDaoTest.java
C:\Users\HB\workspace_java\travelFx20200320\travel\src\test\java\fr\humanbooster\fx\travel\dao\CompagnieDaoTest.java
C:\Users\HB\workspace_java\travelFx20200320\travel\src\test\java\fr\humanbooster\fx\travel\service\CompagnieServiceTest.java
