<svg width="375" height="184" viewBox="0 0 375 184" fill="none" xmlns="http://www.w3.org/2000/svg">
<rect x="-105.28" y="42.6933" width="578.119" height="80.2275" fill="#9DF5EC"/>
<circle cx="31.8885" cy="82.2061" r="77.9739" fill="#9DF5EC"/>
<circle cx="165" cy="82.2061" r="77.9739" fill="#9DF5EC"/>
<circle cx="299.013" cy="82.2061" r="77.9739" fill="#9DF5EC"/>
<circle cx="433.026" cy="78.2999" r="77.9739" fill="#9DF5EC"/>
<rect x="-105.28" y="66.2658" width="578.119" height="80.2275" fill="#A0C9E8"/>
<circle cx="31.8885" cy="105.779" r="77.9739" fill="#A0C9E8"/>
<circle cx="165" cy="105.779" r="77.9739" fill="#A0C9E8"/>
<circle cx="299.013" cy="105.779" r="77.9739" fill="#A0C9E8"/>
<circle cx="433.026" cy="101.872" r="77.9739" fill="#A0C9E8"/>
<circle cx="117" cy="107" r="16" fill="#7275C8"/>
<path d="M122.066 107.05L120.416 103.75H120.266L120.746 107.05V118H116.846V96.85H119.846L127.796 108.04L129.386 111.25H129.536L129.056 108.04V97H132.956V118.15H129.956L122.066 107.05ZM135.753 110.5C135.753 107.96 136.373 106.01 137.613 104.65C138.853 103.27 140.593 102.58 142.833 102.58C144.033 102.58 145.073 102.77 145.953 103.15C146.833 103.53 147.563 104.07 148.143 104.77C148.723 105.45 149.153 106.28 149.433 107.26C149.733 108.24 149.883 109.32 149.883 110.5C149.883 113.04 149.263 115 148.023 116.38C146.803 117.74 145.073 118.42 142.833 118.42C141.633 118.42 140.593 118.23 139.713 117.85C138.833 117.47 138.093 116.94 137.493 116.26C136.913 115.56 136.473 114.72 136.173 113.74C135.893 112.76 135.753 111.68 135.753 110.5ZM139.773 110.5C139.773 111.16 139.833 111.77 139.953 112.33C140.073 112.89 140.253 113.38 140.493 113.8C140.733 114.22 141.043 114.55 141.423 114.79C141.823 115.01 142.293 115.12 142.833 115.12C143.853 115.12 144.613 114.75 145.113 114.01C145.613 113.27 145.863 112.1 145.863 110.5C145.863 109.12 145.633 108.01 145.173 107.17C144.713 106.31 143.933 105.88 142.833 105.88C141.873 105.88 141.123 106.24 140.583 106.96C140.043 107.68 139.773 108.86 139.773 110.5ZM151.026 103H153.096V100.18L156.996 99.07V103H160.656V106.3H156.996V112.06C156.996 113.1 157.096 113.85 157.296 114.31C157.516 114.75 157.916 114.97 158.496 114.97C158.896 114.97 159.236 114.93 159.516 114.85C159.816 114.77 160.146 114.65 160.506 114.49L161.196 117.49C160.656 117.75 160.026 117.97 159.306 118.15C158.586 118.33 157.856 118.42 157.116 118.42C155.736 118.42 154.716 118.07 154.056 117.37C153.416 116.65 153.096 115.48 153.096 113.86V106.3H151.026V103ZM171.325 106.66C170.705 106.44 170.145 106.33 169.645 106.33C168.945 106.33 168.355 106.52 167.875 106.9C167.415 107.26 167.105 107.73 166.945 108.31V118H163.045V103H166.075L166.525 104.98H166.645C166.985 104.24 167.445 103.67 168.025 103.27C168.605 102.87 169.285 102.67 170.065 102.67C170.585 102.67 171.175 102.78 171.835 103L171.325 106.66ZM185.563 116.71C184.963 117.19 184.143 117.6 183.103 117.94C182.083 118.26 180.993 118.42 179.833 118.42C177.413 118.42 175.643 117.72 174.523 116.32C173.403 114.9 172.843 112.96 172.843 110.5C172.843 107.86 173.473 105.88 174.733 104.56C175.993 103.24 177.763 102.58 180.043 102.58C180.803 102.58 181.543 102.68 182.263 102.88C182.983 103.08 183.623 103.41 184.183 103.87C184.743 104.33 185.193 104.95 185.533 105.73C185.873 106.51 186.043 107.48 186.043 108.64C186.043 109.06 186.013 109.51 185.953 109.99C185.913 110.47 185.843 110.97 185.743 111.49H176.743C176.803 112.75 177.123 113.7 177.703 114.34C178.303 114.98 179.263 115.3 180.583 115.3C181.403 115.3 182.133 115.18 182.773 114.94C183.433 114.68 183.933 114.42 184.273 114.16L185.563 116.71ZM179.983 105.7C178.963 105.7 178.203 106.01 177.703 106.63C177.223 107.23 176.933 108.04 176.833 109.06H182.413C182.493 107.98 182.323 107.15 181.903 106.57C181.503 105.99 180.863 105.7 179.983 105.7ZM210.314 117.13C209.674 117.59 208.854 117.92 207.854 118.12C206.874 118.32 205.864 118.42 204.824 118.42C203.564 118.42 202.364 118.23 201.224 117.85C200.104 117.45 199.114 116.82 198.254 115.96C197.394 115.08 196.704 113.95 196.184 112.57C195.684 111.17 195.434 109.48 195.434 107.5C195.434 105.44 195.714 103.72 196.274 102.34C196.854 100.94 197.594 99.82 198.494 98.98C199.414 98.12 200.434 97.51 201.554 97.15C202.674 96.77 203.794 96.58 204.914 96.58C206.114 96.58 207.124 96.66 207.944 96.82C208.784 96.98 209.474 97.17 210.014 97.39L209.204 100.87C208.744 100.65 208.194 100.49 207.554 100.39C206.934 100.29 206.174 100.24 205.274 100.24C203.614 100.24 202.274 100.83 201.254 102.01C200.254 103.19 199.754 105.02 199.754 107.5C199.754 108.58 199.874 109.57 200.114 110.47C200.354 111.35 200.714 112.11 201.194 112.75C201.694 113.37 202.304 113.86 203.024 114.22C203.764 114.56 204.614 114.73 205.574 114.73C206.474 114.73 207.234 114.64 207.854 114.46C208.474 114.28 209.014 114.05 209.474 113.77L210.314 117.13ZM229.142 107.11L229.592 102.94H229.412L228.122 106.3L223.652 114.13H222.332L217.622 106.27L216.302 102.94H216.152L216.752 107.08V118H212.852V97H216.602L222.212 106.6L223.202 109H223.322L224.222 106.54L229.532 97H233.252V118H229.142V107.11ZM245.906 112.36C245.906 111.72 245.666 111.2 245.186 110.8C244.726 110.4 244.136 110.04 243.416 109.72C242.716 109.38 241.946 109.04 241.106 108.7C240.286 108.34 239.516 107.91 238.796 107.41C238.096 106.89 237.506 106.25 237.026 105.49C236.566 104.73 236.336 103.76 236.336 102.58C236.336 101.56 236.506 100.68 236.846 99.94C237.186 99.18 237.666 98.55 238.286 98.05C238.926 97.55 239.676 97.18 240.536 96.94C241.396 96.7 242.356 96.58 243.416 96.58C244.636 96.58 245.786 96.69 246.866 96.91C247.946 97.11 248.836 97.41 249.536 97.81L248.246 101.26C247.806 100.98 247.146 100.73 246.266 100.51C245.386 100.27 244.436 100.15 243.416 100.15C242.456 100.15 241.716 100.34 241.196 100.72C240.696 101.1 240.446 101.61 240.446 102.25C240.446 102.85 240.676 103.35 241.136 103.75C241.616 104.15 242.206 104.52 242.906 104.86C243.626 105.2 244.396 105.55 245.216 105.91C246.056 106.27 246.826 106.71 247.526 107.23C248.246 107.73 248.836 108.36 249.296 109.12C249.776 109.86 250.016 110.79 250.016 111.91C250.016 113.03 249.826 114 249.446 114.82C249.086 115.62 248.566 116.29 247.886 116.83C247.226 117.37 246.416 117.77 245.456 118.03C244.516 118.29 243.476 118.42 242.336 118.42C240.836 118.42 239.516 118.28 238.376 118C237.236 117.72 236.396 117.44 235.856 117.16L237.176 113.65C237.396 113.77 237.676 113.9 238.016 114.04C238.376 114.18 238.776 114.31 239.216 114.43C239.656 114.55 240.116 114.65 240.596 114.73C241.096 114.81 241.606 114.85 242.126 114.85C243.346 114.85 244.276 114.65 244.916 114.25C245.576 113.83 245.906 113.2 245.906 112.36Z" fill="white"/>
</svg>
