{
  "type": "evaluation",
  "neverRecomputeExistingPartitions": false,
  "optionalDependencies": false,
  "params": {
    "containerSelection": {
      "containerMode": "INHERIT"
    }
  },
  "customMeta": {
    "kv": {}
  },
  "redispatchPartitioning": false,
  "maxRunningActivities": 0,
  "variables": {},
  "dkuProperties": [],
  "inputs": {
    "main": {
      "items": [
        {
          "ref": "housing_historic_prepared",
          "deps": []
        }
      ]
    },
    "model": {
      "items": [
        {
          "ref": "cGnRocIt",
          "deps": []
        }
      ]
    }
  },
  "outputs": {
    "evaluationStore": {
      "items": [
        {
          "ref": "hXg7bRD5",
          "appendMode": false
        }
      ]
    }
  },
  "labels": [],
  "versionTag": {
    "versionNumber": 1,
    "lastModifiedBy": {
      "login": "admin"
    },
    "lastModifiedOn": 1651163893090
  },
  "creationTag": {
    "versionNumber": 0,
    "lastModifiedBy": {
      "login": "admin"
    },
    "lastModifiedOn": 1651163891466
  },
  "tags": [],
  "customFields": {},
  "checklists": {
    "checklists": []
  }
}