\relax 
\catcode `:\active 
\catcode `;\active 
\catcode `!\active 
\catcode `?\active 
\select@language{french}
\@writefile{toc}{\select@language{french}}
\@writefile{lof}{\select@language{french}}
\@writefile{lot}{\select@language{french}}
\@writefile{toc}{\contentsline {section}{\numberline {1}Introduction}{1}}
\@writefile{lof}{\contentsline {figure}{\numberline {1}{\ignorespaces \IeC {\'E}volution des ratios lorsque D augmente pour $M=100$ et $N=1000$.}}{2}}
\newlabel{1.1}{{1}{2}}
\@writefile{lof}{\contentsline {figure}{\numberline {2}{\ignorespaces \IeC {\'E}volution des ratios lorsque D augmente pour $M=100$ et $N=10000$.}}{2}}
\newlabel{1.2}{{2}{2}}
\@writefile{lof}{\contentsline {figure}{\numberline {3}{\ignorespaces Temps de calcul selon la dimension et le choix de M et N.}}{2}}
\newlabel{1_tab}{{3}{2}}
\@writefile{lof}{\contentsline {figure}{\numberline {4}{\ignorespaces \IeC {\'E}volution des ratios lorsque M augmente pour $D=256$ et $N=1000$.}}{3}}
\newlabel{1.3}{{4}{3}}
\@writefile{lof}{\contentsline {figure}{\numberline {5}{\ignorespaces Comparaison des ratios lorsque D augmente pour $M=100$ et $N=1000$.}}{3}}
\newlabel{3.1}{{5}{3}}
\@writefile{lof}{\contentsline {figure}{\numberline {6}{\ignorespaces Comparaison des ratios lorsque D augmente pour $M=100$ et $N=10000$.}}{4}}
\newlabel{3.2}{{6}{4}}
\@writefile{lof}{\contentsline {figure}{\numberline {7}{\ignorespaces \IeC {\'E}volution des ratios lorsque M augmente pour $D=256$ et $N=1000$.}}{4}}
\newlabel{3.3}{{7}{4}}
\@writefile{lof}{\contentsline {figure}{\numberline {8}{\ignorespaces Temps de calcul selon la dimension et le choix de M et N.}}{4}}
\newlabel{3_tab}{{8}{4}}
\@writefile{lof}{\contentsline {figure}{\numberline {9}{\ignorespaces Rang moyen du vecteur ajout\IeC {\'e} lorsque celui-ci se d\IeC {\'e}place en 10 \IeC {\'e}tapes.}}{7}}
\newlabel{6.1}{{9}{7}}
\@writefile{lof}{\contentsline {figure}{\numberline {10}{\ignorespaces Rang moyen du vecteur ajout\IeC {\'e} lorsque celui-ci se d\IeC {\'e}place en 200 \IeC {\'e}tapes.}}{7}}
\newlabel{6.2}{{10}{7}}
\@writefile{lof}{\contentsline {figure}{\numberline {11}{\ignorespaces Ratios des distances pour les 157 vecteurs requ\IeC {\^e}tes pour la m\IeC {\'e}thode a).}}{8}}
\newlabel{7.1}{{11}{8}}
\@writefile{lof}{\contentsline {figure}{\numberline {12}{\ignorespaces Ratios moyen des distances pour les 157 vecteurs requ\IeC {\^e}tes pour la m\IeC {\'e}thode a).}}{8}}
\newlabel{7.2}{{12}{8}}
\@writefile{lof}{\contentsline {figure}{\numberline {13}{\ignorespaces Ratios des distances pour les 157 vecteurs requ\IeC {\^e}tes pour la m\IeC {\'e}thode b).}}{8}}
\newlabel{7.3}{{13}{8}}
\@writefile{lof}{\contentsline {figure}{\numberline {14}{\ignorespaces Ratios moyen des distances pour les 157 vecteurs requ\IeC {\^e}tes pour la m\IeC {\'e}thode b).}}{9}}
\newlabel{7.4}{{14}{9}}
\@writefile{lof}{\contentsline {figure}{\numberline {15}{\ignorespaces Ratios des distances pour les 157 vecteurs requ\IeC {\^e}tes pour la m\IeC {\'e}thode b).}}{9}}
\newlabel{8.1}{{15}{9}}
\@writefile{lof}{\contentsline {figure}{\numberline {16}{\ignorespaces Ratios moyen des distances pour les 157 vecteurs requ\IeC {\^e}tes pour la m\IeC {\'e}thode b).}}{9}}
\newlabel{8.2}{{16}{9}}
\@writefile{lof}{\contentsline {figure}{\numberline {17}{\ignorespaces Comparaison des ratios des distances pour les donn\IeC {\'e}es r\IeC {\'e}elles par la m\IeC {\'e}thode b) et les donn\IeC {\'e}es synth\IeC {\'e}tiques.}}{11}}
\newlabel{9.1}{{17}{11}}
\@writefile{lof}{\contentsline {figure}{\numberline {18}{\ignorespaces Comparaison des ratios moyens des distances pour les donn\IeC {\'e}es r\IeC {\'e}elles par la m\IeC {\'e}thode b) et les donn\IeC {\'e}es synth\IeC {\'e}tiques.}}{11}}
\newlabel{9.2}{{18}{11}}
\@writefile{lof}{\contentsline {figure}{\numberline {19}{\ignorespaces Ratios des distances par Hellinger, histogrammes gris, m\IeC {\'e}thode a).}}{13}}
\newlabel{10.1}{{19}{13}}
\@writefile{lof}{\contentsline {figure}{\numberline {20}{\ignorespaces Ratios moyens des distances par Hellinger, histogrammes gris, m\IeC {\'e}thode a).}}{13}}
\newlabel{10.2}{{20}{13}}
\@writefile{lof}{\contentsline {figure}{\numberline {21}{\ignorespaces Ratios des distances par Hellinger, histogrammes gris, m\IeC {\'e}thode b).}}{13}}
\newlabel{10.3}{{21}{13}}
\@writefile{lof}{\contentsline {figure}{\numberline {22}{\ignorespaces Ratios moyens des distances par Hellinger, histogrammes gris, m\IeC {\'e}thode b).}}{14}}
\newlabel{10.4}{{22}{14}}
\@writefile{lof}{\contentsline {figure}{\numberline {23}{\ignorespaces Ratios des distances par Hellinger, histogrammes couleur, m\IeC {\'e}thode b).}}{14}}
\newlabel{10.5}{{23}{14}}
\@writefile{lof}{\contentsline {figure}{\numberline {24}{\ignorespaces Ratios moyens des distances par Hellinger, histogrammes couleur, m\IeC {\'e}thode b).}}{14}}
\newlabel{10.6}{{24}{14}}
