{
  "name": "org.apache.camel.kafkaconnector.awsddbstreamssource.CamelAwsddbstreamssourceSourceConnector",
  "error_count": 1,
  "groups": [
    "Common",
    "Transforms",
    "Predicates",
    "Error Handling",
    "Topic Creation"
  ],
  "configs": [
    {
      "definition": {
        "name": "name",
        "type": "STRING",
        "required": true,
        "default_value": null,
        "importance": "HIGH",
        "documentation": "Globally unique name to use for this connector.",
        "group": "Common",
        "width": "MEDIUM",
        "display_name": "Connector name",
        "dependents": [],
        "order": 1
      },
      "value": {
        "name": "name",
        "value": null,
        "recommended_values": [],
        "errors": [
          "Missing required configuration \"name\" which has no default value."
        ],
        "visible": true
      }
    },
    {
      "definition": {
        "name": "connector.class",
        "type": "STRING",
        "required": true,
        "default_value": null,
        "importance": "HIGH",
        "documentation": "Name or alias of the class for this connector. Must be a subclass of org.apache.kafka.connect.connector.Connector. If the connector is org.apache.kafka.connect.file.FileStreamSinkConnector, you can either specify this full name,  or use \"FileStreamSink\" or \"FileStreamSinkConnector\" to make the configuration a bit shorter",
        "group": "Common",
        "width": "LONG",
        "display_name": "Connector class",
        "dependents": [],
        "order": 2
      },
      "value": {
        "name": "connector.class",
        "value": "org.apache.camel.kafkaconnector.awsddbstreamssource.CamelAwsddbstreamssourceSourceConnector",
        "recommended_values": [],
        "errors": [],
        "visible": true
      }
    },
    {
      "definition": {
        "name": "tasks.max",
        "type": "INT",
        "required": false,
        "default_value": "1",
        "importance": "HIGH",
        "documentation": "Maximum number of tasks to use for this connector.",
        "group": "Common",
        "width": "SHORT",
        "display_name": "Tasks max",
        "dependents": [],
        "order": 3
      },
      "value": {
        "name": "tasks.max",
        "value": "1",
        "recommended_values": [],
        "errors": [],
        "visible": true
      }
    },
    {
      "definition": {
        "name": "key.converter",
        "type": "CLASS",
        "required": false,
        "default_value": null,
        "importance": "LOW",
        "documentation": "Converter class used to convert between Kafka Connect format and the serialized form that is written to Kafka. This controls the format of the keys in messages written to or read from Kafka, and since this is independent of connectors it allows any connector to work with any serialization format. Examples of common formats include JSON and Avro.",
        "group": "Common",
        "width": "SHORT",
        "display_name": "Key converter class",
        "dependents": [],
        "order": 4
      },
      "value": {
        "name": "key.converter",
        "value": null,
        "recommended_values": [],
        "errors": [],
        "visible": true
      }
    },
    {
      "definition": {
        "name": "value.converter",
        "type": "CLASS",
        "required": false,
        "default_value": null,
        "importance": "LOW",
        "documentation": "Converter class used to convert between Kafka Connect format and the serialized form that is written to Kafka. This controls the format of the values in messages written to or read from Kafka, and since this is independent of connectors it allows any connector to work with any serialization format. Examples of common formats include JSON and Avro.",
        "group": "Common",
        "width": "SHORT",
        "display_name": "Value converter class",
        "dependents": [],
        "order": 5
      },
      "value": {
        "name": "value.converter",
        "value": null,
        "recommended_values": [],
        "errors": [],
        "visible": true
      }
    },
    {
      "definition": {
        "name": "header.converter",
        "type": "CLASS",
        "required": false,
        "default_value": null,
        "importance": "LOW",
        "documentation": "HeaderConverter class used to convert between Kafka Connect format and the serialized form that is written to Kafka. This controls the format of the header values in messages written to or read from Kafka, and since this is independent of connectors it allows any connector to work with any serialization format. Examples of common formats include JSON and Avro. By default, the SimpleHeaderConverter is used to serialize header values to strings and deserialize them by inferring the schemas.",
        "group": "Common",
        "width": "SHORT",
        "display_name": "Header converter class",
        "dependents": [],
        "order": 6
      },
      "value": {
        "name": "header.converter",
        "value": null,
        "recommended_values": [],
        "errors": [],
        "visible": true
      }
    },
    {
      "definition": {
        "name": "transforms",
        "type": "LIST",
        "required": false,
        "default_value": "",
        "importance": "LOW",
        "documentation": "Aliases for the transformations to be applied to records.",
        "group": "Transforms",
        "width": "LONG",
        "display_name": "Transforms",
        "dependents": [],
        "order": 7
      },
      "value": {
        "name": "transforms",
        "value": "",
        "recommended_values": [],
        "errors": [],
        "visible": true
      }
    },
    {
      "definition": {
        "name": "predicates",
        "type": "LIST",
        "required": false,
        "default_value": "",
        "importance": "LOW",
        "documentation": "Aliases for the predicates used by transformations.",
        "group": "Predicates",
        "width": "LONG",
        "display_name": "Predicates",
        "dependents": [],
        "order": 8
      },
      "value": {
        "name": "predicates",
        "value": "",
        "recommended_values": [],
        "errors": [],
        "visible": true
      }
    },
    {
      "definition": {
        "name": "config.action.reload",
        "type": "STRING",
        "required": false,
        "default_value": "restart",
        "importance": "LOW",
        "documentation": "The action that Connect should take on the connector when changes in external configuration providers result in a change in the connector's configuration properties. A value of 'none' indicates that Connect will do nothing. A value of 'restart' indicates that Connect should restart/reload the connector with the updated configuration properties.The restart may actually be scheduled in the future if the external configuration provider indicates that a configuration value will expire in the future.",
        "group": "Common",
        "width": "MEDIUM",
        "display_name": "Reload Action",
        "dependents": [],
        "order": 9
      },
      "value": {
        "name": "config.action.reload",
        "value": "restart",
        "recommended_values": [],
        "errors": [],
        "visible": true
      }
    },
    {
      "definition": {
        "name": "errors.retry.timeout",
        "type": "LONG",
        "required": false,
        "default_value": "0",
        "importance": "MEDIUM",
        "documentation": "The maximum duration in milliseconds that a failed operation will be reattempted. The default is 0, which means no retries will be attempted. Use -1 for infinite retries.",
        "group": "Error Handling",
        "width": "MEDIUM",
        "display_name": "Retry Timeout for Errors",
        "dependents": [],
        "order": 1
      },
      "value": {
        "name": "errors.retry.timeout",
        "value": "0",
        "recommended_values": [],
        "errors": [],
        "visible": true
      }
    },
    {
      "definition": {
        "name": "errors.retry.delay.max.ms",
        "type": "LONG",
        "required": false,
        "default_value": "60000",
        "importance": "MEDIUM",
        "documentation": "The maximum duration in milliseconds between consecutive retry attempts. Jitter will be added to the delay once this limit is reached to prevent thundering herd issues.",
        "group": "Error Handling",
        "width": "MEDIUM",
        "display_name": "Maximum Delay Between Retries for Errors",
        "dependents": [],
        "order": 2
      },
      "value": {
        "name": "errors.retry.delay.max.ms",
        "value": "60000",
        "recommended_values": [],
        "errors": [],
        "visible": true
      }
    },
    {
      "definition": {
        "name": "errors.tolerance",
        "type": "STRING",
        "required": false,
        "default_value": "none",
        "importance": "MEDIUM",
        "documentation": "Behavior for tolerating errors during connector operation. 'none' is the default value and signals that any error will result in an immediate connector task failure; 'all' changes the behavior to skip over problematic records.",
        "group": "Error Handling",
        "width": "SHORT",
        "display_name": "Error Tolerance",
        "dependents": [],
        "order": 3
      },
      "value": {
        "name": "errors.tolerance",
        "value": "none",
        "recommended_values": [],
        "errors": [],
        "visible": true
      }
    },
    {
      "definition": {
        "name": "errors.log.enable",
        "type": "BOOLEAN",
        "required": false,
        "default_value": "false",
        "importance": "MEDIUM",
        "documentation": "If true, write each error and the details of the failed operation and problematic record to the Connect application log. This is 'false' by default, so that only errors that are not tolerated are reported.",
        "group": "Error Handling",
        "width": "SHORT",
        "display_name": "Log Errors",
        "dependents": [],
        "order": 4
      },
      "value": {
        "name": "errors.log.enable",
        "value": "false",
        "recommended_values": [],
        "errors": [],
        "visible": true
      }
    },
    {
      "definition": {
        "name": "errors.log.include.messages",
        "type": "BOOLEAN",
        "required": false,
        "default_value": "false",
        "importance": "MEDIUM",
        "documentation": "Whether to include in the log the Connect record that resulted in a failure.For sink records, the topic, partition, offset, and timestamp will be logged. For source records, the key and value (and their schemas), all headers, and the timestamp, Kafka topic, Kafka partition, source partition, and source offset will be logged. This is 'false' by default, which will prevent record keys, values, and headers from being written to log files.",
        "group": "Error Handling",
        "width": "SHORT",
        "display_name": "Log Error Details",
        "dependents": [],
        "order": 5
      },
      "value": {
        "name": "errors.log.include.messages",
        "value": "false",
        "recommended_values": [],
        "errors": [],
        "visible": true
      }
    },
    {
      "definition": {
        "name": "topic.creation.groups",
        "type": "LIST",
        "required": false,
        "default_value": "",
        "importance": "LOW",
        "documentation": "Groups of configurations for topics created by source connectors",
        "group": "Topic Creation",
        "width": "LONG",
        "display_name": "Topic Creation Groups",
        "dependents": [],
        "order": 1
      },
      "value": {
        "name": "topic.creation.groups",
        "value": "",
        "recommended_values": [],
        "errors": [],
        "visible": true
      }
    },
    {
      "definition": {
        "name": "camel.source.url",
        "type": "STRING",
        "required": false,
        "default_value": null,
        "importance": "HIGH",
        "documentation": "The camel url to configure the source. If this is set camel.source.component and all the properties starting with camel.source.endpoint..<camel.source.component value> are ignored.",
        "group": null,
        "width": "NONE",
        "display_name": "camel.source.url",
        "dependents": [],
        "order": -1
      },
      "value": {
        "name": "camel.source.url",
        "value": null,
        "recommended_values": [],
        "errors": [],
        "visible": true
      }
    },
    {
      "definition": {
        "name": "camel.source.unmarshal",
        "type": "STRING",
        "required": false,
        "default_value": null,
        "importance": "HIGH",
        "documentation": "The camel dataformat name to use to unmarshal data from the source",
        "group": null,
        "width": "NONE",
        "display_name": "camel.source.unmarshal",
        "dependents": [],
        "order": -1
      },
      "value": {
        "name": "camel.source.unmarshal",
        "value": null,
        "recommended_values": [],
        "errors": [],
        "visible": true
      }
    },
    {
      "definition": {
        "name": "camel.source.marshal",
        "type": "STRING",
        "required": false,
        "default_value": null,
        "importance": "HIGH",
        "documentation": "The camel dataformat name to use to unmarshal data to the topic",
        "group": null,
        "width": "NONE",
        "display_name": "camel.source.marshal",
        "dependents": [],
        "order": -1
      },
      "value": {
        "name": "camel.source.marshal",
        "value": null,
        "recommended_values": [],
        "errors": [],
        "visible": true
      }
    },
    {
      "definition": {
        "name": "topics",
        "type": "STRING",
        "required": false,
        "default_value": "test",
        "importance": "HIGH",
        "documentation": "A list of topics to use as output for this connector",
        "group": null,
        "width": "NONE",
        "display_name": "topics",
        "dependents": [],
        "order": -1
      },
      "value": {
        "name": "topics",
        "value": "test",
        "recommended_values": [],
        "errors": [],
        "visible": true
      }
    },
    {
      "definition": {
        "name": "camel.source.maxBatchPollSize",
        "type": "LONG",
        "required": false,
        "default_value": "1000",
        "importance": "MEDIUM",
        "documentation": "The max number of messages retrieved in a single poll()",
        "group": null,
        "width": "NONE",
        "display_name": "camel.source.maxBatchPollSize",
        "dependents": [],
        "order": -1
      },
      "value": {
        "name": "camel.source.maxBatchPollSize",
        "value": "1000",
        "recommended_values": [],
        "errors": [],
        "visible": true
      }
    },
    {
      "definition": {
        "name": "camel.source.maxPollDuration",
        "type": "LONG",
        "required": false,
        "default_value": "1000",
        "importance": "MEDIUM",
        "documentation": "The maximum time in milliseconds spent in a single call to poll()",
        "group": null,
        "width": "NONE",
        "display_name": "camel.source.maxPollDuration",
        "dependents": [],
        "order": -1
      },
      "value": {
        "name": "camel.source.maxPollDuration",
        "value": "1000",
        "recommended_values": [],
        "errors": [],
        "visible": true
      }
    },
    {
      "definition": {
        "name": "camel.source.maxNotCommittedRecords",
        "type": "INT",
        "required": false,
        "default_value": "1024",
        "importance": "MEDIUM",
        "documentation": "The maximum number of non committed kafka connect records that can be tolerated before stop polling new records (rounded to the next power of 2) with a minimum of 4.",
        "group": null,
        "width": "NONE",
        "display_name": "camel.source.maxNotCommittedRecords",
        "dependents": [],
        "order": -1
      },
      "value": {
        "name": "camel.source.maxNotCommittedRecords",
        "value": "1024",
        "recommended_values": [],
        "errors": [],
        "visible": true
      }
    },
    {
      "definition": {
        "name": "camel.source.pollingConsumerQueueSize",
        "type": "LONG",
        "required": false,
        "default_value": "1000",
        "importance": "MEDIUM",
        "documentation": "The queue size for the internal hand-off queue between the polling consumer, and producers sending data into the queue.",
        "group": null,
        "width": "NONE",
        "display_name": "camel.source.pollingConsumerQueueSize",
        "dependents": [],
        "order": -1
      },
      "value": {
        "name": "camel.source.pollingConsumerQueueSize",
        "value": "1000",
        "recommended_values": [],
        "errors": [],
        "visible": true
      }
    },
    {
      "definition": {
        "name": "camel.source.pollingConsumerBlockTimeout",
        "type": "LONG",
        "required": false,
        "default_value": "0",
        "importance": "MEDIUM",
        "documentation": "To use a timeout (in milliseconds) when the producer is blocked if the internal queue is full. If the value is 0 or negative then no timeout is in use.",
        "group": null,
        "width": "NONE",
        "display_name": "camel.source.pollingConsumerBlockTimeout",
        "dependents": [],
        "order": -1
      },
      "value": {
        "name": "camel.source.pollingConsumerBlockTimeout",
        "value": "0",
        "recommended_values": [],
        "errors": [],
        "visible": true
      }
    },
    {
      "definition": {
        "name": "camel.source.pollingConsumerBlockWhenFull",
        "type": "BOOLEAN",
        "required": false,
        "default_value": "true",
        "importance": "MEDIUM",
        "documentation": "Whether to block any producer if the internal queue is full.",
        "group": null,
        "width": "NONE",
        "display_name": "camel.source.pollingConsumerBlockWhenFull",
        "dependents": [],
        "order": -1
      },
      "value": {
        "name": "camel.source.pollingConsumerBlockWhenFull",
        "value": "true",
        "recommended_values": [],
        "errors": [],
        "visible": true
      }
    },
    {
      "definition": {
        "name": "camel.source.camelMessageHeaderKey",
        "type": "STRING",
        "required": false,
        "default_value": null,
        "importance": "MEDIUM",
        "documentation": "The name of a camel message header containing an unique key that can be used as a Kafka message key. If this is not specified, then the Kafka message will not have a key.",
        "group": null,
        "width": "NONE",
        "display_name": "camel.source.camelMessageHeaderKey",
        "dependents": [],
        "order": -1
      },
      "value": {
        "name": "camel.source.camelMessageHeaderKey",
        "value": null,
        "recommended_values": [],
        "errors": [],
        "visible": true
      }
    },
    {
      "definition": {
        "name": "camel.source.component",
        "type": "STRING",
        "required": false,
        "default_value": null,
        "importance": "MEDIUM",
        "documentation": "The camel component to use. This is normally set by default for you. It is ignored if camel.source.url is set.",
        "group": null,
        "width": "NONE",
        "display_name": "camel.source.component",
        "dependents": [],
        "order": -1
      },
      "value": {
        "name": "camel.source.component",
        "value": null,
        "recommended_values": [],
        "errors": [],
        "visible": true
      }
    },
    {
      "definition": {
        "name": "camel.source.contentLogLevel",
        "type": "STRING",
        "required": false,
        "default_value": "OFF",
        "importance": "HIGH",
        "documentation": "Log level for the record's content (default: OFF). Valid values: TRACE, DEBUG, INFO, WARN, ERROR, OFF.",
        "group": null,
        "width": "NONE",
        "display_name": "camel.source.contentLogLevel",
        "dependents": [],
        "order": -1
      },
      "value": {
        "name": "camel.source.contentLogLevel",
        "value": "OFF",
        "recommended_values": [],
        "errors": [],
        "visible": true
      }
    },
    {
      "definition": {
        "name": "camel.beans.aggregate",
        "type": "STRING",
        "required": false,
        "default_value": null,
        "importance": "MEDIUM",
        "documentation": "A reference to an aggregate bean, in the form of #class:",
        "group": null,
        "width": "NONE",
        "display_name": "camel.beans.aggregate",
        "dependents": [],
        "order": -1
      },
      "value": {
        "name": "camel.beans.aggregate",
        "value": null,
        "recommended_values": [],
        "errors": [],
        "visible": true
      }
    },
    {
      "definition": {
        "name": "camel.aggregation.size",
        "type": "INT",
        "required": false,
        "default_value": "10",
        "importance": "MEDIUM",
        "documentation": "The size of the aggregation, to be used in combination with camel.beans.aggregate",
        "group": null,
        "width": "NONE",
        "display_name": "camel.aggregation.size",
        "dependents": [],
        "order": -1
      },
      "value": {
        "name": "camel.aggregation.size",
        "value": "10",
        "recommended_values": [],
        "errors": [],
        "visible": true
      }
    },
    {
      "definition": {
        "name": "camel.aggregation.timeout",
        "type": "LONG",
        "required": false,
        "default_value": "500",
        "importance": "MEDIUM",
        "documentation": "The timeout of the aggregation, to be used in combination with camel.beans.aggregate",
        "group": null,
        "width": "NONE",
        "display_name": "camel.aggregation.timeout",
        "dependents": [],
        "order": -1
      },
      "value": {
        "name": "camel.aggregation.timeout",
        "value": "500",
        "recommended_values": [],
        "errors": [],
        "visible": true
      }
    },
    {
      "definition": {
        "name": "camel.error.handler",
        "type": "STRING",
        "required": false,
        "default_value": "default",
        "importance": "LOW",
        "documentation": "The error handler to use: possible value are 'no' or 'default'",
        "group": null,
        "width": "NONE",
        "display_name": "camel.error.handler",
        "dependents": [],
        "order": -1
      },
      "value": {
        "name": "camel.error.handler",
        "value": "default",
        "recommended_values": [],
        "errors": [],
        "visible": true
      }
    },
    {
      "definition": {
        "name": "camel.error.handler.max.redeliveries",
        "type": "INT",
        "required": false,
        "default_value": "0",
        "importance": "MEDIUM",
        "documentation": "The maximum redeliveries to be use in case of Default Error Handler",
        "group": null,
        "width": "NONE",
        "display_name": "camel.error.handler.max.redeliveries",
        "dependents": [],
        "order": -1
      },
      "value": {
        "name": "camel.error.handler.max.redeliveries",
        "value": "0",
        "recommended_values": [],
        "errors": [],
        "visible": true
      }
    },
    {
      "definition": {
        "name": "camel.error.handler.redelivery.delay",
        "type": "LONG",
        "required": false,
        "default_value": "1000",
        "importance": "MEDIUM",
        "documentation": "The initial redelivery delay in milliseconds in case of Default Error Handler",
        "group": null,
        "width": "NONE",
        "display_name": "camel.error.handler.redelivery.delay",
        "dependents": [],
        "order": -1
      },
      "value": {
        "name": "camel.error.handler.redelivery.delay",
        "value": "1000",
        "recommended_values": [],
        "errors": [],
        "visible": true
      }
    },
    {
      "definition": {
        "name": "camel.idempotency.enabled",
        "type": "BOOLEAN",
        "required": false,
        "default_value": "false",
        "importance": "LOW",
        "documentation": "If idempotency must be enabled or not",
        "group": null,
        "width": "NONE",
        "display_name": "camel.idempotency.enabled",
        "dependents": [],
        "order": -1
      },
      "value": {
        "name": "camel.idempotency.enabled",
        "value": "false",
        "recommended_values": [],
        "errors": [],
        "visible": true
      }
    },
    {
      "definition": {
        "name": "camel.idempotency.expression.type",
        "type": "STRING",
        "required": false,
        "default_value": "body",
        "importance": "LOW",
        "documentation": "How the idempotency will be evaluated: possible values are body and header",
        "group": null,
        "width": "NONE",
        "display_name": "camel.idempotency.expression.type",
        "dependents": [],
        "order": -1
      },
      "value": {
        "name": "camel.idempotency.expression.type",
        "value": "body",
        "recommended_values": [],
        "errors": [],
        "visible": true
      }
    },
    {
      "definition": {
        "name": "camel.idempotency.expression.header",
        "type": "STRING",
        "required": false,
        "default_value": null,
        "importance": "LOW",
        "documentation": "The header name that will be evaluated in case of camel.idempotency.expression.type equals to header",
        "group": null,
        "width": "NONE",
        "display_name": "camel.idempotency.expression.header",
        "dependents": [],
        "order": -1
      },
      "value": {
        "name": "camel.idempotency.expression.header",
        "value": null,
        "recommended_values": [],
        "errors": [],
        "visible": true
      }
    },
    {
      "definition": {
        "name": "camel.idempotency.memory.dimension",
        "type": "INT",
        "required": false,
        "default_value": "100",
        "importance": "LOW",
        "documentation": "The Memory dimension of the in memory idempotent Repository",
        "group": null,
        "width": "NONE",
        "display_name": "camel.idempotency.memory.dimension",
        "dependents": [],
        "order": -1
      },
      "value": {
        "name": "camel.idempotency.memory.dimension",
        "value": "100",
        "recommended_values": [],
        "errors": [],
        "visible": true
      }
    },
    {
      "definition": {
        "name": "camel.idempotency.repository.type",
        "type": "STRING",
        "required": false,
        "default_value": "memory",
        "importance": "LOW",
        "documentation": "The idempotent repository type to use, possible values are memory and kafka",
        "group": null,
        "width": "NONE",
        "display_name": "camel.idempotency.repository.type",
        "dependents": [],
        "order": -1
      },
      "value": {
        "name": "camel.idempotency.repository.type",
        "value": "memory",
        "recommended_values": [],
        "errors": [],
        "visible": true
      }
    },
    {
      "definition": {
        "name": "camel.idempotency.kafka.topic",
        "type": "STRING",
        "required": false,
        "default_value": "kafka_idempotent_repository",
        "importance": "LOW",
        "documentation": "The Kafka topic name to use for the idempotent repository",
        "group": null,
        "width": "NONE",
        "display_name": "camel.idempotency.kafka.topic",
        "dependents": [],
        "order": -1
      },
      "value": {
        "name": "camel.idempotency.kafka.topic",
        "value": "kafka_idempotent_repository",
        "recommended_values": [],
        "errors": [],
        "visible": true
      }
    },
    {
      "definition": {
        "name": "camel.idempotency.kafka.bootstrap.servers",
        "type": "STRING",
        "required": false,
        "default_value": "localhost:9092",
        "importance": "LOW",
        "documentation": "A comma-separated list of host and port pairs that are the addresses of the Kafka brokers where the idempotent repository should live",
        "group": null,
        "width": "NONE",
        "display_name": "camel.idempotency.kafka.bootstrap.servers",
        "dependents": [],
        "order": -1
      },
      "value": {
        "name": "camel.idempotency.kafka.bootstrap.servers",
        "value": "localhost:9092",
        "recommended_values": [],
        "errors": [],
        "visible": true
      }
    },
    {
      "definition": {
        "name": "camel.idempotency.kafka.max.cache.size",
        "type": "INT",
        "required": false,
        "default_value": "1000",
        "importance": "LOW",
        "documentation": "Sets the maximum size of the local key cache",
        "group": null,
        "width": "NONE",
        "display_name": "camel.idempotency.kafka.max.cache.size",
        "dependents": [],
        "order": -1
      },
      "value": {
        "name": "camel.idempotency.kafka.max.cache.size",
        "value": "1000",
        "recommended_values": [],
        "errors": [],
        "visible": true
      }
    },
    {
      "definition": {
        "name": "camel.idempotency.kafka.poll.duration.ms",
        "type": "INT",
        "required": false,
        "default_value": "100",
        "importance": "LOW",
        "documentation": "Sets the poll duration (in milliseconds) of the Kafka consumer",
        "group": null,
        "width": "NONE",
        "display_name": "camel.idempotency.kafka.poll.duration.ms",
        "dependents": [],
        "order": -1
      },
      "value": {
        "name": "camel.idempotency.kafka.poll.duration.ms",
        "value": "100",
        "recommended_values": [],
        "errors": [],
        "visible": true
      }
    },
    {
      "definition": {
        "name": "camel.remove.headers.pattern",
        "type": "STRING",
        "required": false,
        "default_value": "",
        "importance": "MEDIUM",
        "documentation": "The pattern of the headers we want to exclude from the exchange",
        "group": null,
        "width": "NONE",
        "display_name": "camel.remove.headers.pattern",
        "dependents": [],
        "order": -1
      },
      "value": {
        "name": "camel.remove.headers.pattern",
        "value": "",
        "recommended_values": [],
        "errors": [],
        "visible": true
      }
    },
    {
      "definition": {
        "name": "camel.map.properties",
        "type": "BOOLEAN",
        "required": false,
        "default_value": "true",
        "importance": "MEDIUM",
        "documentation": "If set to true, the connector will transform the exchange properties into kafka headers.",
        "group": null,
        "width": "NONE",
        "display_name": "camel.map.properties",
        "dependents": [],
        "order": -1
      },
      "value": {
        "name": "camel.map.properties",
        "value": "true",
        "recommended_values": [],
        "errors": [],
        "visible": true
      }
    },
    {
      "definition": {
        "name": "camel.map.headers",
        "type": "BOOLEAN",
        "required": false,
        "default_value": "true",
        "importance": "MEDIUM",
        "documentation": "If set to true, the connector will transform the camel exchange headers into kafka headers.",
        "group": null,
        "width": "NONE",
        "display_name": "camel.map.headers",
        "dependents": [],
        "order": -1
      },
      "value": {
        "name": "camel.map.headers",
        "value": "true",
        "recommended_values": [],
        "errors": [],
        "visible": true
      }
    },
    {
      "definition": {
        "name": "camel.kamelet.aws-ddb-streams-source.table",
        "type": "STRING",
        "required": false,
        "default_value": null,
        "importance": "HIGH",
        "documentation": "The name of the DynamoDB table.",
        "group": null,
        "width": "NONE",
        "display_name": "camel.kamelet.aws-ddb-streams-source.table",
        "dependents": [],
        "order": -1
      },
      "value": {
        "name": "camel.kamelet.aws-ddb-streams-source.table",
        "value": null,
        "recommended_values": [],
        "errors": [],
        "visible": true
      }
    },
    {
      "definition": {
        "name": "camel.kamelet.aws-ddb-streams-source.accessKey",
        "type": "PASSWORD",
        "required": false,
        "default_value": null,
        "importance": "MEDIUM",
        "documentation": "The access key obtained from AWS.",
        "group": null,
        "width": "NONE",
        "display_name": "camel.kamelet.aws-ddb-streams-source.accessKey",
        "dependents": [],
        "order": -1
      },
      "value": {
        "name": "camel.kamelet.aws-ddb-streams-source.accessKey",
        "value": null,
        "recommended_values": [],
        "errors": [],
        "visible": true
      }
    },
    {
      "definition": {
        "name": "camel.kamelet.aws-ddb-streams-source.secretKey",
        "type": "PASSWORD",
        "required": false,
        "default_value": null,
        "importance": "MEDIUM",
        "documentation": "The secret key obtained from AWS.",
        "group": null,
        "width": "NONE",
        "display_name": "camel.kamelet.aws-ddb-streams-source.secretKey",
        "dependents": [],
        "order": -1
      },
      "value": {
        "name": "camel.kamelet.aws-ddb-streams-source.secretKey",
        "value": null,
        "recommended_values": [],
        "errors": [],
        "visible": true
      }
    },
    {
      "definition": {
        "name": "camel.kamelet.aws-ddb-streams-source.region",
        "type": "STRING",
        "required": false,
        "default_value": null,
        "importance": "HIGH",
        "documentation": "The AWS region to access.",
        "group": null,
        "width": "NONE",
        "display_name": "camel.kamelet.aws-ddb-streams-source.region",
        "dependents": [],
        "order": -1
      },
      "value": {
        "name": "camel.kamelet.aws-ddb-streams-source.region",
        "value": null,
        "recommended_values": [],
        "errors": [],
        "visible": true
      }
    },
    {
      "definition": {
        "name": "camel.kamelet.aws-ddb-streams-source.streamIteratorType",
        "type": "STRING",
        "required": false,
        "default_value": "FROM_LATEST",
        "importance": "MEDIUM",
        "documentation": "Defines where in the DynamoDB stream to start getting records. There are two enums and the value can be one of FROM_LATEST and FROM_START. Note that using FROM_START can cause a significant delay before the stream has caught up to real-time.",
        "group": null,
        "width": "NONE",
        "display_name": "camel.kamelet.aws-ddb-streams-source.streamIteratorType",
        "dependents": [],
        "order": -1
      },
      "value": {
        "name": "camel.kamelet.aws-ddb-streams-source.streamIteratorType",
        "value": "FROM_LATEST",
        "recommended_values": [],
        "errors": [],
        "visible": true
      }
    },
    {
      "definition": {
        "name": "camel.kamelet.aws-ddb-streams-source.useDefaultCredentialsProvider",
        "type": "BOOLEAN",
        "required": false,
        "default_value": "false",
        "importance": "MEDIUM",
        "documentation": "If true, the DynamoDB client loads credentials through a default credentials provider. If false, it uses the basic authentication method (access key and secret key).",
        "group": null,
        "width": "NONE",
        "display_name": "camel.kamelet.aws-ddb-streams-source.useDefaultCredentialsProvider",
        "dependents": [],
        "order": -1
      },
      "value": {
        "name": "camel.kamelet.aws-ddb-streams-source.useDefaultCredentialsProvider",
        "value": "false",
        "recommended_values": [],
        "errors": [],
        "visible": true
      }
    },
    {
      "definition": {
        "name": "camel.kamelet.aws-ddb-streams-source.uriEndpointOverride",
        "type": "STRING",
        "required": false,
        "default_value": null,
        "importance": "MEDIUM",
        "documentation": "The overriding endpoint URI. To use this option, you must also select the `overrideEndpoint` option.",
        "group": null,
        "width": "NONE",
        "display_name": "camel.kamelet.aws-ddb-streams-source.uriEndpointOverride",
        "dependents": [],
        "order": -1
      },
      "value": {
        "name": "camel.kamelet.aws-ddb-streams-source.uriEndpointOverride",
        "value": null,
        "recommended_values": [],
        "errors": [],
        "visible": true
      }
    },
    {
      "definition": {
        "name": "camel.kamelet.aws-ddb-streams-source.overrideEndpoint",
        "type": "BOOLEAN",
        "required": false,
        "default_value": "false",
        "importance": "MEDIUM",
        "documentation": "Select this option to override the endpoint URI. To use this option, you must also provide a URI for the `uriEndpointOverride` option.",
        "group": null,
        "width": "NONE",
        "display_name": "camel.kamelet.aws-ddb-streams-source.overrideEndpoint",
        "dependents": [],
        "order": -1
      },
      "value": {
        "name": "camel.kamelet.aws-ddb-streams-source.overrideEndpoint",
        "value": "false",
        "recommended_values": [],
        "errors": [],
        "visible": true
      }
    },
    {
      "definition": {
        "name": "camel.kamelet.aws-ddb-streams-source.delay",
        "type": "INT",
        "required": false,
        "default_value": "500",
        "importance": "MEDIUM",
        "documentation": "The number of milliseconds before the next poll from the database.",
        "group": null,
        "width": "NONE",
        "display_name": "camel.kamelet.aws-ddb-streams-source.delay",
        "dependents": [],
        "order": -1
      },
      "value": {
        "name": "camel.kamelet.aws-ddb-streams-source.delay",
        "value": "500",
        "recommended_values": [],
        "errors": [],
        "visible": true
      }
    }
  ]
}
