{
	"variables": [],
	"info": {
		"name": "Task Manager",
		"_postman_id": "49379e06-9869-49d9-0474-5573b6dda3d5",
		"description": "",
		"schema": "https://schema.getpostman.com/json/collection/v2.0.0/collection.json"
	},
	"item": [
		{
			"name": "List processes",
			"request": {
				"url": {
					"raw": "http://localhost:8080/task-manager/processes?property=CREATION_TIME&direction=DESC",
					"protocol": "http",
					"host": [
						"localhost"
					],
					"port": "8080",
					"path": [
						"task-manager",
						"processes"
					],
					"query": [
						{
							"key": "property",
							"value": "CREATION_TIME",
							"equals": true,
							"description": ""
						},
						{
							"key": "direction",
							"value": "DESC",
							"equals": true,
							"description": ""
						}
					],
					"variable": []
				},
				"method": "GET",
				"header": [
					{
						"key": "Accept",
						"value": "application/json",
						"description": ""
					},
					{
						"key": "Content-Type",
						"value": "application/json",
						"description": ""
					}
				],
				"body": {},
				"description": ""
			},
			"response": []
		},
		{
			"name": "Add process",
			"request": {
				"url": "http://localhost:8080/task-manager/process",
				"method": "POST",
				"header": [
					{
						"key": "Accept",
						"value": "application/json",
						"description": ""
					},
					{
						"key": "Content-Type",
						"value": "application/json",
						"description": ""
					}
				],
				"body": {
					"mode": "raw",
					"raw": "{\n\t\"id\": \"pid-1\",\n\t\"priority\": \"LOW\"\n}"
				},
				"description": ""
			},
			"response": []
		},
		{
			"name": "Kill process",
			"request": {
				"url": "http://localhost:8080/task-manager/processes/{{id}}",
				"method": "DELETE",
				"header": [
					{
						"key": "Accept",
						"value": "application/json",
						"description": ""
					},
					{
						"key": "Content-Type",
						"value": "application/json",
						"description": ""
					}
				],
				"body": {
					"mode": "raw",
					"raw": ""
				},
				"description": ""
			},
			"response": []
		},
		{
			"name": "Kill processes by priority",
			"request": {
				"url": {
					"raw": "http://localhost:8080/task-manager/processes?priority=LOW",
					"protocol": "http",
					"host": [
						"localhost"
					],
					"port": "8080",
					"path": [
						"task-manager",
						"processes"
					],
					"query": [
						{
							"key": "priority",
							"value": "LOW",
							"equals": true,
							"description": ""
						}
					],
					"variable": []
				},
				"method": "DELETE",
				"header": [
					{
						"key": "Accept",
						"value": "application/json",
						"description": ""
					},
					{
						"key": "Content-Type",
						"value": "application/json",
						"description": ""
					}
				],
				"body": {
					"mode": "raw",
					"raw": ""
				},
				"description": ""
			},
			"response": []
		},
		{
			"name": "Kill all processes",
			"request": {
				"url": "http://localhost:8080/task-manager/processes",
				"method": "DELETE",
				"header": [
					{
						"key": "Accept",
						"value": "application/json",
						"description": ""
					},
					{
						"key": "Content-Type",
						"value": "application/json",
						"description": ""
					}
				],
				"body": {
					"mode": "raw",
					"raw": ""
				},
				"description": ""
			},
			"response": []
		}
	]
}