^I:\DOCUMENTS\GIT\QIR\GEDGAME_VS2017\PROJECTS\DIRECTXTEX\DIRECTXTEX\BIN\DESKTOP_2017\X64\DEBUG\DIRECTXTEX.LIB|I:\DOCUMENTS\GIT\QIR\GEDGAME_VS2017\PROJECTS\DIRECTXTEX\TEXASSEMBLE\BIN\DESKTOP_2017\X64\DEBUG\TEXASSEMBLE.OBJ|I:\DOCUMENTS\GIT\QIR\GEDGAME_VS2017\PROJECTS\DIRECTXTEX\TEXASSEMBLE\BIN\DESKTOP_2017\X64\DEBUG\TEXASSEMBLE.RES
I:\DOCUMENTS\GIT\QIR\GEDGAME_VS2017\PROJECTS\DIRECTXTEX\TEXASSEMBLE\BIN\DESKTOP_2017\X64\DEBUG\TEXASSEMBLE.ILK
I:\DOCUMENTS\GIT\QIR\GEDGAME_VS2017\PROJECTS\DIRECTXTEX\TEXASSEMBLE\BIN\DESKTOP_2017\X64\DEBUG\TEXASSEMBLE.EXE
I:\DOCUMENTS\GIT\QIR\GEDGAME_VS2017\PROJECTS\DIRECTXTEX\TEXASSEMBLE\BIN\DESKTOP_2017\X64\DEBUG\TEXASSEMBLE.PDB
