^I:\DOCUMENTS\GIT\QIR\GEDGAME_VS2017\PROJECTS\TERRAINGENERATOR\TERRAINGENERATOR.CPP
I:\DOCUMENTS\GIT\QIR\GEDGAME_VS2017\PROJECTS\TERRAINGENERATOR\X64\RELEASE\VC141.PDB
I:\DOCUMENTS\GIT\QIR\GEDGAME_VS2017\PROJECTS\TERRAINGENERATOR\X64\RELEASE\TERRAINGENERATOR.OBJ
