^I:\DOCUMENTS\GIT\QIR\GEDGAME_VS2017\PROJECTS\GAME\SHADER\GAME.FX
/nologo /E"main" /T fx_5_0 /Fo "I:\Documents\git\qir\GEDGame_VS2017\x64\Debug\shader/game.fxo" /Od /Zi I:\DOCUMENTS\GIT\QIR\GEDGAME_VS2017\PROJECTS\GAME\SHADER\GAME.FX
^I:\DOCUMENTS\GIT\QIR\GEDGAME_VS2017\PROJECTS\GAME\SHADER\HUD.FX
/nologo /E"main" /T fx_5_0 /Fo "I:\Documents\git\qir\GEDGame_VS2017\x64\Debug\shader/hud.fxo" /Od /Zi I:\DOCUMENTS\GIT\QIR\GEDGAME_VS2017\PROJECTS\GAME\SHADER\HUD.FX
^I:\DOCUMENTS\GIT\QIR\GEDGAME_VS2017\PROJECTS\GAME\SHADER\SPRITE.FX
/nologo /E"main" /T fx_5_0 /Fo "I:\Documents\git\qir\GEDGame_VS2017\x64\Debug\shader/sprite.fxo" /Od /Zi I:\DOCUMENTS\GIT\QIR\GEDGAME_VS2017\PROJECTS\GAME\SHADER\SPRITE.FX
