^I:\DOCUMENTS\GIT\QIR\GEDGAME_VS2017\PROJECTS\EFFECTS11\D3DXGLOBAL.CPP
/c /I.\BINARY /I.\INC /Zi /nologo /W4 /WX- /diagnostics:classic /O2 /Oi /D _WIN7_PLATFORM_UPDATE /D WIN32 /D NDEBUG /D _WINDOWS /D _LIB /D D3DXFX_LARGEADDRESS_HANDLE /D _WIN32_WINNT=0x0600 /D _CRT_STDIO_ARBITRARY_WIDE_SPECIFIERS /D _UNICODE /D UNICODE /Gm- /EHsc /MD /GS /Gy /fp:fast /Zc:wchar_t /Zc:forScope /Zc:inline /openmp- /Yc"pchfx.h" /Fp"BIN\DESKTOP_2017_WIN10\X64\RELEASE\EFFECTS11.PCH" /Fo"BIN\DESKTOP_2017_WIN10\X64\RELEASE\\" /Fd"BIN\DESKTOP_2017_WIN10\X64\RELEASE\EFFECTS11.PDB" /Gd /TP /FC   I:\DOCUMENTS\GIT\QIR\GEDGAME_VS2017\PROJECTS\EFFECTS11\D3DXGLOBAL.CPP
^I:\DOCUMENTS\GIT\QIR\GEDGAME_VS2017\PROJECTS\EFFECTS11\EFFECTAPI.CPP
/c /I.\BINARY /I.\INC /Zi /nologo /W4 /WX- /diagnostics:classic /O2 /Oi /D _WIN7_PLATFORM_UPDATE /D WIN32 /D NDEBUG /D _WINDOWS /D _LIB /D D3DXFX_LARGEADDRESS_HANDLE /D _WIN32_WINNT=0x0600 /D _CRT_STDIO_ARBITRARY_WIDE_SPECIFIERS /D _UNICODE /D UNICODE /Gm- /EHsc /MD /GS /Gy /fp:fast /Zc:wchar_t /Zc:forScope /Zc:inline /openmp- /Yu"pchfx.h" /Fp"BIN\DESKTOP_2017_WIN10\X64\RELEASE\EFFECTS11.PCH" /Fo"BIN\DESKTOP_2017_WIN10\X64\RELEASE\\" /Fd"BIN\DESKTOP_2017_WIN10\X64\RELEASE\EFFECTS11.PDB" /Gd /TP /FC   I:\DOCUMENTS\GIT\QIR\GEDGAME_VS2017\PROJECTS\EFFECTS11\EFFECTAPI.CPP
^I:\DOCUMENTS\GIT\QIR\GEDGAME_VS2017\PROJECTS\EFFECTS11\EFFECTLOAD.CPP
/c /I.\BINARY /I.\INC /Zi /nologo /W4 /WX- /diagnostics:classic /O2 /Oi /D _WIN7_PLATFORM_UPDATE /D WIN32 /D NDEBUG /D _WINDOWS /D _LIB /D D3DXFX_LARGEADDRESS_HANDLE /D _WIN32_WINNT=0x0600 /D _CRT_STDIO_ARBITRARY_WIDE_SPECIFIERS /D _UNICODE /D UNICODE /Gm- /EHsc /MD /GS /Gy /fp:fast /Zc:wchar_t /Zc:forScope /Zc:inline /openmp- /Yu"pchfx.h" /Fp"BIN\DESKTOP_2017_WIN10\X64\RELEASE\EFFECTS11.PCH" /Fo"BIN\DESKTOP_2017_WIN10\X64\RELEASE\\" /Fd"BIN\DESKTOP_2017_WIN10\X64\RELEASE\EFFECTS11.PDB" /Gd /TP /FC   I:\DOCUMENTS\GIT\QIR\GEDGAME_VS2017\PROJECTS\EFFECTS11\EFFECTLOAD.CPP
^I:\DOCUMENTS\GIT\QIR\GEDGAME_VS2017\PROJECTS\EFFECTS11\EFFECTNONRUNTIME.CPP
/c /I.\BINARY /I.\INC /Zi /nologo /W4 /WX- /diagnostics:classic /O2 /Oi /D _WIN7_PLATFORM_UPDATE /D WIN32 /D NDEBUG /D _WINDOWS /D _LIB /D D3DXFX_LARGEADDRESS_HANDLE /D _WIN32_WINNT=0x0600 /D _CRT_STDIO_ARBITRARY_WIDE_SPECIFIERS /D _UNICODE /D UNICODE /Gm- /EHsc /MD /GS /Gy /fp:fast /Zc:wchar_t /Zc:forScope /Zc:inline /openmp- /Yu"pchfx.h" /Fp"BIN\DESKTOP_2017_WIN10\X64\RELEASE\EFFECTS11.PCH" /Fo"BIN\DESKTOP_2017_WIN10\X64\RELEASE\\" /Fd"BIN\DESKTOP_2017_WIN10\X64\RELEASE\EFFECTS11.PDB" /Gd /TP /FC   I:\DOCUMENTS\GIT\QIR\GEDGAME_VS2017\PROJECTS\EFFECTS11\EFFECTNONRUNTIME.CPP
^I:\DOCUMENTS\GIT\QIR\GEDGAME_VS2017\PROJECTS\EFFECTS11\EFFECTREFLECTION.CPP
/c /I.\BINARY /I.\INC /Zi /nologo /W4 /WX- /diagnostics:classic /O2 /Oi /D _WIN7_PLATFORM_UPDATE /D WIN32 /D NDEBUG /D _WINDOWS /D _LIB /D D3DXFX_LARGEADDRESS_HANDLE /D _WIN32_WINNT=0x0600 /D _CRT_STDIO_ARBITRARY_WIDE_SPECIFIERS /D _UNICODE /D UNICODE /Gm- /EHsc /MD /GS /Gy /fp:fast /Zc:wchar_t /Zc:forScope /Zc:inline /openmp- /Yu"pchfx.h" /Fp"BIN\DESKTOP_2017_WIN10\X64\RELEASE\EFFECTS11.PCH" /Fo"BIN\DESKTOP_2017_WIN10\X64\RELEASE\\" /Fd"BIN\DESKTOP_2017_WIN10\X64\RELEASE\EFFECTS11.PDB" /Gd /TP /FC   I:\DOCUMENTS\GIT\QIR\GEDGAME_VS2017\PROJECTS\EFFECTS11\EFFECTREFLECTION.CPP
^I:\DOCUMENTS\GIT\QIR\GEDGAME_VS2017\PROJECTS\EFFECTS11\EFFECTRUNTIME.CPP
/c /I.\BINARY /I.\INC /Zi /nologo /W4 /WX- /diagnostics:classic /O2 /Oi /D _WIN7_PLATFORM_UPDATE /D WIN32 /D NDEBUG /D _WINDOWS /D _LIB /D D3DXFX_LARGEADDRESS_HANDLE /D _WIN32_WINNT=0x0600 /D _CRT_STDIO_ARBITRARY_WIDE_SPECIFIERS /D _UNICODE /D UNICODE /Gm- /EHsc /MD /GS /Gy /fp:fast /Zc:wchar_t /Zc:forScope /Zc:inline /openmp- /Yu"pchfx.h" /Fp"BIN\DESKTOP_2017_WIN10\X64\RELEASE\EFFECTS11.PCH" /Fo"BIN\DESKTOP_2017_WIN10\X64\RELEASE\\" /Fd"BIN\DESKTOP_2017_WIN10\X64\RELEASE\EFFECTS11.PDB" /Gd /TP /FC   I:\DOCUMENTS\GIT\QIR\GEDGAME_VS2017\PROJECTS\EFFECTS11\EFFECTRUNTIME.CPP
