^I:\DOCUMENTS\GIT\QIR\GEDGAME_VS2017\PROJECTS\GAME\SRC\CONFIGPARSER.CPP|I:\DOCUMENTS\GIT\QIR\GEDGAME_VS2017\PROJECTS\GAME\SRC\GAME.CPP|I:\DOCUMENTS\GIT\QIR\GEDGAME_VS2017\PROJECTS\GAME\SRC\MESH.CPP|I:\DOCUMENTS\GIT\QIR\GEDGAME_VS2017\PROJECTS\GAME\SRC\SPRITERENDERER.CPP|I:\DOCUMENTS\GIT\QIR\GEDGAME_VS2017\PROJECTS\GAME\SRC\T3D.CPP|I:\DOCUMENTS\GIT\QIR\GEDGAME_VS2017\PROJECTS\GAME\SRC\TERRAIN.CPP
I:\DOCUMENTS\GIT\QIR\GEDGAME_VS2017\PROJECTS\GAME\X64\RELEASE\VC141.PDB
I:\DOCUMENTS\GIT\QIR\GEDGAME_VS2017\PROJECTS\GAME\X64\RELEASE\TERRAIN.OBJ
I:\DOCUMENTS\GIT\QIR\GEDGAME_VS2017\PROJECTS\GAME\X64\RELEASE\T3D.OBJ
I:\DOCUMENTS\GIT\QIR\GEDGAME_VS2017\PROJECTS\GAME\X64\RELEASE\SPRITERENDERER.OBJ
I:\DOCUMENTS\GIT\QIR\GEDGAME_VS2017\PROJECTS\GAME\X64\RELEASE\MESH.OBJ
I:\DOCUMENTS\GIT\QIR\GEDGAME_VS2017\PROJECTS\GAME\X64\RELEASE\GAME.OBJ
I:\DOCUMENTS\GIT\QIR\GEDGAME_VS2017\PROJECTS\GAME\X64\RELEASE\CONFIGPARSER.OBJ
^I:\DOCUMENTS\GIT\QIR\GEDGAME_VS2017\PROJECTS\GAME\SRC\T3D.CPP
I:\DOCUMENTS\GIT\QIR\GEDGAME_VS2017\PROJECTS\GAME\X64\RELEASE\VC141.PDB
^I:\DOCUMENTS\GIT\QIR\GEDGAME_VS2017\PROJECTS\GAME\SRC\CONFIGPARSER.CPP|I:\DOCUMENTS\GIT\QIR\GEDGAME_VS2017\PROJECTS\GAME\SRC\GAME.CPP|I:\DOCUMENTS\GIT\QIR\GEDGAME_VS2017\PROJECTS\GAME\SRC\SPRITERENDERER.CPP|I:\DOCUMENTS\GIT\QIR\GEDGAME_VS2017\PROJECTS\GAME\SRC\TERRAIN.CPP
I:\DOCUMENTS\GIT\QIR\GEDGAME_VS2017\PROJECTS\GAME\X64\RELEASE\VC141.PDB
I:\DOCUMENTS\GIT\QIR\GEDGAME_VS2017\PROJECTS\GAME\X64\RELEASE\TERRAIN.OBJ
I:\DOCUMENTS\GIT\QIR\GEDGAME_VS2017\PROJECTS\GAME\X64\RELEASE\SPRITERENDERER.OBJ
I:\DOCUMENTS\GIT\QIR\GEDGAME_VS2017\PROJECTS\GAME\X64\RELEASE\GAME.OBJ
I:\DOCUMENTS\GIT\QIR\GEDGAME_VS2017\PROJECTS\GAME\X64\RELEASE\CONFIGPARSER.OBJ
^I:\DOCUMENTS\GIT\QIR\GEDGAME_VS2017\PROJECTS\GAME\SRC\CONFIGPARSER.CPP|I:\DOCUMENTS\GIT\QIR\GEDGAME_VS2017\PROJECTS\GAME\SRC\GAME.CPP|I:\DOCUMENTS\GIT\QIR\GEDGAME_VS2017\PROJECTS\GAME\SRC\HUDRENDERER.CPP|I:\DOCUMENTS\GIT\QIR\GEDGAME_VS2017\PROJECTS\GAME\SRC\MESH.CPP|I:\DOCUMENTS\GIT\QIR\GEDGAME_VS2017\PROJECTS\GAME\SRC\SPRITERENDERER.CPP|I:\DOCUMENTS\GIT\QIR\GEDGAME_VS2017\PROJECTS\GAME\SRC\TERRAIN.CPP
I:\DOCUMENTS\GIT\QIR\GEDGAME_VS2017\PROJECTS\GAME\X64\RELEASE\VC141.PDB
I:\DOCUMENTS\GIT\QIR\GEDGAME_VS2017\PROJECTS\GAME\X64\RELEASE\TERRAIN.OBJ
I:\DOCUMENTS\GIT\QIR\GEDGAME_VS2017\PROJECTS\GAME\X64\RELEASE\SPRITERENDERER.OBJ
I:\DOCUMENTS\GIT\QIR\GEDGAME_VS2017\PROJECTS\GAME\X64\RELEASE\MESH.OBJ
I:\DOCUMENTS\GIT\QIR\GEDGAME_VS2017\PROJECTS\GAME\X64\RELEASE\HUDRENDERER.OBJ
I:\DOCUMENTS\GIT\QIR\GEDGAME_VS2017\PROJECTS\GAME\X64\RELEASE\GAME.OBJ
I:\DOCUMENTS\GIT\QIR\GEDGAME_VS2017\PROJECTS\GAME\X64\RELEASE\CONFIGPARSER.OBJ
^I:\DOCUMENTS\GIT\QIR\GEDGAME_VS2017\PROJECTS\GAME\SRC\CONFIGPARSER.CPP
I:\DOCUMENTS\GIT\QIR\GEDGAME_VS2017\PROJECTS\GAME\X64\RELEASE\VC141.PDB
^I:\DOCUMENTS\GIT\QIR\GEDGAME_VS2017\PROJECTS\GAME\SRC\HUDRENDERER.CPP
I:\DOCUMENTS\GIT\QIR\GEDGAME_VS2017\PROJECTS\GAME\X64\RELEASE\VC141.PDB
^I:\DOCUMENTS\GIT\QIR\GEDGAME_VS2017\PROJECTS\GAME\SRC\MESH.CPP
I:\DOCUMENTS\GIT\QIR\GEDGAME_VS2017\PROJECTS\GAME\X64\RELEASE\VC141.PDB
^I:\DOCUMENTS\GIT\QIR\GEDGAME_VS2017\PROJECTS\GAME\SRC\SPRITERENDERER.CPP
I:\DOCUMENTS\GIT\QIR\GEDGAME_VS2017\PROJECTS\GAME\X64\RELEASE\VC141.PDB
^I:\DOCUMENTS\GIT\QIR\GEDGAME_VS2017\PROJECTS\GAME\SRC\TERRAIN.CPP
I:\DOCUMENTS\GIT\QIR\GEDGAME_VS2017\PROJECTS\GAME\X64\RELEASE\VC141.PDB
^I:\DOCUMENTS\GIT\QIR\GEDGAME_VS2017\PROJECTS\GAME\SRC\GAME.CPP
I:\DOCUMENTS\GIT\QIR\GEDGAME_VS2017\PROJECTS\GAME\X64\RELEASE\VC141.PDB
I:\DOCUMENTS\GIT\QIR\GEDGAME_VS2017\PROJECTS\GAME\X64\RELEASE\GAME.OBJ
