^I:\DOCUMENTS\GIT\QIR\GEDGAME_VS2017\PROJECTS\GAME\SRC\T3D.CPP
/c /I..\..\..\..\EXTERNAL\TOOLS\INCLUDE\ /II:\DOCUMENTS\GIT\QIR\GEDGAME_VS2017\PROJECTS\EFFECTS11\INC\ /II:\DOCUMENTS\GIT\QIR\GEDGAME_VS2017\PROJECTS\DXUT\CORE\ /II:\DOCUMENTS\GIT\QIR\GEDGAME_VS2017\PROJECTS\DXUT\OPTIONAL\ /II:\DOCUMENTS\GIT\QIR\GEDGAME_VS2017\PROJECTS\DIRECTXTEX\DIRECTXTEX\ /II:\DOCUMENTS\GIT\QIR\GEDGAME_VS2017\PROJECTS\DIRECTXTEX\WICTEXTURELOADER\ /II:\DOCUMENTS\GIT\QIR\GEDGAME_VS2017\PROJECTS\DIRECTXTEX\DDSTEXTURELOADER\ /Zi /nologo /W3 /WX- /diagnostics:classic /sdl /O2 /Oi /GL /D NDEBUG /D _CONSOLE /D _UNICODE /D UNICODE /Gm- /EHsc /MD /GS /Gy /fp:precise /Zc:wchar_t /Zc:forScope /Zc:inline /Fo"X64\RELEASE\\" /Fd"X64\RELEASE\VC141.PDB" /Gd /TP /FC I:\DOCUMENTS\GIT\QIR\GEDGAME_VS2017\PROJECTS\GAME\SRC\T3D.CPP
^I:\DOCUMENTS\GIT\QIR\GEDGAME_VS2017\PROJECTS\GAME\SRC\CONFIGPARSER.CPP
/c /I..\..\..\..\EXTERNAL\TOOLS\INCLUDE\ /II:\DOCUMENTS\GIT\QIR\GEDGAME_VS2017\PROJECTS\EFFECTS11\INC\ /II:\DOCUMENTS\GIT\QIR\GEDGAME_VS2017\PROJECTS\DXUT\CORE\ /II:\DOCUMENTS\GIT\QIR\GEDGAME_VS2017\PROJECTS\DXUT\OPTIONAL\ /II:\DOCUMENTS\GIT\QIR\GEDGAME_VS2017\PROJECTS\DIRECTXTEX\DIRECTXTEX\ /II:\DOCUMENTS\GIT\QIR\GEDGAME_VS2017\PROJECTS\DIRECTXTEX\WICTEXTURELOADER\ /II:\DOCUMENTS\GIT\QIR\GEDGAME_VS2017\PROJECTS\DIRECTXTEX\DDSTEXTURELOADER\ /Zi /nologo /W3 /WX- /diagnostics:classic /sdl /O2 /Oi /GL /D NDEBUG /D _CONSOLE /D _UNICODE /D UNICODE /Gm- /EHsc /MD /GS /Gy /fp:precise /Zc:wchar_t /Zc:forScope /Zc:inline /Fo"X64\RELEASE\\" /Fd"X64\RELEASE\VC141.PDB" /Gd /TP /FC I:\DOCUMENTS\GIT\QIR\GEDGAME_VS2017\PROJECTS\GAME\SRC\CONFIGPARSER.CPP
^I:\DOCUMENTS\GIT\QIR\GEDGAME_VS2017\PROJECTS\GAME\SRC\HUDRENDERER.CPP
/c /I..\..\..\..\EXTERNAL\TOOLS\INCLUDE\ /II:\DOCUMENTS\GIT\QIR\GEDGAME_VS2017\PROJECTS\EFFECTS11\INC\ /II:\DOCUMENTS\GIT\QIR\GEDGAME_VS2017\PROJECTS\DXUT\CORE\ /II:\DOCUMENTS\GIT\QIR\GEDGAME_VS2017\PROJECTS\DXUT\OPTIONAL\ /II:\DOCUMENTS\GIT\QIR\GEDGAME_VS2017\PROJECTS\DIRECTXTEX\DIRECTXTEX\ /II:\DOCUMENTS\GIT\QIR\GEDGAME_VS2017\PROJECTS\DIRECTXTEX\WICTEXTURELOADER\ /II:\DOCUMENTS\GIT\QIR\GEDGAME_VS2017\PROJECTS\DIRECTXTEX\DDSTEXTURELOADER\ /Zi /nologo /W3 /WX- /diagnostics:classic /sdl /O2 /Oi /GL /D NDEBUG /D _CONSOLE /D _UNICODE /D UNICODE /Gm- /EHsc /MD /GS /Gy /fp:precise /Zc:wchar_t /Zc:forScope /Zc:inline /Fo"X64\RELEASE\\" /Fd"X64\RELEASE\VC141.PDB" /Gd /TP /FC I:\DOCUMENTS\GIT\QIR\GEDGAME_VS2017\PROJECTS\GAME\SRC\HUDRENDERER.CPP
^I:\DOCUMENTS\GIT\QIR\GEDGAME_VS2017\PROJECTS\GAME\SRC\MESH.CPP
/c /I..\..\..\..\EXTERNAL\TOOLS\INCLUDE\ /II:\DOCUMENTS\GIT\QIR\GEDGAME_VS2017\PROJECTS\EFFECTS11\INC\ /II:\DOCUMENTS\GIT\QIR\GEDGAME_VS2017\PROJECTS\DXUT\CORE\ /II:\DOCUMENTS\GIT\QIR\GEDGAME_VS2017\PROJECTS\DXUT\OPTIONAL\ /II:\DOCUMENTS\GIT\QIR\GEDGAME_VS2017\PROJECTS\DIRECTXTEX\DIRECTXTEX\ /II:\DOCUMENTS\GIT\QIR\GEDGAME_VS2017\PROJECTS\DIRECTXTEX\WICTEXTURELOADER\ /II:\DOCUMENTS\GIT\QIR\GEDGAME_VS2017\PROJECTS\DIRECTXTEX\DDSTEXTURELOADER\ /Zi /nologo /W3 /WX- /diagnostics:classic /sdl /O2 /Oi /GL /D NDEBUG /D _CONSOLE /D _UNICODE /D UNICODE /Gm- /EHsc /MD /GS /Gy /fp:precise /Zc:wchar_t /Zc:forScope /Zc:inline /Fo"X64\RELEASE\\" /Fd"X64\RELEASE\VC141.PDB" /Gd /TP /FC I:\DOCUMENTS\GIT\QIR\GEDGAME_VS2017\PROJECTS\GAME\SRC\MESH.CPP
^I:\DOCUMENTS\GIT\QIR\GEDGAME_VS2017\PROJECTS\GAME\SRC\SPRITERENDERER.CPP
/c /I..\..\..\..\EXTERNAL\TOOLS\INCLUDE\ /II:\DOCUMENTS\GIT\QIR\GEDGAME_VS2017\PROJECTS\EFFECTS11\INC\ /II:\DOCUMENTS\GIT\QIR\GEDGAME_VS2017\PROJECTS\DXUT\CORE\ /II:\DOCUMENTS\GIT\QIR\GEDGAME_VS2017\PROJECTS\DXUT\OPTIONAL\ /II:\DOCUMENTS\GIT\QIR\GEDGAME_VS2017\PROJECTS\DIRECTXTEX\DIRECTXTEX\ /II:\DOCUMENTS\GIT\QIR\GEDGAME_VS2017\PROJECTS\DIRECTXTEX\WICTEXTURELOADER\ /II:\DOCUMENTS\GIT\QIR\GEDGAME_VS2017\PROJECTS\DIRECTXTEX\DDSTEXTURELOADER\ /Zi /nologo /W3 /WX- /diagnostics:classic /sdl /O2 /Oi /GL /D NDEBUG /D _CONSOLE /D _UNICODE /D UNICODE /Gm- /EHsc /MD /GS /Gy /fp:precise /Zc:wchar_t /Zc:forScope /Zc:inline /Fo"X64\RELEASE\\" /Fd"X64\RELEASE\VC141.PDB" /Gd /TP /FC I:\DOCUMENTS\GIT\QIR\GEDGAME_VS2017\PROJECTS\GAME\SRC\SPRITERENDERER.CPP
^I:\DOCUMENTS\GIT\QIR\GEDGAME_VS2017\PROJECTS\GAME\SRC\TERRAIN.CPP
/c /I..\..\..\..\EXTERNAL\TOOLS\INCLUDE\ /II:\DOCUMENTS\GIT\QIR\GEDGAME_VS2017\PROJECTS\EFFECTS11\INC\ /II:\DOCUMENTS\GIT\QIR\GEDGAME_VS2017\PROJECTS\DXUT\CORE\ /II:\DOCUMENTS\GIT\QIR\GEDGAME_VS2017\PROJECTS\DXUT\OPTIONAL\ /II:\DOCUMENTS\GIT\QIR\GEDGAME_VS2017\PROJECTS\DIRECTXTEX\DIRECTXTEX\ /II:\DOCUMENTS\GIT\QIR\GEDGAME_VS2017\PROJECTS\DIRECTXTEX\WICTEXTURELOADER\ /II:\DOCUMENTS\GIT\QIR\GEDGAME_VS2017\PROJECTS\DIRECTXTEX\DDSTEXTURELOADER\ /Zi /nologo /W3 /WX- /diagnostics:classic /sdl /O2 /Oi /GL /D NDEBUG /D _CONSOLE /D _UNICODE /D UNICODE /Gm- /EHsc /MD /GS /Gy /fp:precise /Zc:wchar_t /Zc:forScope /Zc:inline /Fo"X64\RELEASE\\" /Fd"X64\RELEASE\VC141.PDB" /Gd /TP /FC I:\DOCUMENTS\GIT\QIR\GEDGAME_VS2017\PROJECTS\GAME\SRC\TERRAIN.CPP
^I:\DOCUMENTS\GIT\QIR\GEDGAME_VS2017\PROJECTS\GAME\SRC\GAME.CPP
/c /I..\..\..\..\EXTERNAL\TOOLS\INCLUDE\ /II:\DOCUMENTS\GIT\QIR\GEDGAME_VS2017\PROJECTS\EFFECTS11\INC\ /II:\DOCUMENTS\GIT\QIR\GEDGAME_VS2017\PROJECTS\DXUT\CORE\ /II:\DOCUMENTS\GIT\QIR\GEDGAME_VS2017\PROJECTS\DXUT\OPTIONAL\ /II:\DOCUMENTS\GIT\QIR\GEDGAME_VS2017\PROJECTS\DIRECTXTEX\DIRECTXTEX\ /II:\DOCUMENTS\GIT\QIR\GEDGAME_VS2017\PROJECTS\DIRECTXTEX\WICTEXTURELOADER\ /II:\DOCUMENTS\GIT\QIR\GEDGAME_VS2017\PROJECTS\DIRECTXTEX\DDSTEXTURELOADER\ /Zi /nologo /W3 /WX- /diagnostics:classic /sdl /O2 /Oi /GL /D NDEBUG /D _CONSOLE /D _UNICODE /D UNICODE /Gm- /EHsc /MD /GS /Gy /fp:precise /Zc:wchar_t /Zc:forScope /Zc:inline /Fo"X64\RELEASE\\" /Fd"X64\RELEASE\VC141.PDB" /Gd /TP /FC I:\DOCUMENTS\GIT\QIR\GEDGAME_VS2017\PROJECTS\GAME\SRC\GAME.CPP
