^I:\DOCUMENTS\GIT\QIR\GEDGAME_VS2017\PROJECTS\GAME\SHADER\GAME.FX
C:\PROGRAM FILES (X86)\WINDOWS KITS\10\BIN\10.0.17763.0\X86\FXC.EXE
^I:\DOCUMENTS\GIT\QIR\GEDGAME_VS2017\PROJECTS\GAME\SHADER\HUD.FX
C:\PROGRAM FILES (X86)\WINDOWS KITS\10\BIN\10.0.17763.0\X86\FXC.EXE
^I:\DOCUMENTS\GIT\QIR\GEDGAME_VS2017\PROJECTS\GAME\SHADER\SPRITE.FX
C:\PROGRAM FILES (X86)\WINDOWS KITS\10\BIN\10.0.17763.0\X86\FXC.EXE
