^I:\DOCUMENTS\GIT\QIR\GEDGAME_VS2017\PROJECTS\DXUT\CORE\BIN\DESKTOP_2017_WIN10\X64\DEBUG\DDSTEXTURELOADER.OBJ|I:\DOCUMENTS\GIT\QIR\GEDGAME_VS2017\PROJECTS\DXUT\CORE\BIN\DESKTOP_2017_WIN10\X64\DEBUG\DXERR.OBJ|I:\DOCUMENTS\GIT\QIR\GEDGAME_VS2017\PROJECTS\DXUT\CORE\BIN\DESKTOP_2017_WIN10\X64\DEBUG\DXUT.OBJ|I:\DOCUMENTS\GIT\QIR\GEDGAME_VS2017\PROJECTS\DXUT\CORE\BIN\DESKTOP_2017_WIN10\X64\DEBUG\DXUTDEVICE11.OBJ|I:\DOCUMENTS\GIT\QIR\GEDGAME_VS2017\PROJECTS\DXUT\CORE\BIN\DESKTOP_2017_WIN10\X64\DEBUG\DXUTMISC.OBJ|I:\DOCUMENTS\GIT\QIR\GEDGAME_VS2017\PROJECTS\DXUT\CORE\BIN\DESKTOP_2017_WIN10\X64\DEBUG\SCREENGRAB.OBJ|I:\DOCUMENTS\GIT\QIR\GEDGAME_VS2017\PROJECTS\DXUT\CORE\BIN\DESKTOP_2017_WIN10\X64\DEBUG\WICTEXTURELOADER.OBJ
I:\DOCUMENTS\GIT\QIR\GEDGAME_VS2017\PROJECTS\DXUT\CORE\BIN\DESKTOP_2017_WIN10\X64\DEBUG\DXUT.OBJ
C:\WINDOWS\SYSTEM32\TZRES.DLL
I:\DOCUMENTS\GIT\QIR\GEDGAME_VS2017\PROJECTS\DXUT\CORE\BIN\DESKTOP_2017_WIN10\X64\DEBUG\DXUTDEVICE11.OBJ
I:\DOCUMENTS\GIT\QIR\GEDGAME_VS2017\PROJECTS\DXUT\CORE\BIN\DESKTOP_2017_WIN10\X64\DEBUG\DXUTMISC.OBJ
I:\DOCUMENTS\GIT\QIR\GEDGAME_VS2017\PROJECTS\DXUT\CORE\BIN\DESKTOP_2017_WIN10\X64\DEBUG\DXERR.OBJ
I:\DOCUMENTS\GIT\QIR\GEDGAME_VS2017\PROJECTS\DXUT\CORE\BIN\DESKTOP_2017_WIN10\X64\DEBUG\DDSTEXTURELOADER.OBJ
I:\DOCUMENTS\GIT\QIR\GEDGAME_VS2017\PROJECTS\DXUT\CORE\BIN\DESKTOP_2017_WIN10\X64\DEBUG\SCREENGRAB.OBJ
I:\DOCUMENTS\GIT\QIR\GEDGAME_VS2017\PROJECTS\DXUT\CORE\BIN\DESKTOP_2017_WIN10\X64\DEBUG\WICTEXTURELOADER.OBJ
C:\WINDOWS\GLOBALIZATION\SORTING\SORTDEFAULT.NLS
