^I:\DOCUMENTS\GIT\QIR\GEDGAME_VS2017\PROJECTS\DXUT\CORE\BIN\DESKTOP_2017_WIN10\X64\DEBUG\DXUT.LIB|I:\DOCUMENTS\GIT\QIR\GEDGAME_VS2017\PROJECTS\DXUT\OPTIONAL\BIN\DESKTOP_2017_WIN10\X64\DEBUG\DXUTOPT.LIB|I:\DOCUMENTS\GIT\QIR\GEDGAME_VS2017\PROJECTS\EFFECTS11\BIN\DESKTOP_2017_WIN10\X64\DEBUG\EFFECTS11D.LIB|I:\DOCUMENTS\GIT\QIR\GEDGAME_VS2017\PROJECTS\GAME\X64\DEBUG\CONFIGPARSER.OBJ|I:\DOCUMENTS\GIT\QIR\GEDGAME_VS2017\PROJECTS\GAME\X64\DEBUG\GAME.OBJ|I:\DOCUMENTS\GIT\QIR\GEDGAME_VS2017\PROJECTS\GAME\X64\DEBUG\GAME.RES|I:\DOCUMENTS\GIT\QIR\GEDGAME_VS2017\PROJECTS\GAME\X64\DEBUG\HUDRENDERER.OBJ|I:\DOCUMENTS\GIT\QIR\GEDGAME_VS2017\PROJECTS\GAME\X64\DEBUG\MESH.OBJ|I:\DOCUMENTS\GIT\QIR\GEDGAME_VS2017\PROJECTS\GAME\X64\DEBUG\SPRITERENDERER.OBJ|I:\DOCUMENTS\GIT\QIR\GEDGAME_VS2017\PROJECTS\GAME\X64\DEBUG\T3D.OBJ|I:\DOCUMENTS\GIT\QIR\GEDGAME_VS2017\PROJECTS\GAME\X64\DEBUG\TERRAIN.OBJ
C:\PROGRAM FILES (X86)\WINDOWS KITS\10\LIB\10.0.17763.0\UM\X64\USP10.LIB
C:\PROGRAM FILES (X86)\WINDOWS KITS\10\LIB\10.0.17763.0\UM\X64\COMCTL32.LIB
C:\PROGRAM FILES (X86)\WINDOWS KITS\10\LIB\10.0.17763.0\UM\X64\DXGUID.LIB
C:\PROGRAM FILES (X86)\WINDOWS KITS\10\LIB\10.0.17763.0\UM\X64\D3DCOMPILER.LIB
C:\PROGRAM FILES (X86)\WINDOWS KITS\10\LIB\10.0.17763.0\UM\X64\COMDLG32.LIB
I:\DOCUMENTS\GIT\EXTERNAL\TOOLS\LIB\VS2017\X64\GEDUTILSD.LIB
C:\PROGRAM FILES (X86)\WINDOWS KITS\10\LIB\10.0.17763.0\UM\X64\KERNEL32.LIB
C:\PROGRAM FILES (X86)\WINDOWS KITS\10\LIB\10.0.17763.0\UM\X64\USER32.LIB
C:\PROGRAM FILES (X86)\WINDOWS KITS\10\LIB\10.0.17763.0\UM\X64\GDI32.LIB
C:\PROGRAM FILES (X86)\WINDOWS KITS\10\LIB\10.0.17763.0\UM\X64\WINSPOOL.LIB
C:\PROGRAM FILES (X86)\WINDOWS KITS\10\LIB\10.0.17763.0\UM\X64\ADVAPI32.LIB
C:\PROGRAM FILES (X86)\WINDOWS KITS\10\LIB\10.0.17763.0\UM\X64\SHELL32.LIB
C:\PROGRAM FILES (X86)\WINDOWS KITS\10\LIB\10.0.17763.0\UM\X64\OLE32.LIB
C:\PROGRAM FILES (X86)\WINDOWS KITS\10\LIB\10.0.17763.0\UM\X64\OLEAUT32.LIB
C:\PROGRAM FILES (X86)\WINDOWS KITS\10\LIB\10.0.17763.0\UM\X64\UUID.LIB
C:\PROGRAM FILES (X86)\WINDOWS KITS\10\LIB\10.0.17763.0\UM\X64\ODBC32.LIB
C:\PROGRAM FILES (X86)\WINDOWS KITS\10\LIB\10.0.17763.0\UM\X64\ODBCCP32.LIB
I:\DOCUMENTS\GIT\QIR\GEDGAME_VS2017\PROJECTS\GAME\X64\DEBUG\GAME.RES
I:\DOCUMENTS\GIT\QIR\GEDGAME_VS2017\PROJECTS\GAME\X64\DEBUG\CONFIGPARSER.OBJ
I:\DOCUMENTS\GIT\QIR\GEDGAME_VS2017\PROJECTS\GAME\X64\DEBUG\GAME.OBJ
I:\DOCUMENTS\GIT\QIR\GEDGAME_VS2017\PROJECTS\GAME\X64\DEBUG\HUDRENDERER.OBJ
I:\DOCUMENTS\GIT\QIR\GEDGAME_VS2017\PROJECTS\GAME\X64\DEBUG\MESH.OBJ
I:\DOCUMENTS\GIT\QIR\GEDGAME_VS2017\PROJECTS\GAME\X64\DEBUG\SPRITERENDERER.OBJ
I:\DOCUMENTS\GIT\QIR\GEDGAME_VS2017\PROJECTS\GAME\X64\DEBUG\T3D.OBJ
I:\DOCUMENTS\GIT\QIR\GEDGAME_VS2017\PROJECTS\GAME\X64\DEBUG\TERRAIN.OBJ
I:\DOCUMENTS\GIT\QIR\GEDGAME_VS2017\PROJECTS\DXUT\CORE\BIN\DESKTOP_2017_WIN10\X64\DEBUG\DXUT.LIB
I:\DOCUMENTS\GIT\QIR\GEDGAME_VS2017\PROJECTS\DXUT\OPTIONAL\BIN\DESKTOP_2017_WIN10\X64\DEBUG\DXUTOPT.LIB
I:\DOCUMENTS\GIT\QIR\GEDGAME_VS2017\PROJECTS\EFFECTS11\BIN\DESKTOP_2017_WIN10\X64\DEBUG\EFFECTS11D.LIB
C:\WINDOWS\SYSTEM32\TZRES.DLL
C:\WINDOWS\GLOBALIZATION\SORTING\SORTDEFAULT.NLS
C:\PROGRAM FILES (X86)\MICROSOFT VISUAL STUDIO\2017\COMMUNITY\VC\TOOLS\MSVC\14.16.27023\LIB\X64\MSVCPRTD.LIB
C:\PROGRAM FILES (X86)\MICROSOFT VISUAL STUDIO\2017\COMMUNITY\VC\TOOLS\MSVC\14.16.27023\LIB\X64\MSVCRTD.LIB
C:\PROGRAM FILES (X86)\MICROSOFT VISUAL STUDIO\2017\COMMUNITY\VC\TOOLS\MSVC\14.16.27023\LIB\X64\OLDNAMES.LIB
C:\PROGRAM FILES (X86)\WINDOWS KITS\10\LIB\10.0.17763.0\UM\X64\WINDOWSCODECS.LIB
C:\PROGRAM FILES (X86)\MICROSOFT VISUAL STUDIO\2017\COMMUNITY\VC\TOOLS\MSVC\14.16.27023\LIB\X64\VCRUNTIMED.LIB
C:\PROGRAM FILES (X86)\WINDOWS KITS\10\LIB\10.0.17763.0\UCRT\X64\UCRTD.LIB
C:\PROGRAM FILES (X86)\MICROSOFT VISUAL STUDIO\2017\COMMUNITY\VC\TOOLS\MSVC\14.16.27023\BIN\HOSTX86\X86\MSPDBSRV.EXE
