{
    "RESOURCE_or":{
                "image":"../pics/ressources/ICON_or.png",
                "stock":0,
                "nom":"or"
                },
    "RESOURCE_nourriture":{
                "image":"../pics/ressources/ICON_nourriture.png",
                "stock":0,
                "nom":"nourriture"
                },
    "RESOURCE_technologie":{
                "image":"../pics/ressources/ICON_technologie.png",
                "stock":0,
                "nom":"technologie"
                },
    "RESOURCE_population":{
                "image":"../pics/ressources/ICON_population.png",
                "stock":0,
                "nom":"population"
                },
    "RESOURCE_reputation":{
                "image":"../pics/ressources/ICON_reputation.png",
                "stock": 0,
                "nom":"réputation"
                }
}