.........
----------------------------------------------------------------------
Ran 9 tests in 0.002s

OK
Name             Stmts   Miss Branch BrPart  Cover   Missing
------------------------------------------------------------
Netflix.py          54      2      6      1    95%   23-24, 22->23
TestNetflix.py      41      0      0      0   100%
------------------------------------------------------------
TOTAL               95      2      6      1    97%

