10004:
5.0
4.2
4.4
4.0
4.8
4.4
4.6
4.4
4.4
4.3
4.4
4.0
4.4
3.9
10018:
4.8
4.1
2.9
3.1
3.5
3.9
3.7
3.3
2.4
4.1
3.5
4.1
3.6
3.9
3.3
3.9
3.6
3.7
3.4
3.7
4.0
3.2
4.2
4.3
3.5
4.1
3.8
3.9
4.0
4.2
10019:
3.5
2.4
3.8
3.0
4.4
4.3
3.6
2.6
3.9
3.5
4.6
3.0
3.0
3.3
3.8
1002:
3.4
2.8
3.4
3.6
3.1
3.7
4.1
2.4
3.5
3.6
4.2
3.5
3.4
3.1
10020:
4.1
4.2
3.9
4.4
4.0
3.8
4.0
4.4
4.3
4.1
4.0
5.0
4.0
3.9
4.1
4.0
4.4
3.6
4.3
3.7
4.5
3.5
3.9
3.9
3.4
2.5
4.3
10021:
2.2
2.6
2.7
2.0
10022:
2.2
3.3
2.9
2.8
3.4
3.3
2.5
2.6
10023:
4.0
4.0
4.0
3.6
16929:
2.7
2.5
16930:
3.8
3.8
3.7
3.1
2.9
3.2
2.5
3.7
3.0
3.0
3.8
4.0
3.4
2.3
2.6
3.9
2.4
3.3
3.9
2.4
2.2
2.8
3.0
3.9
3.8
3.2
2.9
2.6
2.6
3.8
3.6
2.7
3.5
2.7
3.1
2.6
3.6
3.3
3.0
3.6
3.3
3.4
3.0
3.5
2.8
3.5
2.9
3.5
2.9
2.3
16931:
4.6
3.3
4.2
4.6
4.6
3.1
3.3
3.8
4.1
3.7
3.5
4.1
3.6
3.8
4.1
3.8
4.2
3.7
3.4
4.1
3.0
3.5
3.8
3.5
3.8
3.8
4.1
4.1
3.8
3.8
3.6
16934:
3.4
3.3
4.1
4.5
4.0
4.8
3.9
3.9
4.3
16937:
4.2
4.9
4.3
4.6
3.0
4.7
4.1
4.7
3.8
4.1
4.4
4.3
4.5
4.1
4.3
4.1
3.6
5.0
4.2
4.8
3.4
3.4
4.8
2.9
4.2
4.3
3.9
4.4
4.5
3.9
4.7
3.9
5.0
3.9
3.4
16648:
2.9
2.8
16649:
3.6
2.7
3.5
4.0
3.3
4.4
3.5
1665:
3.4
3.3
3.7
3.2
3.8
3.2
3.1
3.2
3.1
2.9
3.1
3.9
4.3
3.2
3.9
3.5
3.6
3.1
3.6
2.7
3.0
3.0
3.9
3.4
3.2
3.1
3.3
3.2
3.3
3.2
3.1
2.9
3.7
3.5
3.9
3.3
2.6
4.2
4.0
3.0
3.4
3.8
3.0
3.0
4.2
3.9
4.7
3.1
3.7
3.2
3.4
3.6
3.9
3.4
3.4
3.4
3.2
3.5
3.3
3.1
3.5
2.7
3.5
2.9
3.1
3.1
3.7
3.1
3.7
3.5
3.4
3.6
4.0
3.3
3.2
3.2
3.6
3.9
3.2
2.7
3.9
3.1
3.5
4.2
3.2
2.9
3.0
3.2
3.3
3.5
2.3
2.9
4.3
2.6
3.7
3.9
3.5
3.9
4.2
3.4
3.6
2.9
4.0
3.9
3.3
3.9
4.0
2.7
2.4
3.7
3.8
2.9
3.5
3.7
2.6
4.1
3.6
2.5
4.1
3.6
3.6
2.5
2.9
4.1
3.8
3.5
3.1
3.4
2.7
2.6
4.0
3.9
4.0
3.0
2.8
4.1
3.8
3.6
3.4
3.1
3.1
4.1
3.2
2.9
9996:
4.4
3.4
3.1
3.6
4.4
3.5
4.0
3.4
3.2
2.7
3.3
3.8
3.6
2.7
2.7
3.2
2.8
3.2
3.0
9997:
3.8
3.9
3.8
4.0
9998:
2.8
3.1
3.7
9999:
1.4
9995:
3.2
3.2
3.2
2.5
2.8
3.5
3.0
4.2
3.1
3.0
3.0
3.0
3.7
2.9
3.3
4.1
3.4
2.6
2.3
3.4
3.0
3.2
3.1
2.8
3.0
3.3
3.5
3.7
3.6
2.8
3.8
3.7
3.0
3.8
3.0
3.6
9988:
4.2
3.6
3.3
4.2
4.9
3.5
3.6
3.9
3.8
3.9
4.4
4.1
4.3
4.1
4.3
3.4
3.8
4.4
4.9
4.7
4.7
4.4
4.2
3.3
9989:
2.3
2.8
2.5
3.2
999:
2.6
2.8
2.4
3.0
2.4
2.6
2.1
2.2
2.2
3.0
3.0
3.0
2.0
2.8
2.7
1.6
2.2
9990:
4.7
3.4
3.0
4.4
9981:
3.4
5.0
3.1
4.3
3.8
4.5
4.4
3.9
4.8
3.6
4.1
4.5
4.2
3.8
3.3
3.5
4.3
4.2
4.8
4.9
4.2
3.9
4.2
4.3
3.5
3.8
4.8
3.3
5.0
4.5
4.8
4.3
3.7
3.8
4.8
4.8
4.5
4.0
3.2
4.2
4.3
3.3
4.3
3.9
3.8
4.2
4.5
4.6
4.3
9971:
2.7
3.6
3.9
3.6
9972:
3.1
2.9
2.6
2.9
4.0
2.1
2.2
3.1
3.1
3.3
3.2
3.0
3.0
9974:
3.6
2.8
3.3
2.6
3.4
3.2
2.9
3.5
3.1
3.8
2.8
2.8
3.7
2.9
2.9
3.1
3.3
9975:
2.0
1.0
2.4
1.0
2.1
1.6
1.8
1.0
9976:
4.1
3.5
3.3
3.6
4.3
3.6
4.1
3.5
3.6
997:
3.8
3.4
3.1
3.9
3.0
3.2
3.0
9966:
4.1
4.3
4.0
3.7
3.9
3.2
4.3
3.8
3.7
3.5
3.2
4.6
3.4
3.3
3.8
3.8
3.6
3.7
4.0
4.2
3.8
3.5
3.3
3.8
3.1
996:
4.9
3.2
4.7
4.5
4.6
4.2
4.9
3.6
2.9
4.0
4.4
4.7
4.3
4.2
5.0
4.2
5.0
4.0
4.5
4.2
4.2
4.3
4.6
3.7
4.8
4.8
2.8
4.3
4.9
4.5
3.5
3.9
4.1
4.8
3.7
4.0
4.4
3.1
4.2
4.8
3.9
3.9
4.7
4.1
3.8
3.9
3.9
2.9
4.5
4.9
4.0
2.9
4.4
4.0
4.2
3.7
4.2
3.9
4.4
3.8
3.4
4.6
3.9
4.4
4.0
4.4
4.0
4.1
995:
1.7
2.2
1.9
2.6
1.0
1.1
9950:
3.8
2.9
3.0
3.5
3.5
3.2
4.3
3.3
3.5
3.8
3.7
3.8
3.6
3.1
3.5
2.4
3.3
4.1
3.6
4.2
3.9
3.8
4.1
3.1
3.8
3.4
3.1
3.9
3.1
4.3
3.6
3.3
3.5
3.7
3.7
3.1
2.7
3.8
4.0
3.8
3.8
3.4
2.9
3.4
3.9
1.7
4.3
4.4
9940:
3.8
3.5
3.9
3.2
3.7
3.9
3.7
3.4
3.7
3.3
3.9
3.8
4.1
3.9
2.9
3.7
3.7
3.7
3.6
3.1
3.5
3.8
3.6
3.8
3.6
4.0
3.2
4.1
3.8
3.4
3.8
2.4
4.6
2.9
3.4
4.3
3.9
3.3
4.4
4.0
3.8
3.8
3.7
4.1
3.9
4.1
4.3
3.3
2.6
4.1
4.2
1.6
3.2
758:
4.1
4.1
3.0
3.0
4.1
3.2
2.6
3.3
3.6
4.2
3.6
3.4
2.8
3.2
3.8
3.6
4.4
3.1
3.6
3.5
3.6
3.9
3.5
3.5
3.8
4.0
3.2
3.2
3.6
3.2
3.6
3.1
3.6
3.2
3.6
3.8
3.6
3.4
3.5
3.5
4.2
4.1
2.8
3.8
2.9
4.6
3.4
4.1
4.6
3.3
2.8
3.4
3.0
3.5
3.4
3.5
4.0
4.1
3.3
2.9
4.0
3.2
3.6
4.1
3.1
4.2
4.5
3.6
3.4
3.5
3.2
3.7
3.7
3.6
3.8
3.7
4.0
3.5
3.3
3.9
3.5
3.3
3.8
3.4
4.0
3.3
3.6
3.2
3.3
4.1
3.7
3.9
3.8
3.6
3.5
3.9
3.4
3.4
3.3
3.1
3.2
3.4
3.4
3.6
4.0
3.8
3.1
2.8
3.5
3.6
3.4
2.7
3.4
3.5
3.1
3.6
3.5
3.2
3.9
3.2
4.4
3.8
3.4
3.9
3.5
2.9
2.9
3.4
3.3
4.9
2.9
3.6
3.3
3.9
3.1
2.7
3.7
3.5
4.7
3.2
3.7
4.6
4.3
3.7
3.9
3.5
3.7
3.0
3.6
3.6
3.4
3.3
3.8
3.4
4.2
3.0
3.1
3.9
3.3
3.3
3.7
3.8
3.6
4.2
4.1
3.4
3.1
3.3
3.5
4.0
3.2
3.6
3.5
3.7
2.9
3.2
3.5
3.6
3.8
3.9
4.2
3.3
3.2
2.4
3.7
3.9
3.3
3.7
3.8
2.9
3.4
3.7
3.8
3.8
4.5
4.4
4.3
7572:
2.6
3.6
3.6
3.5
3.0
3.4
2.9
4.2
3.5
3.5
3.0
3.1
3.9
3.7
3.1
3.3
3.9
4.1
2.8
2.9
3.5
3.2
3.2
3.3
3.5
2.9
3.5
3.2
3.2
3.5
3.0
3.9
2.4
3.1
2.7
4.0
7573:
3.7
2.3
3.1
3.2
2.5
3.5
3.3
3.8
3.1
3.4
2.8
2.0
3.5
3.1
2.5
3.3
3.0
3.9
3.4
2.7
2.3
7574:
3.0
2.5
3.2
3.4
7575:
4.1
2.4
4949:
3.6
3.5
4.5
3.7
2.9
3.7
3.5
3.2
3.0
3.8
3.1
3.3
3.2
4.1
3.5
3.7
4.2
3.8
3.5
2.1
3.9
3.5
3.3
3.0
3.2
4.4
3.4
3.7
4.4
3.6
4.2
4.2
3.4
2.8
2.8
2.4
2.9
3.3
3.9
4.0
3.7
3.1
4.0
2.7
3.8
4.2
3.3
3.1
3.1
3.2
4.1
3.5
2.9
3.9
4.5
3.5
3.2
3.9
3.9
3.3
3.2
3.5
3.8
3.0
3.9
3.9
4.0
2.4
3.5
4.1
2.8
3.6
495:
2.2
3.4
3.7
3.6
2.9
3.4
3.3
1.9
3.0
3.1
3.5
3.3
3.3
4.2
3.5
2.5
4950:
2.1
2.6
3.1
3.1
2.8
4951:
3.7
4.1
3.7
3.9
3.7
3.6
4.2
3.8
4.0
1.5
4.4
4.7
2.8
4.0
4.4
4.3
4.5
3.9
3.6
4.4
4.0
3.9
4.4
3.7
3.9
4.2
3.4
3.7
4.0
3.7
4.6
3.2
3.6
3.6
3.5
3.7
3.7
3.5
3.6
4.1
3.7
3.8
4.8
3.5
3.8
4.1
4.0
4.1
4.2
4.0
3.2
4.5
2.9
3.8
4.2
4.5
3.4
4.4
3.7
2.9
4.5
3.9
3.8
3.6
3.9
3.7
3.7
4.0
3.5
4.8
4.9
4.1
4.1
3.6
3421:
2.6
4.2
3.7
4.1
3.7
4.4
3422:
3.6
3.3
3.6
3.2
4.2
3.4
3.9
3.0
3.2
3.1
3.2
4.6
3.0
3.1
3.1
3.5
3.1
3423:
4.5
3.8
5.0
3.3
4.1
3.4
4.5
3.4
4.0
4.4
3.5
3.7
3.7
3.7
4.1
4.0
4.1
4.4
3.6
4.5
4.3
4.2
4.2
4.5
4.8
4.0
4.9
3.4
3.4
4.4
4.2
2.9
4.2
3.9
3.8
4.2
4.5
3.3
5.0
4.2
3.7
3.7
4.2
4.2
4.4
4.1
4.1
4.9
4.1
4.3
4.4
3.9
3.8
4.9
3.3
3.4
3.0
3.8
4.7
3.6
3.9
4.1
3.7
3.8
4.6
4.1
3.5
4.1
3.7
4.2
3.9
4.2
3.3
3.9
3.2
4.1
3.9
4.0
4.2
3.8
4.0
3.9
3.3
4.0
4.3
3.6
3.5
4.3
3.7
3.7
4.2
4.0
4.6
4.3
4.0
3.9
4.1
3.4
4.3
4.9
3.6
4.1
4.2
4.0
3.8
4.6
4.4
4.8
3.6
4.1
3.8
3.6
4.0
3.8
3424:
2.3
2.4
3.7
3425:
4.1
4.7
4.9
4.2
4.0
3.2
4.1
4.2
4.3
3426:
2.5
3.5
3.0
3.3
3.3
3427:
4.4
1.9
3.8
3.2
4.0
4.7
3.5
3.7
4.0
3.4
4.2
2.9
3.6
4.2
2.3
2.5
3.3
3.7
4.1
3.4
3.7
4.8
4.2
4.4
3.1
4.2
3.2
3.6
2.6
4.2
3.2
4.4
3.2
3.2
4.0
2.9
3.0
3.5
2.1
3.8
3.6
3.9
3.9
2.9
4.1
3.0
3.6
4.6
3.4
2.9
4.4
4.5
4.0
4.4
3.7
3.9
3.6
3.8
3.1
3.5
3.2
3.5
4.0
3.5
3.2
4.2
3.8
4.5
3.6
4.5
4.5
0.97
