<svg width="20" height="19" viewBox="0 0 20 19" fill="none" xmlns="http://www.w3.org/2000/svg">
<path d="M10.3245 3.5248C11.9549 3.5248 13.4598 4.0581 14.714 4.93646C15.874 5.75209 16.8146 6.91279 17.3476 8.26171C17.9433 8.38719 18.4763 8.66953 18.8839 9.10871C19.4169 9.642 19.7305 10.3949 19.7305 11.1791C19.7305 11.9948 19.4169 12.7163 18.8839 13.2496C18.4763 13.6888 17.9433 13.9711 17.3476 14.0966C16.7833 15.4455 15.874 16.5748 14.714 17.4218C13.4598 18.3002 11.9235 18.8335 10.2932 18.8335C8.63146 18.8335 7.09516 18.3002 5.87238 17.4218C4.71232 16.6062 3.80308 15.4455 3.23872 14.128C2.61166 14.0338 2.0473 13.7201 1.60836 13.281C1.07535 12.7477 0.730469 11.9948 0.730469 11.1791C0.730469 10.3635 1.07535 9.61063 1.60836 9.07734C2.0473 8.63816 2.61166 8.35582 3.23872 8.23034C3.30143 8.10486 3.33278 8.01075 3.39549 7.88527L2.11001 6.22265C1.95324 6.03442 2.01595 5.75209 2.20407 5.59524C2.26677 5.56387 2.32948 5.5325 2.42354 5.50113L4.5869 5.12469C4.5869 4.90509 4.64961 4.71687 4.71232 4.49728C4.74367 4.3718 4.83773 4.24632 4.90044 4.12084C4.64961 4.08947 4.39879 4.0581 4.14796 4.08947C3.77172 4.12084 3.39549 4.24632 3.0506 4.40317C2.83113 4.49728 2.5803 4.43454 2.45489 4.21495C2.32948 4.0581 2.42354 3.77576 2.64301 3.65028C3.08195 3.43069 3.55225 3.27384 4.0539 3.24247C4.11661 3.24247 4.17931 3.24247 4.27337 3.24247C3.99119 3.05425 3.67766 2.8974 3.33278 2.86603C3.08195 2.80329 2.92519 2.58369 2.95654 2.3641C2.98789 2.11314 3.20737 1.95629 3.45819 1.98766C3.92849 2.0504 4.36743 2.23862 4.77502 2.52095C4.96314 2.6778 5.18261 2.83466 5.33938 3.02288C5.33938 2.83466 5.33938 2.6778 5.33938 2.48958C5.37073 1.98766 5.5275 1.48573 5.77832 1.07792C5.90374 0.858329 6.15456 0.764218 6.37403 0.889699C6.59351 1.01518 6.65621 1.26614 6.56215 1.48573C6.37403 1.79944 6.27997 2.17588 6.24862 2.58369C6.21727 2.83466 6.24862 3.08562 6.27997 3.30521H6.34268C6.56215 3.27384 6.75027 3.30521 6.96974 3.33658L7.91034 1.32888C8.0044 1.10929 8.28657 1.01518 8.50605 1.10929C8.56875 1.14066 8.63146 1.17203 8.66281 1.23477L10.3245 3.5248ZM4.39879 9.20282C4.30473 9.42241 4.0539 9.61063 3.80308 9.61063H3.70902C3.30143 9.61063 2.92519 9.76749 2.64301 10.0498C2.36083 10.3322 2.20407 10.7086 2.20407 11.1164C2.20407 11.5242 2.36083 11.932 2.64301 12.183C2.92519 12.4653 3.27007 12.6222 3.70902 12.6222C4.02255 12.6222 4.33608 12.8104 4.43014 13.1241C4.86908 14.3475 5.65291 15.4141 6.68756 16.167C7.69087 16.8885 8.94499 17.2964 10.2618 17.2964C11.61 17.2964 12.8328 16.8572 13.8361 16.167C14.8707 15.4141 15.6859 14.3789 16.0935 13.1241C16.1876 12.8418 16.4384 12.6222 16.7519 12.6222C17.1595 12.6222 17.5358 12.434 17.7866 12.1516C18.0374 11.8693 18.2255 11.4929 18.2255 11.085C18.2255 10.6772 18.0688 10.3008 17.7866 10.0184C17.5358 9.76749 17.1595 9.57926 16.7833 9.54789C16.4697 9.54789 16.1562 9.35967 16.0622 9.04597C15.6232 7.82253 14.8394 6.75594 13.8047 6.00305C12.8955 5.34428 11.7981 4.93646 10.6067 4.87372H10.544L8.38063 5.25017C8.38063 5.46976 8.31793 5.65798 8.25522 5.87757C8.12981 6.19128 7.91034 6.50498 7.62816 6.72457C7.31463 6.94416 6.96974 7.06964 6.65621 7.10101C6.43674 7.13238 6.24862 7.10101 6.02915 7.06964L5.08855 9.07734C4.9945 9.29693 4.71232 9.39104 4.49285 9.29693C4.5242 9.3283 4.46149 9.29693 4.39879 9.20282ZM5.5275 4.84235C5.43344 5.03058 5.43344 5.2188 5.46479 5.40702C5.49615 5.65798 5.33938 5.87757 5.08855 5.90894L3.23872 6.22265L4.64961 8.10486L5.43344 6.41087C5.5275 6.19128 5.80968 6.09716 5.9978 6.19128C6.78162 6.56772 7.65951 5.87757 7.5341 5.03058C7.50275 4.77961 7.65951 4.56002 7.87898 4.52865L9.72882 4.21495L8.28657 2.33273L7.50275 4.02673C7.40869 4.24632 7.12651 4.34043 6.90704 4.24632C6.43674 3.99536 5.74697 4.24632 5.5275 4.84235ZM12.049 13.9711C12.2684 13.877 12.5192 13.9711 12.6133 14.2221C12.7074 14.4417 12.6133 14.6926 12.3625 14.7867C11.6727 15.0691 10.9516 15.2259 10.2305 15.2259C9.50935 15.2259 8.78823 15.0691 8.09846 14.7867C7.87898 14.6926 7.78492 14.4417 7.84763 14.2221C7.94169 14.0025 8.19252 13.9084 8.41199 13.9711C8.97634 14.2221 9.60341 14.3475 10.2305 14.3475C10.8575 14.3162 11.4532 14.1907 12.049 13.9711ZM7.81628 10.4263C8.22387 10.4263 8.5374 10.7713 8.5374 11.1478C8.5374 11.5556 8.22387 11.8693 7.81628 11.8693C7.40869 11.8693 7.09516 11.5242 7.09516 11.1478C7.09516 10.7713 7.40869 10.4263 7.81628 10.4263ZM12.6447 10.4263C13.0523 10.4263 13.3658 10.7713 13.3658 11.1478C13.3658 11.5556 13.0523 11.8693 12.6447 11.8693C12.2371 11.8693 11.9235 11.5242 11.9235 11.1478C11.9235 10.7713 12.2371 10.4263 12.6447 10.4263Z" fill="#79655E"/>
</svg>
