[
  {
    "startTime": "2022-02-28T13:36",
    "endTime": "2022-02-28T14:01"
  },
  {
    "startTime": "2022-02-28T21:08",
    "endTime": "2022-02-28T21:35"
  },
  {
    "startTime": "2022-02-28T22:06",
    "endTime": "2022-02-28T22:15"
  },
  {
    "startTime": "2022-02-28T23:20",
    "endTime": "2022-02-28T23:51"
  },
  {
    "startTime": "2022-03-01T15:10",
    "endTime": "2022-03-01T15:53"
  },
  {
    "startTime": "2022-03-01T20:58",
    "endTime": "2022-03-01T21:20"
  },
  {
    "startTime": "2022-03-01T21:56",
    "endTime": "2022-03-01T22:30"
  },
  {
    "startTime": "2022-03-02T08:12",
    "endTime": "2022-03-02T08:24"
  },
  {
    "startTime": "2022-03-03T18:57",
    "endTime": "2022-03-03T19:22"
  },
  {
    "startTime": "2022-03-03T21:07",
    "endTime": "2022-03-03T21:16"
  },
  {
    "startTime": "2022-03-03T21:19",
    "endTime": "2022-03-03T21:37"
  },
  {
    "startTime": "2022-03-04T06:53",
    "endTime": "2022-03-04T07:02"
  },
  {
    "startTime": "2022-03-05T09:51",
    "endTime": "2022-03-05T10:05"
  },
  {
    "startTime": "2022-03-05T10:34",
    "endTime": "2022-03-05T10:44"
  },
  {
    "startTime": "2022-03-06T12:14",
    "endTime": "2022-03-06T12:30"
  },
  {
    "startTime": "2022-03-06T13:01",
    "endTime": "2022-03-06T13:17"
  },
  {
    "startTime": "2022-03-06T17:06",
    "endTime": "2022-03-06T17:23"
  },
  {
    "startTime": "2022-03-06T23:36",
    "endTime": "2022-03-06T23:45"
  },
  {
    "startTime": "2022-03-07T00:04",
    "endTime": "2022-03-07T00:24"
  },
  {
    "startTime": "2022-03-07T01:52",
    "endTime": "2022-03-07T02:08"
  },
  {
    "startTime": "2022-03-07T09:34",
    "endTime": "2022-03-07T09:59"
  },
  {
    "startTime": "2022-03-07T14:49",
    "endTime": "2022-03-07T15:11"
  },
  {
    "startTime": "2022-03-07T16:37",
    "endTime": "2022-03-07T18:02"
  },
  {
    "startTime": "2022-03-07T22:33",
    "endTime": "2022-03-07T23:06"
  },
  {
    "startTime": "2022-03-08T13:12",
    "endTime": "2022-03-08T13:33"
  },
  {
    "startTime":  "2022-03-08T15:12",
    "endTime":    "2022-03-08T15:27"
  },
  {
    "startTime":  "2022-03-08T16:27",
    "endTime":    "2022-03-08T16:43"
  },
  {
    "startTime":  "2022-03-09T11:29",
    "endTime":    "2022-03-09T11:48"
  },
  {
    "startTime":  "2022-03-09T13:19",
    "endTime":    "2022-03-09T13:38"
  },
  {
    "startTime":  "2022-03-09T13:54",
    "endTime":    "2022-03-09T14:09"
  },
  {
    "startTime":  "2022-03-09T19:27",
    "endTime":    "2022-03-09T19:42"
  },
  {
    "startTime":  "2022-03-09T22:01",
    "endTime":    "2022-03-09T22:51"
  },
  {
    "startTime":  "2022-03-10T10:35",
    "endTime":    "2022-03-10T10:50"
  },
  {
    "startTime":  "2022-03-10T14:38",
    "endTime":    "2022-03-10T14:55"
  },
  {
    "startTime":  "2022-03-10T16:14",
    "endTime":    "2022-03-10T16:29"
  },
  {
    "startTime":  "2022-03-11T04:31",
    "endTime":    "2022-03-11T07:59"
  },
  {
    "startTime":  "2022-03-11T10:27",
    "endTime":    "2022-03-11T10:45"
  },
  {
    "startTime":  "2022-03-11T11:01",
    "endTime":    "2022-03-11T11:31"
  },
  {
    "startTime":  "2022-03-11T16:59",
    "endTime":    "2022-03-11T17:17"
  },
  {
    "startTime":  "2022-03-12T05:10",
    "endTime":    "2022-03-12T07:57"
  },
  {
    "startTime":  "2022-03-12T10:42",
    "endTime":    "2022-03-12T11:04"
  },
  {
    "startTime":  "2022-03-12T11:19",
    "endTime":    "2022-03-12T11:59"
  },
  {
    "startTime":  "2022-03-12T17:18",
    "endTime":    "2022-03-12T17:37"
  },
  {
    "startTime":  "2022-03-12T18:17",
    "endTime":    "2022-03-12T18:51"
  },
  {
    "startTime":  "2022-03-13T00:26",
    "endTime":    "2022-03-13T00:48"
  },
  {
    "startTime":  "2022-03-13T03:36",
    "endTime":    "2022-03-13T06:34"
  },
  {
    "startTime":  "2022-03-13T16:46",
    "endTime":    "2022-03-13T17:09"
  },
  {
    "startTime":  "2022-03-13T20:02",
    "endTime":    "2022-03-13T20:15"
  },
  {
    "startTime":  "2022-03-13T21:41",
    "endTime":    "2022-03-13T21:55"
  },
  {
    "startTime":  "2022-03-14T02:21",
    "endTime":    "2022-03-14T07:39"
  },
  {
    "startTime":  "2022-03-14T08:41",
    "endTime":    "2022-03-14T09:24"
  },
  {
    "startTime":  "2022-03-14T19:47",
    "endTime":    "2022-03-14T20:11"
  },
  {
    "startTime":  "2022-03-15T02:16",
    "endTime":    "2022-03-15T03:03"
  },
  {
    "startTime":  "2022-03-15T07:34",
    "endTime":    "2022-03-15T08:17"
  },
  {
    "startTime":  "2022-03-15T11:23",
    "endTime":    "2022-03-15T11:49"
  },
  {
    "startTime":  "2022-03-15T21:25",
    "endTime":    "2022-03-15T21:45"
  },
  {
    "startTime":  "2022-03-16T02:52",
    "endTime":    "2022-03-16T06:20"
  },
  {
    "startTime":  "2022-03-16T13:43",
    "endTime":    "2022-03-16T13:58"
  },
  {
    "startTime":  "2022-03-16T18:10",
    "endTime":    "2022-03-16T18:31"
  },
  {
    "startTime":  "2022-03-16T22:37",
    "endTime":    "2022-03-16T23:17"
  },
  {
    "startTime":  "2022-03-16T23:21",
    "endTime":    "2022-03-16T23:47"
  },
  {
    "startTime":  "2022-03-17T12:46",
    "endTime":    "2022-03-17T13:51"
  },
  {
    "startTime":  "2022-03-18T05:58",
    "endTime":    "2022-03-18T06:25"
  },
  {
    "startTime":  "2022-03-18T07:28",
    "endTime":    "2022-03-18T09:03"
  },
  {
    "startTime":  "2022-03-18T09:17",
    "endTime":    "2022-03-18T09:32"
  },
  {
    "startTime":  "2022-03-18T12:41",
    "endTime":    "2022-03-18T13:33"
  },
  {
    "startTime":  "2022-03-19T15:09",
    "endTime":    "2022-03-19T16:04"
  },
  {
    "startTime":  "2022-03-19T19:10",
    "endTime":    "2022-03-19T20:07"
  },
  {
    "startTime":  "2022-03-20T05:28",
    "endTime":    "2022-03-20T06:29"
  },
  {
    "startTime":  "2022-03-20T16:10",
    "endTime":    "2022-03-20T17:07"
  },
  {
    "startTime":  "2022-03-20T18:39",
    "endTime":    "2022-03-20T19:04"
  },
  {
    "startTime":  "2022-03-21T12:48",
    "endTime":    "2022-03-21T13:04"
  },
  {
    "startTime":  "2022-03-21T16:16",
    "endTime":    "2022-03-21T18:22"
  },
  {
    "startTime":  "2022-03-21T18:30",
    "endTime":    "2022-03-21T18:10"
  },
  {
    "startTime":  "2022-03-22T06:52",
    "endTime":    "2022-03-22T08:25"
  },
  {
    "startTime":  "2022-03-22T12:56",
    "endTime":    "2022-03-22T14:24"
  },
  {
    "startTime":  "2022-03-22T14:38",
    "endTime":    "2022-03-22T16:36"
  },
  {
    "startTime":  "2022-03-22T17:35",
    "endTime":    "2022-03-22T19:48"
  },
  {
    "startTime":  "2022-03-22T31:31",
    "endTime":    "2022-03-22T21:11"
  },
  {
    "startTime":  "2022-03-23T02:35",
    "endTime":    "2022-03-23T02:47"
  },
  {
    "startTime":  "2022-03-23T05:48",
    "endTime":    "2022-03-23T06:33"
  },
  {
    "startTime":  "2022-03-23T19:30",
    "endTime":    "2022-03-23T20:33"
  },
  {
    "startTime":  "2022-03-23T21:18",
    "endTime":    "2022-03-23T22:47"
  },
  {
    "startTime":  "2022-03-24T05:38",
    "endTime":    "2022-03-24T06:55"
  },
  {
    "startTime":  "2022-03-24T11:24",
    "endTime":    "2022-03-24T12:09"
  },
  {
    "startTime":  "2022-03-24T13:16",
    "endTime":    "2022-03-24T13:47"
  },
  {
    "startTime":  "2022-03-24T19:01",
    "endTime":    "2022-03-24T19:45"
  },
  {
    "startTime":  "2022-03-24T22:41",
    "endTime":    "2022-03-24T23:57"
  },
  {
    "startTime":  "2022-03-25T14:11",
    "endTime":    "2022-03-25T15:04"
  },
  {
    "startTime":  "2022-03-25T18:07",
    "endTime":    "2022-03-25T18:43"
  },
  {
    "startTime":  "2022-03-26T05:43",
    "endTime":    "2022-03-26T06:25"
  },
  {
    "startTime":  "2022-03-26T13:17",
    "endTime":    "2022-03-26T16:30"
  },
  {
    "startTime":  "2022-03-26T16:51",
    "endTime":    "2022-03-26T19:03"
  },
  {
    "startTime":  "2022-03-26T22:59",
    "endTime":    "2022-03-26T23:33"
  },
  {
    "startTime":  "2022-03-27T00:48",
    "endTime":    "2022-03-27T01:52"
  },
  {
    "startTime":  "2022-03-27T11:37",
    "endTime":    "2022-03-27T11:58"
  },
  {
    "startTime":  "2022-03-27T21:07",
    "endTime":    "2022-03-27T22:58"
  },
  {
    "startTime":  "2022-03-28T03:40",
    "endTime":    "2022-03-28T04:39"
  },
  {
    "startTime":  "2022-03-28T22:39",
    "endTime":    "2022-03-28T23:05"
  },
  {
    "startTime":  "2022-03-29T03:06",
    "endTime":    "2022-03-29T04:05"
  },
  {
    "startTime":  "2022-03-29T20:16",
    "endTime":    "2022-03-29T20:44"
  },
  {
    "startTime":  "2022-03-29T23:10",
    "endTime":    "2022-03-30T00:14"
  },
  {
    "startTime":  "2022-03-30T05:06",
    "endTime":    "2022-03-30T06:07"
  },
  {
    "startTime":  "2022-03-30T10:14",
    "endTime":    "2022-03-30T12:55"
  },
  {
    "startTime":  "2022-03-30T17:15",
    "endTime":    "2022-03-30T18:15"
  },
  {
    "startTime":  "2022-03-30T20:17",
    "endTime":    "2022-03-30T21:39"
  },
  {
    "startTime":  "2022-03-31T09:22",
    "endTime":    "2022-03-31T09:53"
  },
  {
    "startTime":  "2022-03-31T10:04",
    "endTime":    "2022-03-31T10:23"
  },
  {
    "startTime":  "2022-03-31T12:32",
    "endTime":    "2022-03-31T13:03"
  },
  {
    "startTime":  "2022-03-31T16:11",
    "endTime":    "2022-03-31T17:29"
  },
  {
    "startTime":  "2022-03-31T17:50",
    "endTime":    "2022-03-31T18:26"
  },
  {
    "startTime":  "2022-03-31T21:56",
    "endTime":    "2022-03-31T22:32"
  },
  {
    "startTime":  "2022-04-01T00:47",
    "endTime":    "2022-04-01T01:06"
  },
  {
    "startTime":  "2022-04-01T15:28",
    "endTime":    "2022-04-01T16:17"
  },
  {
    "startTime":  "2022-04-02T00:09",
    "endTime":    "2022-04-02T00:41"
  },
  {
    "startTime":  "2022-04-02T03:41",
    "endTime":    "2022-04-02T06:07"
  },
  {
    "startTime":  "2022-04-02T13:35",
    "endTime":    "2022-04-02T14:32"
  },
  {
    "startTime":  "2022-04-02T16:50",
    "endTime":    "2022-04-02T17:53"
  },
  {
    "startTime":  "2022-04-02T18:07",
    "endTime":    "2022-04-02T18:25"
  },
  {
    "startTime":  "2022-04-02T20:48",
    "endTime":    "2022-04-02T21:33"
  },
  {
    "startTime":  "2022-04-03T04:24",
    "endTime":    "2022-04-03T06:38"
  },
  {
    "startTime":  "2022-04-03T06:56",
    "endTime":    "2022-04-03T07:22"
  },
  {
    "startTime":  "2022-04-03T09:19",
    "endTime":    "2022-04-03T10:23"
  },
  {
    "startTime":  "2022-04-03T13:15",
    "endTime":    "2022-04-03T13:55"
  },
  {
    "startTime":  "2022-04-03T22:00",
    "endTime":    "2022-04-03T22:56"
  },
  {
    "startTime":  "2022-04-04T03:05",
    "endTime":    "2022-04-04T03:50"
  },
  {
    "startTime":  "2022-04-04T09:07",
    "endTime":    "2022-04-04T09:37"
  },
  {
    "startTime":  "2022-04-04T18:23",
    "endTime":    "2022-04-04T18:39"
  },
  {
    "startTime":  "2022-04-04T22:53",
    "endTime":    "2022-04-04T23:59"
  },
  {
    "startTime":  "2022-04-05T03:05",
    "endTime":    "2022-04-05T03:45"
  },
  {
    "startTime":  "2022-04-05T05:31",
    "endTime":    "2022-04-05T05:56"
  },
  {
    "startTime":  "2022-04-05T15:43",
    "endTime":    "2022-04-05T16:14"
  },
  {
    "startTime":  "2022-04-05T22:33",
    "endTime":    "2022-04-05T23:39"
  },
  {
    "startTime":  "2022-04-06T06:13",
    "endTime":    "2022-04-06T06:23"
  },
  {
    "startTime":  "2022-04-06T10:02",
    "endTime":    "2022-04-06T10:35"
  },
  {
    "startTime":  "2022-04-06T14:07",
    "endTime":    "2022-04-06T14:26"
  },
  {
    "startTime":  "2022-04-06T20:07",
    "endTime":    "2022-04-06T21:00"
  },
  {
    "startTime":  "2022-04-06T23:19",
    "endTime":    "2022-04-06T23:46"
  },
  {
    "startTime":  "2022-04-07T05:06",
    "endTime":    "2022-04-07T05:27"
  },
  {
    "startTime":  "2022-04-07T06:26",
    "endTime":    "2022-04-07T06:48"
  },
  {
    "startTime":  "2022-04-07T10:47",
    "endTime":    "2022-04-07T12:10"
  },
  {
    "startTime":  "2022-04-07T12:13",
    "endTime":    "2022-04-07T12:49"
  },
  {
    "startTime":  "2022-04-07T14:44",
    "endTime":    "2022-04-07T15:24"
  },
  {
    "startTime":  "2022-04-07T16:38",
    "endTime":    "2022-04-07T16:46"
  },
  {
    "startTime":  "2022-04-07T21:23",
    "endTime":    "2022-04-07T22:32"
  },
  {
    "startTime":  "2022-04-08T03:17",
    "endTime":    "2022-04-08T03:49"
  },
  {
    "startTime":  "2022-04-08T07:43",
    "endTime":    "2022-04-08T08:39"
  },
  {
    "startTime":  "2022-04-08T11:26",
    "endTime":    "2022-04-08T12:04"
  },
  {
    "startTime":  "2022-04-08T14:00",
    "endTime":    "2022-04-08T14:13"
  },
  {
    "startTime":  "2022-04-08T22:16",
    "endTime":    "2022-04-08T23:00"
  },
  {
    "startTime":  "2022-04-09T09:08",
    "endTime":    "2022-04-09T09:22"
  },
  {
    "startTime":  "2022-04-09T10:02",
    "endTime":    "2022-04-09T10:28"
  },
  {
    "startTime":  "2022-04-09T11:21",
    "endTime":    "2022-04-09T11:34"
  },
  {
    "startTime":  "2022-04-09T12:50",
    "endTime":    "2022-04-09T13:04"
  },
  {
    "startTime":  "2022-04-09T14:02",
    "endTime":    "2022-04-09T14:34"
  },
  {
    "startTime":  "2022-04-09T15:08",
    "endTime":    "2022-04-09T16:05"
  },
  {
    "startTime":  "2022-04-09T17:15",
    "endTime":    "2022-04-09T17:44"
  },
  {
    "startTime":  "2022-04-09T21:09",
    "endTime":    "2022-04-09T22:21"
  },
  {
    "startTime":  "2022-04-09T23:15",
    "endTime":    "2022-04-09T23:39"
  },
  {
    "startTime":  "2022-04-10T01:06",
    "endTime":    "2022-04-10T01:32"
  },
  {
    "startTime":  "2022-04-10T02:57",
    "endTime":    "2022-04-10T04:05"
  },
  {
    "startTime":  "2022-04-10T05:22",
    "endTime":    "2022-04-10T05:59"
  },
  {
    "startTime":  "2022-04-10T07:20",
    "endTime":    "2022-04-10T07:41"
  },
  {
    "startTime":  "2022-04-10T07:53",
    "endTime":    "2022-04-10T08:34"
  },
  {
    "startTime":  "2022-04-10T09:54",
    "endTime":    "2022-04-10T10:55"
  },
  {
    "startTime":  "2022-04-10T11:22",
    "endTime":    "2022-04-10T11:54"
  },
  {
    "startTime":  "2022-04-10T12:14",
    "endTime":    "2022-04-10T13:11"
  },
  {
    "startTime":  "2022-04-10T14:26",
    "endTime":    "2022-04-10T15:46"
  },
  {
    "startTime":  "2022-04-11T00:40",
    "endTime":    "2022-04-11T01:08"
  },
  {
    "startTime":  "2022-04-11T03:06",
    "endTime":    "2022-04-11T04:16"
  },
  {
    "startTime":  "2022-04-11T07:37",
    "endTime":    "2022-04-11T08:18"
  },
  {
    "startTime":  "2022-04-11T08:58",
    "endTime":    "2022-04-11T09:07"
  },
  {
    "startTime":  "2022-04-11T11:44",
    "endTime":    "2022-04-11T12:05"
  },
  {
    "startTime":  "2022-04-11T13:59",
    "endTime":    "2022-04-11T15:13"
  },
  {
    "startTime":  "2022-04-12T02:02",
    "endTime":    "2022-04-12T03:10"
  },
  {
    "startTime":  "2022-04-12T11:03",
    "endTime":    "2022-04-12T11:32"
  },
  {
    "startTime":  "2022-04-13T02:20",
    "endTime":    "2022-04-13T02:38"
  },
  {
    "startTime":  "2022-04-13T04:19",
    "endTime":    "2022-04-13T05:04"
  },
  {
    "startTime":  "2022-04-13T08:58",
    "endTime":    "2022-04-13T09:45"
  },
  {
    "startTime":  "2022-04-13T11:32",
    "endTime":    "2022-04-13T12:09"
  },
  {
    "startTime":  "2022-04-13T14:39",
    "endTime":    "2022-04-13T15:18"
  },
  {
    "startTime":  "2022-04-14T05:18",
    "endTime":    "2022-04-14T05:46"
  },
  {
    "startTime":  "2022-04-14T10:39",
    "endTime":    "2022-04-14T12:47"
  },
  {
    "startTime":  "2022-04-14T18:50",
    "endTime":    "2022-04-14T19:20"
  },
  {
    "startTime":  "2022-04-14T22:11",
    "endTime":    "2022-04-14T23:03"
  },
  {
    "startTime":  "2022-04-15T00:12",
    "endTime":    "2022-04-15T00:44"
  },
  {
    "startTime":  "2022-04-15T09:23",
    "endTime":    "2022-04-15T09:45"
  },
  {
    "startTime":  "2022-04-15T09:58",
    "endTime":    "2022-04-15T10:41"
  },
  {
    "startTime":  "2022-04-15T11:43",
    "endTime":    "2022-04-15T12:46"
  },
  {
    "startTime":  "2022-04-15T13:17",
    "endTime":    "2022-04-15T13:43"
  },
  {
    "startTime":  "2022-04-15T15:18",
    "endTime":    "2022-04-15T15:35"
  },
  {
    "startTime":  "2022-04-15T16:01",
    "endTime":    "2022-04-15T16:37"
  },
  {
    "startTime":  "2022-04-15T18:02",
    "endTime":    "2022-04-15T18:18"
  },
  {
    "startTime":  "2022-04-15T22:15",
    "endTime":    "2022-04-15T22:33"
  },
  {
    "startTime":  "2022-04-16T03:27",
    "endTime":    "2022-04-16T04:00"
  },
  {
    "startTime":  "2022-04-16T04:28",
    "endTime":    "2022-04-16T05:51"
  },
  {
    "startTime":  "2022-04-16T06:09",
    "endTime":    "2022-04-16T06:26"
  },
  {
    "startTime":  "2022-04-16T08:13",
    "endTime":    "2022-04-16T09:46"
  },
  {
    "startTime":  "2022-04-16T10:11",
    "endTime":    "2022-04-16T10:45"
  },
  {
    "startTime":  "2022-04-16T12:04",
    "endTime":    "2022-04-16T12:40"
  },
  {
    "startTime":  "2022-04-16T13:40",
    "endTime":    "2022-04-16T14:06"
  },
  {
    "startTime":  "2022-04-16T16:22",
    "endTime":    "2022-04-16T17:34"
  },
  {
    "startTime":  "2022-04-17T05:06",
    "endTime":    "2022-04-17T06:08"
  },
  {
    "startTime":  "2022-04-17T15:02",
    "endTime":    "2022-04-17T15:30"
  },
  {
    "startTime":  "2022-04-17T23:06",
    "endTime":    "2022-04-17T23:25"
  },
  {
    "startTime":  "2022-04-18T02:04",
    "endTime":    "2022-04-18T02:35"
  },
  {
    "startTime":  "2022-04-18T04:41",
    "endTime":    "2022-04-18T05:47"
  },
  {
    "startTime":  "2022-04-18T06:39",
    "endTime":    "2022-04-18T08:20"
  },
  {
    "startTime":  "2022-04-18T12:08",
    "endTime":    "2022-04-18T12:29"
  },
  {
    "startTime":  "2022-04-18T12:33",
    "endTime":    "2022-04-18T13:20"
  },
  {
    "startTime":  "2022-04-18T14:31",
    "endTime":    "2022-04-18T14:50"
  },
  {
    "startTime":  "2022-04-18T21:18",
    "endTime":    "2022-04-18T23:02"
  },
  {
    "startTime":  "2022-04-18T23:39",
    "endTime":    "2022-04-19T00:06"
  },
  {
    "startTime":  "2022-04-19T01:35",
    "endTime":    "2022-04-19T02:04"
  },
  {
    "startTime":  "2022-04-19T05:05",
    "endTime":    "2022-04-19T06:11"
  },
  {
    "startTime":  "2022-04-20T19:05",
    "endTime":    "2022-04-20T19:32"
  },
  {
    "startTime":  "2022-04-20T20:13",
    "endTime":    "2022-04-20T20:44"
  },
  {
    "startTime":  "2022-04-20T22:49",
    "endTime":    "2022-04-20T23:11"
  },
  {
    "startTime":  "2022-04-21T03:27",
    "endTime":    "2022-04-21T03:57"
  },
  {
    "startTime":  "2022-04-21T05:25",
    "endTime":    "2022-04-21T05:47"
  },
  {
    "startTime":  "2022-04-21T12:58",
    "endTime":    "2022-04-21T13:18"
  },
  {
    "startTime":  "2022-04-21T14:29",
    "endTime":    "2022-04-21T15:00"
  },
  {
    "startTime":  "2022-04-21T17:10",
    "endTime":    "2022-04-21T17:51"
  },
  {
    "startTime":  "2022-04-21T18:30",
    "endTime":    "2022-04-21T18:49"
  },
  {
    "startTime":  "2022-04-21T20:17",
    "endTime":    "2022-04-21T20:53"
  },
  {
    "startTime":  "2022-04-22T05:23",
    "endTime":    "2022-04-22T05:43"
  },
  {
    "startTime":  "2022-04-22T10:54",
    "endTime":    "2022-04-22T11:54"
  },
  {
    "startTime":  "2022-04-23T05:33",
    "endTime":    "2022-04-23T06:03"
  },
  {
    "startTime":  "2022-04-23T11:02",
    "endTime":    "2022-04-23T12:48"
  },
  {
    "startTime":  "2022-04-23T13:13",
    "endTime":    "2022-04-23T15:18"
  },
  {
    "startTime":  "2022-04-23T15:30",
    "endTime":    "2022-04-23T15:43"
  },
  {
    "startTime":  "2022-04-23T21:29",
    "endTime":    "2022-04-23T23:26"
  },
  {
    "startTime":  "2022-04-24T10:58",
    "endTime":    "2022-04-24T11:31"
  },
  {
    "startTime":  "2022-04-24T18:12",
    "endTime":    "2022-04-24T20:49"
  },
  {
    "startTime":  "2022-04-24T20:58",
    "endTime":    "2022-04-24T21:22"
  },
  {
    "startTime":  "2022-04-25T04:23",
    "endTime":    "2022-04-25T04:59"
  },
  {
    "startTime":  "2022-04-25T06:32",
    "endTime":    "2022-04-25T09:33"
  },
  {
    "startTime":  "2022-04-25T11:28",
    "endTime":    "2022-04-25T12:14"
  },
  {
    "startTime":  "2022-04-25T12:53",
    "endTime":    "2022-04-25T12:55"
  },
  {
    "startTime":  "2022-04-25T17:13",
    "endTime":    "2022-04-25T17:51"
  },
  {
    "startTime":  "2022-04-25T20:54",
    "endTime":    "2022-04-25T22:09"
  },
  {
    "startTime":  "2022-04-26T07:03",
    "endTime":    "2022-04-26T09:02"
  },
  {
    "startTime":  "2022-04-26T12:10",
    "endTime":    "2022-04-26T12:26"
  },
  {
    "startTime":  "2022-04-26T13:22",
    "endTime":    "2022-04-26T13:42"
  },
  {
    "startTime":  "2022-04-26T14:26",
    "endTime":    "2022-04-26T14:37"
  },
  {
    "startTime":  "2022-04-26T19:59",
    "endTime":    "2022-04-26T20:19"
  },
  {
    "startTime":  "2022-04-26T20:33",
    "endTime":    "2022-04-26T22:31"
  },
  {
    "startTime":  "2022-04-27T00:08",
    "endTime":    "2022-04-27T00:34"
  },
  {
    "startTime":  "2022-04-27T05:40",
    "endTime":    "2022-04-27T06:04"
  },
  {
    "startTime":  "2022-04-27T07:31",
    "endTime":    "2022-04-27T08:03"
  },
  {
    "startTime":  "2022-04-27T14:27",
    "endTime":    "2022-04-27T14:44"
  },
  {
    "startTime":  "2022-04-27T17:34",
    "endTime":    "2022-04-27T17:51"
  },
  {
    "startTime":  "2022-04-27T19:28",
    "endTime":    "2022-04-27T19:43"
  },
  {
    "startTime":  "2022-04-28T05:11",
    "endTime":    "2022-04-28T05:13"
  },
  {
    "startTime":  "2022-04-28T07:19",
    "endTime":    "2022-04-28T07:35"
  },
  {
    "startTime":  "2022-04-28T08:59",
    "endTime":    "2022-04-28T09:23"
  },
  {
    "startTime":  "2022-04-28T13:16",
    "endTime":    "2022-04-28T13:33"
  },
  {
    "startTime":  "2022-04-28T18:15",
    "endTime":    "2022-04-28T21:04"
  },
  {
    "startTime":  "2022-04-29T06:02",
    "endTime":    "2022-04-29T06:18"
  },
  {
    "startTime":  "2022-04-29T10:50",
    "endTime":    "2022-04-29T11:17"
  },
  {
    "startTime":  "2022-04-29T12:19",
    "endTime":    "2022-04-29T12:46"
  },
  {
    "startTime":  "2022-04-29T18:27",
    "endTime":    "2022-04-29T18:34"
  },
  {
    "startTime":  "2022-04-30T09:21",
    "endTime":    "2022-04-30T09:37"
  },
  {
    "startTime":  "2022-04-30T11:00",
    "endTime":    "2022-04-30T11:12"
  },
  {
    "startTime":  "2022-04-30T13:33",
    "endTime":    "2022-04-30T14:16"
  },
  {
    "startTime":  "2022-04-30T15:46",
    "endTime":    "2022-04-30T16:36"
  },
  {
    "startTime":  "2022-04-30T22:35",
    "endTime":    "2022-04-30T23:11"
  },
  {
    "startTime":  "2022-05-01T05:33",
    "endTime":    "2022-05-01T06:13"
  },
  {
    "startTime":  "2022-05-01T06:41",
    "endTime":    "2022-05-01T07:05"
  },
  {
    "startTime":  "2022-05-01T07:51",
    "endTime":    "2022-05-01T08:20"
  },
  {
    "startTime":  "2022-05-01T14:10",
    "endTime":    "2022-05-01T15:05"
  },
  {
    "startTime":  "2022-05-02T01:51",
    "endTime":    "2022-05-02T02:28"
  },
  {
    "startTime":  "2022-05-02T05:02",
    "endTime":    "2022-05-02T06:05"
  },
  {
    "startTime":  "2022-05-02T08:14",
    "endTime":    "2022-05-02T08:22"
  },
  {
    "startTime":  "2022-05-02T08:26",
    "endTime":    "2022-05-02T08:34"
  },
  {
    "startTime":  "2022-05-02T16:35",
    "endTime":    "2022-05-02T17:02"
  },
  {
    "startTime":  "2022-05-03T05:12",
    "endTime":    "2022-05-03T05:53"
  },
  {
    "startTime":  "2022-05-03T07:58",
    "endTime":    "2022-05-03T08:24"
  },
  {
    "startTime":  "2022-05-03T08:48",
    "endTime":    "2022-05-03T09:13"
  },
  {
    "startTime":  "2022-05-03T18:16",
    "endTime":    "2022-05-03T18:22"
  },
  {
    "startTime":  "2022-05-03T18:24",
    "endTime":    "2022-05-03T21:38"
  },
  {
    "startTime":  "2022-05-04T08:45",
    "endTime":    "2022-05-04T09:14"
  },
  {
    "startTime":  "2022-05-04T19:53",
    "endTime":    "2022-05-04T21:55"
  },
  {
    "startTime":  "2022-05-05T03:25",
    "endTime":    "2022-05-05T04:28"
  },
  {
    "startTime":  "2022-05-05T21:10",
    "endTime":    "2022-05-05T22:03"
  },
  {
    "startTime":  "2022-05-06T05:43",
    "endTime":    "2022-05-06T06:20"
  },
  {
    "startTime":  "2022-05-06T09:35",
    "endTime":    "2022-05-06T10:02"
  },
  {
    "startTime":  "2022-05-06T10:32",
    "endTime":    "2022-05-06T12:26"
  },
  {
    "startTime":  "2022-05-06T13:05",
    "endTime":    "2022-05-06T14:08"
  },
  {
    "startTime":  "2022-05-06T22:01",
    "endTime":    "2022-05-06T22:23"
  },
  {
    "startTime":  "2022-05-07T04:07",
    "endTime":    "2022-05-07T04:33"
  },
  {
    "startTime":  "2022-05-07T04:56",
    "endTime":    "2022-05-07T05:43"
  },
  {
    "startTime":  "2022-05-07T08:16",
    "endTime":    "2022-05-07T08:34"
  },
  {
    "startTime":  "2022-05-07T13:00",
    "endTime":    "2022-05-07T15:40"
  },
  {
    "startTime":  "2022-05-08T00:54",
    "endTime":    "2022-05-08T02:48"
  },
  {
    "startTime":  "2022-05-08T07:48",
    "endTime":    "2022-05-08T08:53"
  },
  {
    "startTime":  "2022-05-08T09:32",
    "endTime":    "2022-05-08T09:53"
  },
  {
    "startTime":  "2022-05-08T16:56",
    "endTime":    "2022-05-08T18:48"
  },
  {
    "startTime":  "2022-05-09T01:34",
    "endTime":    "2022-05-09T02:17"
  },
  {
    "startTime":  "2022-05-09T12:29",
    "endTime":    "2022-05-09T12:57"
  },
  {
    "startTime":  "2022-05-09T18:22",
    "endTime":    "2022-05-09T20:04"
  },
  {
    "startTime":  "2022-05-09T21:23",
    "endTime":    "2022-05-09T23:23"
  },
  {
    "startTime":  "2022-05-10T01:27",
    "endTime":    "2022-05-10T02:16"
  },
  {
    "startTime":  "2022-05-10T05:57",
    "endTime":    "2022-05-10T06:18"
  },
  {
    "startTime":  "2022-05-10T19:11",
    "endTime":    "2022-05-10T19:46"
  },
  {
    "startTime":  "2022-05-11T01:37",
    "endTime":    "2022-05-11T03:17"
  },
  {
    "startTime":  "2022-05-11T09:35",
    "endTime":    "2022-05-11T09:49"
  },
  {
    "startTime":  "2022-05-11T14:43",
    "endTime":    "2022-05-11T15:10"
  },
  {
    "startTime":  "2022-05-12T00:23",
    "endTime":    "2022-05-12T00:57"
  },
  {
    "startTime":  "2022-05-12T17:09",
    "endTime":    "2022-05-12T18:07"
  },
  {
    "startTime":  "2022-05-12T20:16",
    "endTime":    "2022-05-12T20:23"
  },
  {
    "startTime":  "2022-05-12T21:40",
    "endTime":    "2022-05-13T00:58"
  },
  {
    "startTime":  "2022-05-13T02:52",
    "endTime":    "2022-05-13T06:42"
  },
  {
    "startTime":  "2022-05-13T10:43",
    "endTime":    "2022-05-13T11:07"
  },
  {
    "startTime":  "2022-05-13T17:20",
    "endTime":    "2022-05-13T17:40"
  },
  {
    "startTime":  "2022-05-13T20:52",
    "endTime":    "2022-05-13T22:42"
  },
  {
    "startTime":  "2022-05-14T09:53",
    "endTime":    "2022-05-14T10:08"
  },
  {
    "startTime":  "2022-05-14T11:10",
    "endTime":    "2022-05-14T11:23"
  },
  {
    "startTime":  "2022-05-15T03:02",
    "endTime":    "2022-05-15T04:22"
  },
  {
    "startTime":  "2022-05-15T08:26",
    "endTime":    "2022-05-15T09:57"
  },
  {
    "startTime":  "2022-05-15T20:52",
    "endTime":    "2022-05-15T22:24"
  },
  {
    "startTime":  "2022-05-16T07:16",
    "endTime":    "2022-05-16T07:29"
  },
  {
    "startTime":  "2022-05-16T10:39",
    "endTime":    "2022-05-16T10:51"
  },
  {
    "startTime":  "2022-05-16T22:00",
    "endTime":    "2022-05-16T22:36"
  },
  {
    "startTime":  "2022-05-17T02:34",
    "endTime":    "2022-05-17T04:22"
  },
  {
    "startTime":  "2022-05-17T16:44",
    "endTime":    "2022-05-17T17:14"
  },
  {
    "startTime":  "2022-05-17T21:43",
    "endTime":    "2022-05-17T23:03"
  },
  {
    "startTime":  "2022-05-18T05:43",
    "endTime":    "2022-05-18T06:20"
  },
  {
    "startTime":  "2022-05-18T17:40",
    "endTime":    "2022-05-18T23:05"
  },
  {
    "startTime":  "2022-05-19T01:49",
    "endTime":    "2022-05-19T02:09"
  },
  {
    "startTime":  "2022-05-20T15:03",
    "endTime":    "2022-05-20T19:25"
  },
  {
    "startTime":  "2022-05-21T06:55",
    "endTime":    "2022-05-21T07:22"
  },
  {
    "startTime":  "2022-05-21T10:31",
    "endTime":    "2022-05-21T11:57"
  },
  {
    "startTime":  "2022-05-21T12:41",
    "endTime":    "2022-05-21T12:58"
  },
  {
    "startTime":  "2022-05-22T00:18",
    "endTime":    "2022-05-22T00:38"
  },
  {
    "startTime":  "2022-05-22T01:04",
    "endTime":    "2022-05-22T01:24"
  },
  {
    "startTime":  "2022-05-22T02:38",
    "endTime":    "2022-05-22T03:23"
  },
  {
    "startTime":  "2022-05-22T05:52",
    "endTime":    "2022-05-22T06:08"
  },
  {
    "startTime":  "2022-05-22T13:01",
    "endTime":    "2022-05-22T14:56"
  },
  {
    "startTime":  "2022-05-22T16:40",
    "endTime":    "2022-05-22T18:13"
  },
  {
    "startTime":  "2022-05-23T00:52",
    "endTime":    "2022-05-23T01:25"
  },
  {
    "startTime":  "2022-05-23T04:42",
    "endTime":    "2022-05-23T06:26"
  },
  {
    "startTime":  "2022-05-23T13:37",
    "endTime":    "2022-05-23T14:33"
  },
  {
    "startTime":  "2022-05-23T16:05",
    "endTime":    "2022-05-23T17:05"
  },
  {
    "startTime":  "2022-05-23T17:46",
    "endTime":    "2022-05-23T18:53"
  },
  {
    "startTime":  "2022-05-23T19:06",
    "endTime":    "2022-05-23T19:22"
  },
  {
    "startTime":  "2022-05-23T19:33",
    "endTime":    "2022-05-23T19:54"
  },
  {
    "startTime":  "2022-05-23T20:00",
    "endTime":    "2022-05-23T20:56"
  },
  {
    "startTime":  "2022-05-23T21:27",
    "endTime":    "2022-05-23T21:41"
  },
  {
    "startTime":  "2022-05-23T21:47",
    "endTime":    "2022-05-23T21:54"
  },
  {
    "startTime":  "2022-05-23T22:08",
    "endTime":    "2022-05-23T22:21"
  },
  {
    "startTime":  "2022-05-23T23:47",
    "endTime":    "2022-05-24T00:18"
  },
  {
    "startTime":  "2022-05-24T04:51",
    "endTime":    "2022-05-24T05:26"
  },
  {
    "startTime":  "2022-05-24T06:36",
    "endTime":    "2022-05-24T06:57"
  },
  {
    "startTime":  "2022-05-24T12:30",
    "endTime":    "2022-05-24T14:27"
  },
  {
    "startTime":  "2022-05-25T02:27",
    "endTime":    "2022-05-25T02:12"
  },
  {
    "startTime":  "2022-05-25T03:23",
    "endTime":    "2022-05-25T06:23"
  },
  {
    "startTime":  "2022-05-25T09:05",
    "endTime":    "2022-05-25T09:35"
  },
  {
    "startTime":  "2022-05-25T13:50",
    "endTime":    "2022-05-25T14:10"
  },
  {
    "startTime":  "2022-05-25T14:46",
    "endTime":    "2022-05-25T15:43"
  },
  {
    "startTime":  "2022-05-25T19:04",
    "endTime":    "2022-05-25T21:46"
  },
  {
    "startTime":  "2022-05-26T00:13",
    "endTime":    "2022-05-26T06:04"
  },
  {
    "startTime":  "2022-05-26T07:25",
    "endTime":    "2022-05-26T07:43"
  },
  {
    "startTime":  "2022-05-26T08:39",
    "endTime":    "2022-05-26T09:06"
  },
  {
    "startTime":  "2022-05-26T11:28",
    "endTime":    "2022-05-26T11:46"
  },
  {
    "startTime":  "2022-05-26T14:08",
    "endTime":    "2022-05-26T14:33"
  },
  {
    "startTime":  "2022-05-26T18:21",
    "endTime":    "2022-05-26T22:08"
  },
  {
    "startTime":  "2022-05-27T03:34",
    "endTime":    "2022-05-27T03:50"
  },
  {
    "startTime":  "2022-05-27T04:13",
    "endTime":    "2022-05-27T04:22"
  },
  {
    "startTime":  "2022-05-27T10:13",
    "endTime":    "2022-05-27T11:09"
  },
  {
    "startTime":  "2022-05-27T12:00",
    "endTime":    "2022-05-27T12:27"
  },
  {
    "startTime":  "2022-05-27T12:43",
    "endTime":    "2022-05-27T12:54"
  },
  {
    "startTime":  "2022-05-27T20:43",
    "endTime":    "2022-05-27T21:10"
  },
  {
    "startTime":  "2022-05-27T22:23",
    "endTime":    "2022-05-27T21:10"
  },
  {
    "startTime":  "2022-05-27T22:23",
    "endTime":    "2022-05-27T23:06"
  },
  {
    "startTime":  "2022-05-28T06:16",
    "endTime":    "2022-05-28T06:47"
  },
  {
    "startTime":  "2022-05-28T10:28",
    "endTime":    "2022-05-28T10:51"
  },
  {
    "startTime":  "2022-05-28T20:06",
    "endTime":    "2022-05-28T21:10"
  },
  {
    "startTime":  "2022-05-29T12:31",
    "endTime":    "2022-05-29T13:33"
  },
  {
    "startTime":  "2022-05-30T02:53",
    "endTime":    "2022-05-30T05:59"
  },
  {
    "startTime":  "2022-05-30T11:47",
    "endTime":    "2022-05-30T12:21"
  },
  {
    "startTime":  "2022-05-30T13:06",
    "endTime":    "2022-05-30T15:14"
  },
  {
    "startTime":  "2022-05-31T05:07",
    "endTime":    "2022-05-31T05:17"
  },
  {
    "startTime":  "2022-05-31T14:10",
    "endTime":    "2022-05-31T15:28"
  },
  {
    "startTime":  "2022-06-01T13:08",
    "endTime":    "2022-06-01T13:47"
  },
  {
    "startTime":  "2022-06-01T13:52",
    "endTime":    "2022-06-01T14:21"
  },
  {
    "startTime":  "2022-06-01T15:50",
    "endTime":    "2022-06-01T16:09"
  },
  {
    "startTime":  "2022-06-01T21:14",
    "endTime":    "2022-06-01T22:55"
  },
  {
    "startTime":  "2022-06-02T04:02",
    "endTime":    "2022-06-02T06:16"
  },
  {
    "startTime":  "2022-06-03T03:07",
    "endTime":    "2022-06-03T03:32"
  },
  {
    "startTime":  "2022-06-03T09:06",
    "endTime":    "2022-06-03T09:31"
  },
  {
    "startTime":  "2022-06-03T13:33",
    "endTime":    "2022-06-03T13:53"
  },
  {
    "startTime":  "2022-06-03T13:57",
    "endTime":    "2022-06-03T14:41"
  },
  {
    "startTime":  "2022-06-03T17:34",
    "endTime":    "2022-06-03T17:53"
  },
  {
    "startTime":  "2022-06-03T21:53",
    "endTime":    "2022-06-03T23:24"
  },
  {
    "startTime":  "2022-06-04T00:16",
    "endTime":    "2022-06-04T00:30"
  },
  {
    "startTime":  "2022-06-04T07:10",
    "endTime":    "2022-06-04T08:00"
  },
  {
    "startTime":  "2022-06-05T02:27",
    "endTime":    "2022-06-05T03:25"
  },
  {
    "startTime":  "2022-06-05T04:14",
    "endTime":    "2022-06-05T04:37"
  },
  {
    "startTime":  "2022-06-05T04:47",
    "endTime":    "2022-06-05T07:24"
  },
  {
    "startTime":  "2022-06-05T10:05",
    "endTime":    "2022-06-05T10:25"
  },
  {
    "startTime":  "2022-06-05T18:55",
    "endTime":    "2022-06-05T19:41"
  },
  {
    "startTime":  "2022-06-06T01:29",
    "endTime":    "2022-06-06T02:11"
  },
  {
    "startTime":  "2022-06-06T10:27",
    "endTime":    "2022-06-06T13:09"
  },
  {
    "startTime":  "2022-06-06T14:06",
    "endTime":    "2022-06-06T14:47"
  },
  {
    "startTime":  "2022-06-07T02:15",
    "endTime":    "2022-06-07T02:43"
  },
  {
    "startTime":  "2022-06-07T19:22",
    "endTime":    "2022-06-07T20:44"
  },
  {
    "startTime":  "2022-06-08T07:40",
    "endTime":    "2022-06-08T08:09"
  },
  {
    "startTime":  "2022-06-08T10:40",
    "endTime":    "2022-06-08T12:22"
  },
  {
    "startTime":  "2022-06-08T15:53",
    "endTime":    "2022-06-08T16:53"
  },
  {
    "startTime":  "2022-06-09T06:44",
    "endTime":    "2022-06-09T07:03"
  },
  {
    "startTime":  "2022-06-09T08:10",
    "endTime":    "2022-06-09T08:32"
  },
  {
    "startTime":  "2022-06-09T13:17",
    "endTime":    "2022-06-09T13:37"
  },
  {
    "startTime":  "2022-06-09T13:47",
    "endTime":    "2022-06-09T14:23"
  },
  {
    "startTime":  "2022-06-10T02:36",
    "endTime":    "2022-06-09T04:03"
  },
  {
    "startTime":  "2022-06-10T08:00",
    "endTime":    "2022-06-09T08:20"
  },
  {
    "startTime":  "2022-06-11T10:31",
    "endTime":    "2022-06-01T10:41"
  },
  {
    "startTime":  "2022-06-11T20:18",
    "endTime":    "2022-06-01T20:40"
  },
  {
    "startTime":  "2022-06-12T23:08",
    "endTime":    "2022-06-13T00:29"
  },
  {
    "startTime":  "2022-06-13T12:43",
    "endTime":    "2022-06-13T13:48"
  },
  {
    "startTime":  "2022-06-13T23:44",
    "endTime":    "2022-06-14T11:04"
  },
  {
    "startTime":  "2022-06-14T09:01",
    "endTime":    "2022-06-14T10:01"
  },
  {
    "startTime":  "2022-06-14T10:26",
    "endTime":    "2022-06-14T10:43"
  },
  {
    "startTime":  "2022-06-14T12:28",
    "endTime":    "2022-06-14T13:52"
  },
  {
    "startTime":  "2022-06-14T16:47",
    "endTime":    "2022-06-14T17:58"
  },
  {
    "startTime":  "2022-06-15T00:09",
    "endTime":    "2022-06-15T02:15"
  },
  {
    "startTime":  "2022-06-15T02:59",
    "endTime":    "2022-06-15T03:29"
  },
  {
    "startTime":  "2022-06-15T17:31",
    "endTime":    "2022-06-15T19:50"
  },
  {
    "startTime":  "2022-06-16T10:32",
    "endTime":    "2022-06-16T11:19"
  },
  {
    "startTime":  "2022-06-16T23:17",
    "endTime":    "2022-06-17T00:44"
  },
  {
    "startTime":  "2022-06-18T00:58",
    "endTime":    "2022-06-18T01:19"
  },
  {
    "startTime":  "2022-06-18T04:22",
    "endTime":    "2022-06-18T05:42"
  },
  {
    "startTime":  "2022-06-18T11:29",
    "endTime":    "2022-06-18T11:34"
  },
  {
    "startTime":  "2022-06-18T12:32",
    "endTime":    "2022-06-18T12:54"
  },
  {
    "startTime":  "2022-06-18T19:00",
    "endTime":    "2022-06-18T19:49"
  },
  {
    "startTime":  "2022-06-19T01:01",
    "endTime":    "2022-06-19T02:54"
  },
  {
    "startTime":  "2022-06-19T03:08",
    "endTime":    "2022-06-19T03:26"
  },
  {
    "startTime":  "2022-06-19T05:07",
    "endTime":    "2022-06-19T06:06"
  },
  {
    "startTime":  "2022-06-19T07:24",
    "endTime":    "2022-06-19T08:02"
  },
  {
    "startTime":  "2022-06-19T11:15",
    "endTime":    "2022-06-19T11:22"
  },
  {
    "startTime":  "2022-06-19T18:29",
    "endTime":    "2022-06-19T18:59"
  },
  {
    "startTime":  "2022-06-20T20:59",
    "endTime":    "2022-06-20T21:42"
  },
  {
    "startTime":  "2022-06-21T07:45",
    "endTime":    "2022-06-21T08:04"
  },
  {
    "startTime":  "2022-06-21T17:36",
    "endTime":    "2022-06-21T18:01"
  },
  {
    "startTime":  "2022-06-22T16:41",
    "endTime":    "2022-06-22T17:03"
  },
  {
    "startTime":  "2022-06-22T22:18",
    "endTime":    "2022-06-22T22:50"
  },
  {
    "startTime":  "2022-06-22T23:09",
    "endTime":    "2022-06-22T23:22"
  },
  {
    "startTime":  "2022-06-23T08:12",
    "endTime":    "2022-06-23T09:22"
  },
  {
    "startTime":  "2022-06-23T11:38",
    "endTime":    "2022-06-23T11:48"
  },
  {
    "startTime":  "2022-06-23T12:01",
    "endTime":    "2022-06-23T12:39"
  },
  {
    "startTime":  "2022-06-23T17:48",
    "endTime":    "2022-06-23T18:12"
  },
  {
    "startTime":  "2022-06-23T19:20",
    "endTime":    "2022-06-23T19:54"
  },
  {
    "startTime":  "2022-06-23T23:45",
    "endTime":    "2022-06-24T00:19"
  },
  {
    "startTime":  "2022-06-24T01:36",
    "endTime":    "2022-06-24T02:12"
  },
  {
    "startTime":  "2022-06-24T19:28",
    "endTime":    "2022-06-24T20:05"
  },
  {
    "startTime":  "2022-06-24T20:22",
    "endTime":    "2022-06-24T23:00"
  },
  {
    "startTime":  "2022-06-25T00:43",
    "endTime":    "2022-06-25T00:57"
  },
  {
    "startTime":  "2022-06-25T03:22",
    "endTime":    "2022-06-25T05:03"
  },
  {
    "startTime":  "2022-06-25T06:14",
    "endTime":    "2022-06-25T07:07"
  },
  {
    "startTime":  "2022-06-25T12:26",
    "endTime":    "2022-06-25T12:43"
  },
  {
    "startTime":  "2022-06-25T18:20",
    "endTime":    "2022-06-25T18:39"
  },
  {
    "startTime":  "2022-06-25T20:34",
    "endTime":    "2022-06-25T20:58"
  },
  {
    "startTime":  "2022-06-26T02:03",
    "endTime":    "2022-06-26T02:39"
  },
  {
    "startTime":  "2022-06-26T05:23",
    "endTime":    "2022-06-26T07:17"
  },
  {
    "startTime":  "2022-06-26T11:38",
    "endTime":    "2022-06-26T13:42"
  },
  {
    "startTime":  "2022-06-26T18:41",
    "endTime":    "2022-06-26T19:02"
  },
  {
    "startTime":  "2022-06-26T23:57",
    "endTime":    "2022-06-27T02:00"
  }
]
