<svg width="198" height="60" viewBox="0 0 198 60" fill="none" xmlns="http://www.w3.org/2000/svg">
<g clip-path="url(#clip0_3033_6840)">
<path d="M64.7937 37.2896C65.1027 37.311 65.408 37.2121 65.6457 37.0136C65.9441 36.7445 66.1268 36.3704 66.1557 35.9696V30.5426H59.2557V35.9426C59.2531 36.1199 59.2875 36.2958 59.3568 36.459C59.426 36.6223 59.5285 36.7693 59.6577 36.8907C59.7835 37.0168 59.9332 37.1165 60.0981 37.184C60.2629 37.2514 60.4396 37.2853 60.6177 37.2836H60.8727L60.8937 37.4966H54.4287V37.2836H54.7047C54.8812 37.2861 55.0563 37.2526 55.2193 37.185C55.3823 37.1174 55.5298 37.0173 55.6527 36.8907C55.9103 36.6416 56.0591 36.3009 56.0667 35.9426V24.1526C56.0591 23.7944 55.9103 23.4537 55.6527 23.2046C55.5298 23.078 55.3823 22.9779 55.2193 22.9103C55.0563 22.8427 54.8812 22.8092 54.7047 22.8116H54.4287V22.5986H60.8997L60.8787 22.8116H60.6237C60.4456 22.8099 60.2689 22.8438 60.1041 22.9113C59.9392 22.9788 59.7895 23.0785 59.6637 23.2046C59.5345 23.326 59.432 23.473 59.3628 23.6363C59.2935 23.7995 59.2591 23.9753 59.2617 24.1526V29.6216H66.1617V24.1526C66.1515 23.795 66.0032 23.4552 65.7477 23.2046C65.6246 23.0783 65.477 22.9783 65.3141 22.9108C65.1511 22.8432 64.9761 22.8095 64.7997 22.8116H64.5237V22.5986H70.9917V22.8116H70.7157C70.5381 22.81 70.3619 22.8439 70.1975 22.9114C70.0332 22.9789 69.884 23.0786 69.7587 23.2046C69.6291 23.3259 69.5261 23.4728 69.4564 23.636C69.3867 23.7992 69.3517 23.9752 69.3537 24.1526V35.9426C69.3517 36.1201 69.3867 36.2961 69.4564 36.4593C69.5261 36.6225 69.6291 36.7694 69.7587 36.8907C69.884 37.0167 70.0332 37.1164 70.1975 37.1838C70.3619 37.2513 70.5381 37.2853 70.7157 37.2836H70.9917V37.4966H64.5237V37.2836L64.7937 37.2896Z" fill="white"/>
<path d="M73.0284 37.2897C73.2049 37.2922 73.38 37.2586 73.543 37.1911C73.706 37.1235 73.8535 37.0233 73.9764 36.8967C74.234 36.6476 74.3828 36.307 74.3904 35.9487V24.0927C74.3908 23.7931 74.2771 23.5045 74.0724 23.2857C73.7973 23.0016 73.4236 22.8341 73.0284 22.8177H72.7524V22.6047H80.9034C81.4825 22.6155 82.0611 22.5622 82.6284 22.4457C82.9093 22.3857 83.1867 22.3106 83.4594 22.2207V25.9467L83.2464 25.9257V25.6887C83.2464 24.8087 82.9194 24.1847 82.2654 23.8167C81.9274 23.6255 81.5467 23.5223 81.1584 23.5167H77.5854V29.7087H80.3934C80.6353 29.7101 80.875 29.6628 81.0982 29.5695C81.3214 29.4762 81.5235 29.3389 81.6924 29.1657C81.8596 28.9965 81.9909 28.7953 82.0785 28.5742C82.1661 28.353 82.2083 28.1165 82.2024 27.8787V27.6867H82.4154V32.6037H82.2024V32.4477C82.2105 32.2091 82.1703 31.9713 82.0842 31.7486C81.9981 31.5259 81.8679 31.3229 81.7014 31.1517C81.5367 30.9828 81.3398 30.8486 81.1224 30.7568C80.905 30.6651 80.6714 30.6179 80.4354 30.6177H77.5854V36.5997H80.3784C81.328 36.6272 82.2551 36.3072 82.9854 35.6997C83.7385 35.0231 84.2811 34.1442 84.5484 33.1677H84.7614L83.7834 37.5087H72.7584V37.2957L73.0284 37.2897Z" fill="white"/>
<path d="M91.9706 23.5407H90.9926V35.9488C91.0028 36.3064 91.1512 36.6462 91.4066 36.8967C91.5297 37.023 91.6773 37.123 91.8402 37.1906C92.0032 37.2581 92.1782 37.2919 92.3546 37.2898H92.6306V37.5027H86.1626V37.2898H86.4386C86.6754 37.2975 86.9097 37.24 87.116 37.1236C87.3224 37.0072 87.4927 36.8364 87.6086 36.6297C87.7228 36.4276 87.7885 36.2016 87.8006 35.9697V24.1587C87.7906 23.8004 87.6409 23.4603 87.3836 23.2107C87.2612 23.0842 87.1142 22.9841 86.9517 22.9165C86.7892 22.8489 86.6146 22.8153 86.4386 22.8178H86.1626V22.6047H93.4616C94.6866 22.5662 95.8971 22.8785 96.9506 23.5047C97.4398 23.8074 97.8371 24.2379 98.0996 24.7498C98.4098 25.3995 98.556 26.1154 98.5256 26.8348C98.5087 27.7386 98.1922 28.6113 97.6256 29.3158C97.3167 29.7161 96.9249 30.0449 96.4769 30.2794C96.029 30.514 95.5356 30.6489 95.0306 30.6747C95.8526 30.9447 96.5756 31.5697 97.1996 32.5497C98.7336 35.0037 99.8696 36.4647 100.608 36.9327C101.028 37.175 101.505 37.3004 101.991 37.2958V37.5087H99.8906C98.8441 37.5388 97.8012 37.3729 96.8156 37.0197C95.9925 36.6862 95.3115 36.0762 94.8896 35.2947C94.6196 34.8267 94.0306 33.6137 93.1226 31.6557C92.7226 30.7897 92.2406 30.3147 91.6766 30.2307V30.0178H92.3366C92.9501 30.0263 93.5478 29.8229 94.0286 29.4417C94.5186 29.0577 94.8486 28.4337 95.0186 27.5697C95.0673 27.3387 95.0954 27.1038 95.1026 26.8678C95.1026 25.7038 94.8686 24.8627 94.4006 24.3447C94.174 24.092 93.8965 23.8902 93.5862 23.7527C93.2759 23.6151 92.94 23.5449 92.6006 23.5467L91.9706 23.5407Z" fill="white"/>
<path d="M101.997 35.5225C101.969 34.6052 102.198 33.6984 102.657 32.9035H102.846C102.833 33.0171 102.826 33.1313 102.825 33.2456C102.822 33.7215 102.914 34.1932 103.094 34.6335C103.275 35.0738 103.541 35.4738 103.878 35.8105C104.582 36.5385 105.544 36.9035 106.764 36.9055C107.712 36.9055 108.456 36.6775 108.987 36.2245C109.242 36.0163 109.446 35.7528 109.585 35.4539C109.723 35.1551 109.791 34.8287 109.785 34.4995C109.787 34.0968 109.648 33.706 109.392 33.3955C109.013 32.9702 108.572 32.6041 108.084 32.3096L104.379 29.8615C103.003 28.9395 102.315 27.8045 102.315 26.4565C102.315 26.3135 102.329 26.1709 102.357 26.0305C102.381 25.5154 102.509 25.0106 102.734 24.5465C102.959 24.0824 103.276 23.6687 103.665 23.3305C104.455 22.6505 105.509 22.3105 106.827 22.3105C107.795 22.3231 108.762 22.3932 109.722 22.5205H111.063L110.784 25.6495H110.574C110.585 25.3099 110.516 24.9725 110.373 24.6642C110.23 24.3558 110.018 24.0851 109.752 23.8735C109.126 23.4001 108.354 23.1622 107.571 23.2015C106.465 23.2015 105.665 23.5425 105.171 24.2245C104.935 24.4971 104.799 24.8422 104.787 25.2025C104.777 25.4915 104.844 25.778 104.979 26.0335C105.309 26.5326 105.754 26.9444 106.278 27.2335L110.343 29.8736C111.619 30.7096 112.257 31.8015 112.257 33.1495C112.257 34.6555 111.743 35.8085 110.715 36.6085C109.687 37.4085 108.321 37.8085 106.617 37.8085C105.715 37.8169 104.816 37.6988 103.947 37.4575C103.275 37.3024 102.655 36.9758 102.147 36.5096C102.039 36.192 101.988 35.8578 101.997 35.5225Z" fill="white"/>
<path d="M124.365 37.2896C124.673 37.3103 124.977 37.2114 125.214 37.0136C125.513 36.7448 125.697 36.3708 125.727 35.9696V30.5426H118.827V35.9426C118.825 36.1201 118.86 36.2961 118.929 36.4593C118.999 36.6225 119.102 36.7694 119.232 36.8907C119.357 37.0167 119.506 37.1164 119.67 37.1838C119.835 37.2513 120.011 37.2853 120.189 37.2836H120.444L120.465 37.4966H113.997V37.2836H114.273C114.449 37.2858 114.624 37.252 114.787 37.1845C114.95 37.1169 115.097 37.017 115.221 36.8907C115.476 36.6401 115.624 36.3003 115.635 35.9426V24.1526C115.624 23.795 115.476 23.4552 115.221 23.2046C115.097 23.0783 114.95 22.9783 114.787 22.9108C114.624 22.8432 114.449 22.8095 114.273 22.8116H113.997V22.5986H120.465L120.444 22.8116H120.189C120.011 22.81 119.835 22.8439 119.67 22.9114C119.506 22.9789 119.357 23.0786 119.232 23.2046C119.102 23.3259 118.999 23.4728 118.929 23.636C118.86 23.7992 118.825 23.9752 118.827 24.1526V29.6216H125.727V24.1526C125.717 23.7943 125.567 23.4542 125.31 23.2046C125.187 23.0783 125.04 22.9782 124.878 22.9107C124.715 22.8431 124.541 22.8094 124.365 22.8116H124.086V22.5986H130.557V22.8116H130.281C130.102 22.8099 129.926 22.8438 129.761 22.9113C129.596 22.9788 129.446 23.0785 129.321 23.2046C129.192 23.3265 129.09 23.4735 129.021 23.6367C128.951 23.7998 128.917 23.9755 128.919 24.1526V35.9426C128.917 36.1198 128.951 36.2955 129.021 36.4586C129.09 36.6217 129.192 36.7688 129.321 36.8907C129.446 37.0168 129.596 37.1165 129.761 37.184C129.926 37.2514 130.102 37.2853 130.281 37.2836H130.557V37.4966H124.086V37.2836L124.365 37.2896Z" fill="white"/>
<path d="M134.312 24.3927C135.824 22.9927 137.86 22.2977 140.42 22.3077C142.98 22.3177 145.016 23.0127 146.528 24.3927C148.04 25.7827 148.796 27.6697 148.796 30.0537C148.796 32.4377 148.04 34.3247 146.528 35.7147C145.016 37.1027 142.98 37.7977 140.42 37.7997C137.86 37.8017 135.824 37.1067 134.312 35.7147C132.8 34.3147 132.045 32.4277 132.047 30.0537C132.049 27.6797 132.804 25.7927 134.312 24.3927ZM136.844 35.0637C137.234 35.6479 137.766 36.1234 138.39 36.4456C139.014 36.7678 139.709 36.9262 140.411 36.9057C141.114 36.9252 141.81 36.7665 142.435 36.4444C143.06 36.1224 143.593 35.6474 143.984 35.0637C144.866 33.8377 145.306 32.1677 145.304 30.0537C145.302 27.9397 144.862 26.2687 143.984 25.0407C143.592 24.4575 143.059 23.9828 142.434 23.6608C141.81 23.3387 141.114 23.1798 140.411 23.1987C139.71 23.1788 139.014 23.3374 138.39 23.6596C137.766 23.9817 137.234 24.457 136.844 25.0407C135.97 26.2687 135.534 27.9397 135.536 30.0537C135.538 32.1677 135.974 33.8377 136.844 35.0637Z" fill="white"/>
<path d="M156.033 23.5408H155.052V35.9488C155.062 36.3071 155.211 36.6472 155.469 36.8967C155.591 37.0232 155.738 37.1234 155.901 37.191C156.063 37.2586 156.238 37.2922 156.414 37.2897H156.693V37.5027H150.222V37.2897H150.498C150.734 37.2975 150.969 37.24 151.175 37.1236C151.381 37.0072 151.552 36.8364 151.668 36.6297C151.782 36.4276 151.848 36.2016 151.86 35.9697V24.1588C151.85 23.8011 151.701 23.4613 151.446 23.2108C151.323 23.0844 151.175 22.9845 151.012 22.9169C150.849 22.8494 150.674 22.8156 150.498 22.8178H150.222V22.6048H157.521C158.747 22.5661 159.958 22.8784 161.013 23.5048C161.5 23.8091 161.897 24.2392 162.162 24.7498C162.47 25.4 162.617 26.1155 162.588 26.8348C162.569 27.7384 162.253 28.6106 161.688 29.3158C161.378 29.7162 160.986 30.045 160.537 30.2795C160.089 30.5141 159.595 30.6489 159.09 30.6747C159.912 30.9447 160.636 31.5697 161.262 32.5497C162.796 35.0037 163.931 36.4647 164.667 36.9327C165.087 37.1742 165.565 37.2995 166.05 37.2958V37.5087H163.965C162.918 37.5392 161.875 37.3734 160.89 37.0197C160.067 36.6862 159.386 36.0762 158.964 35.2947C158.694 34.8267 158.105 33.6137 157.197 31.6557C156.798 30.7887 156.318 30.3147 155.748 30.2307V30.0178H156.408C157.021 30.0263 157.619 29.8229 158.1 29.4417C158.592 29.0577 158.922 28.4337 159.09 27.5697C159.139 27.3387 159.168 27.1038 159.177 26.8678C159.177 25.7038 158.943 24.8627 158.475 24.3448C158.248 24.092 157.971 23.8902 157.66 23.7527C157.35 23.6151 157.014 23.5449 156.675 23.5468L156.033 23.5408Z" fill="white"/>
<path d="M173.079 23.4776V35.9696C173.083 36.1454 173.122 36.3187 173.193 36.4794C173.265 36.64 173.368 36.7849 173.496 36.9056C173.619 37.0298 173.767 37.1278 173.929 37.1937C174.091 37.2597 174.265 37.2923 174.441 37.2896H174.696L174.717 37.5026H168.249V37.2896H168.525C168.697 37.2906 168.868 37.2571 169.027 37.1912C169.186 37.1252 169.331 37.0281 169.452 36.9056C169.703 36.6696 169.858 36.349 169.887 36.0056V23.4776H167.013C166.727 23.4679 166.442 23.516 166.175 23.6191C165.908 23.7222 165.664 23.8781 165.459 24.0776C165.265 24.286 165.115 24.5306 165.017 24.7973C164.919 25.064 164.874 25.3476 164.886 25.6316V25.8866H164.679V22.1846C165.486 22.4625 166.336 22.5925 167.19 22.5686H175.767C176.248 22.5654 176.729 22.5223 177.204 22.4396C177.57 22.3926 177.93 22.3071 178.278 22.1846V25.8866H178.065V25.6316C178.065 24.7516 177.732 24.1276 177.066 23.7596C176.721 23.5654 176.333 23.4622 175.938 23.4596L173.079 23.4776Z" fill="white"/>
<path d="M187.634 23.4776V35.9696C187.639 36.1454 187.678 36.3187 187.749 36.4794C187.821 36.64 187.924 36.7849 188.051 36.9056C188.175 37.0298 188.323 37.1278 188.485 37.1937C188.647 37.2597 188.821 37.2923 188.996 37.2896H189.254L189.275 37.5026H182.805V37.2896H183.081C183.253 37.2906 183.424 37.2571 183.583 37.1912C183.742 37.1252 183.886 37.0281 184.008 36.9056C184.259 36.6696 184.414 36.349 184.443 36.0056V23.4776H181.572C181.285 23.4672 181 23.515 180.733 23.6181C180.466 23.7213 180.222 23.8776 180.018 24.0776C179.823 24.2854 179.672 24.5299 179.573 24.7967C179.474 25.0635 179.43 25.3473 179.442 25.6316V25.8866H179.229V22.1846C180.036 22.4625 180.886 22.5925 181.74 22.5686H190.316C190.798 22.5654 191.279 22.5223 191.753 22.4396C192.119 22.3926 192.479 22.3071 192.827 22.1846V25.8866H192.614V25.6316C192.614 24.7516 192.281 24.1276 191.615 23.7596C191.271 23.565 190.883 23.4618 190.487 23.4596L187.634 23.4776Z" fill="white"/>
<path d="M43.001 9.61761C40.7943 9.33407 38.6142 8.87256 36.482 8.2376C32.264 7.0376 28.031 5.27661 24.482 2.37861C23.6416 1.69494 22.8626 0.939048 22.154 0.119603C22.1379 0.0925522 22.1165 0.0690778 22.091 0.0506093C22.0733 0.0319066 22.0514 0.0176899 22.0271 0.00915426C22.0028 0.000618608 21.9768 -0.00200105 21.9512 0.00151876C21.9257 0.00503858 21.9014 0.0146091 21.8803 0.0294057C21.8592 0.0442023 21.842 0.063808 21.83 0.0866079C17.765 3.77961 12.92 6.27561 7.93999 7.92861C5.67282 8.71863 3.33363 9.28434 0.956003 9.61761C0.904283 9.62146 0.856047 9.64514 0.821384 9.68371C0.786721 9.72229 0.768314 9.77278 0.770005 9.82461V39.8246C0.734873 40.1391 0.74192 40.4569 0.790989 40.7696C1.23811 42.0807 1.87379 43.3197 2.678 44.4476C4.709 47.5046 7.31 50.0546 10.031 52.3016C13.7088 55.2649 17.684 57.8387 21.893 59.9816C21.9098 59.9907 21.9281 59.9968 21.947 59.9996H22.01L22.061 59.9816C27.017 57.3956 31.841 54.3416 36.071 50.4266C38.312 48.3536 40.43 46.0016 42.017 43.2536C42.3884 42.6293 42.7113 41.9774 42.983 41.3036C43.0891 41.0951 43.1581 40.8698 43.187 40.6376V9.82461C43.1895 9.77258 43.1713 9.72167 43.1365 9.68293C43.1017 9.64418 43.053 9.62071 43.001 9.61761Z" fill="white"/>
<path d="M9.5784 12.879C8.37841 13.281 7.23842 13.602 6.14042 13.887L5.98441 13.926V27.126C6.12241 27.066 6.26042 27 6.40142 26.943V14.247C7.45742 13.971 8.5404 13.647 9.7014 13.275C13.96 11.8814 17.994 9.87752 21.6774 7.32599C25.2384 10.047 29.5794 12.126 34.9314 13.65C35.8494 13.914 36.7074 14.13 37.5474 14.331V35.631L37.9644 35.754V14.001L37.8024 13.962C36.9024 13.755 36.0024 13.527 35.0454 13.251C29.6784 11.718 25.3524 9.64799 21.8184 6.90599L21.6984 6.81299L21.5724 6.9C17.8868 9.47 13.8437 11.4845 9.5724 12.879L9.63841 13.077L9.5724 12.879H9.5784ZM37.3044 40.125C37.2594 40.215 37.2174 40.293 37.1904 40.35L37.1544 40.419C36.0504 42.333 34.4544 44.247 32.2644 46.272C29.5134 48.816 26.1264 51.201 21.9774 53.553C19.0374 51.9246 16.2439 50.0445 13.6284 47.934C10.8414 45.636 8.86141 43.533 7.38841 41.316C7.26241 41.127 7.12741 40.917 6.99841 40.701C6.84541 40.701 6.69841 40.716 6.54241 40.716H6.51842C6.69242 41.016 6.87242 41.298 7.04042 41.55C8.54042 43.809 10.5564 45.942 13.3644 48.258C16.0301 50.4083 18.8778 52.3225 21.8754 53.979L21.9774 54.036L22.0824 53.979C26.2824 51.597 29.7444 49.179 32.5464 46.581C34.7574 44.535 36.3864 42.588 37.5204 40.626L37.6884 40.293L37.8024 40.071C37.6614 40.047 37.5204 40.023 37.3734 39.993C37.3404 40.044 37.3194 40.086 37.3014 40.125H37.3044ZM39.0624 12.969C37.9224 12.726 36.7194 12.423 35.3994 12.048C29.8764 10.473 25.4994 8.31599 21.9834 5.44799L21.8904 5.36398L21.7614 5.25L21.6264 5.35199C17.8419 8.10829 13.6436 10.2459 9.18841 11.685C7.64041 12.195 6.21841 12.6 4.89241 12.912L4.7334 12.951V27.735L5.1504 27.507V13.284C6.4434 12.984 7.82341 12.579 9.31741 12.084L9.2514 11.886L9.31741 12.084C13.7615 10.6467 17.9525 8.52082 21.7374 5.78399C25.2924 8.68199 29.7294 10.857 35.2854 12.441C36.5484 12.801 37.7064 13.095 38.8104 13.341V35.961L39.2274 36.051V13.005L39.0624 12.969ZM38.6844 40.203C38.5584 40.467 38.4114 40.746 38.2314 41.061C37.0614 43.086 35.3874 45.099 33.1044 47.211C30.1044 49.998 26.4024 52.56 21.9714 55.011C18.7444 53.2573 15.6829 51.2149 12.8244 48.909C9.93841 46.53 7.87739 44.337 6.33539 42.009C6.03539 41.568 5.7624 41.109 5.5224 40.677C5.3544 40.677 5.18639 40.65 5.02439 40.632C5.31443 41.1859 5.63599 41.7228 5.98741 42.24C7.55941 44.604 9.65341 46.827 12.5604 49.224C15.4638 51.5717 18.5769 53.6474 21.8604 55.425L21.9594 55.482L22.0614 55.425C26.5614 52.935 30.3084 50.325 33.3744 47.499C35.6784 45.366 37.3854 43.323 38.5824 41.253C38.7799 40.9168 38.9591 40.5704 39.1194 40.215C38.9784 40.227 38.8314 40.215 38.6784 40.203H38.6844Z" fill="#8E0A3F"/>
<path d="M30.0626 34.2484C29.0216 33.7174 28.0646 33.2344 27.1766 32.7904C27.1766 32.7454 27.1466 32.7094 27.0716 32.6884C26.5796 32.4884 26.1066 32.2664 25.6526 32.0224C25.1986 31.7784 24.7546 31.5414 24.3206 31.3114C24.7586 30.2554 25.2356 29.1784 25.7606 28.0834C26.2856 26.9884 26.8286 25.9264 27.4016 24.8974C27.9746 23.8684 28.5626 22.8904 29.1716 21.9664C29.7313 21.1029 30.3393 20.2715 30.9926 19.4764C31.0338 19.3502 31.0465 19.2164 31.03 19.0847C31.0134 18.9529 30.9678 18.8265 30.8966 18.7144C30.7488 18.4465 30.5548 18.2068 30.3236 18.0064C30.1188 17.8208 29.8872 17.6671 29.6366 17.5504C29.4086 17.4514 29.2676 17.4454 29.2136 17.5294C28.7176 18.2354 28.1876 19.0824 27.6236 20.0704C27.0596 21.0584 26.4836 22.1204 25.8956 23.2564C25.3116 24.3924 24.7436 25.5714 24.1916 26.7934C23.6396 28.0154 23.1316 29.2154 22.6676 30.3934C22.1726 30.1114 21.6776 29.8414 21.1676 29.5894C20.6576 29.3374 20.1656 29.0884 19.6406 28.8484C20.2186 28.0284 20.7486 27.2054 21.2306 26.3794C21.7126 25.5534 22.1296 24.7604 22.4816 24.0004C22.8109 23.3009 23.0905 22.5791 23.3186 21.8404C23.506 21.2491 23.6238 20.638 23.6696 20.0194C23.7019 19.5447 23.6228 19.0691 23.4386 18.6304C23.2641 18.2266 23.0029 17.8661 22.6736 17.5744C22.3281 17.2748 21.9263 17.0474 21.4916 16.9054C21.0079 16.7474 20.5001 16.6763 19.9916 16.6954C19.021 16.7289 18.067 16.9574 17.1866 17.3674C16.2534 17.7921 15.3808 18.3389 14.5916 18.9934C13.7839 19.6591 13.0489 20.4083 12.3986 21.2284C11.7745 22.0038 11.2382 22.8459 10.7996 23.7394C10.6586 24.0214 10.5476 24.2494 10.4696 24.4264C10.3959 24.5923 10.3328 24.7626 10.2806 24.9364C10.2296 25.0984 10.1846 25.2754 10.1426 25.4644C10.1006 25.6534 10.0496 25.8994 9.9926 26.1964C9.9656 26.3074 10.0436 26.3434 10.2266 26.3014C10.4414 26.2481 10.6504 26.1737 10.8506 26.0794C11.0833 25.9749 11.307 25.8514 11.5196 25.7104C11.6747 25.6229 11.8057 25.4981 11.9006 25.3474C12.1831 24.3816 12.5736 23.4508 13.0646 22.5724C13.56 21.6728 14.1734 20.8435 14.8886 20.1064C15.5771 19.3915 16.3776 18.7936 17.2586 18.3364C18.1302 17.8864 19.0977 17.6538 20.0786 17.6584C20.6258 17.6143 21.1722 17.7525 21.6326 18.0514C22.0086 18.3274 22.1676 18.8524 22.1096 19.6264C22.051 20.1346 21.9259 20.6328 21.7376 21.1084C21.4768 21.805 21.1763 22.4861 20.8376 23.1484C20.4636 23.9044 20.0146 24.7044 19.4906 25.5484C18.9666 26.3924 18.3936 27.2564 17.7716 28.1404C16.8337 27.8486 15.872 27.6398 14.8976 27.5164C13.754 27.3789 12.6001 27.3467 11.4506 27.4204C10.2122 27.4931 8.98876 27.7281 7.81159 28.1194C6.66474 28.4909 5.57904 29.0297 4.5896 29.7184C3.67355 30.3486 2.89147 31.1542 2.28858 32.0884C1.71294 32.9825 1.41062 34.0251 1.41861 35.0884C1.41861 36.4864 1.8386 37.4884 2.6786 38.0884C3.5186 38.6884 4.77861 38.9884 6.48261 38.9884C7.52336 38.9637 8.54655 38.715 9.4826 38.2594C10.61 37.7292 11.6754 37.0763 12.6596 36.3124C13.7692 35.4547 14.8113 34.5129 15.7766 33.4954C16.7602 32.462 17.6875 31.3764 18.5546 30.2434C19.7366 30.7624 20.9066 31.2694 22.0766 31.7764C21.6626 32.9344 21.3246 34.0084 21.0626 34.9984C20.8167 35.88 20.6639 36.785 20.6066 37.6984C20.6114 37.8776 20.6632 38.0524 20.7566 38.2054C20.8685 38.4308 20.999 38.6466 21.1466 38.8504C21.2715 39.0269 21.4099 39.1934 21.5606 39.3484C21.6896 39.4774 21.7586 39.4834 21.7736 39.3694C21.9155 38.3217 22.1464 37.288 22.4636 36.2794C22.8096 35.1154 23.2496 33.8604 23.7836 32.5144C26.6876 33.7744 29.6846 35.0974 33.0836 36.7144C40.6976 40.3624 42.4436 37.4764 42.4436 37.4764C42.4436 37.4764 40.5686 39.5974 30.0626 34.2484ZM14.0606 32.6344C13.1822 33.5463 12.2354 34.3897 11.2286 35.1574C10.3212 35.8555 9.33556 36.4455 8.2916 36.9154C7.38053 37.3361 6.39102 37.5599 5.38761 37.5724C5.03765 37.5717 4.68907 37.5284 4.34958 37.4434C3.99526 37.3593 3.65759 37.2163 3.35059 37.0204C3.04009 36.8209 2.77613 36.5569 2.57661 36.2464C2.35952 35.8904 2.23284 35.4866 2.20761 35.0704C2.18155 34.6071 2.28546 34.1458 2.50761 33.7384C2.76468 33.2534 3.09789 32.8128 3.49459 32.4334C3.94939 31.9904 4.45255 31.6 4.99459 31.2694C5.60227 30.8999 6.23711 30.577 6.89361 30.3034C7.58342 30.0183 8.29591 29.7915 9.0236 29.6254C9.75947 29.4574 10.5081 29.3511 11.2616 29.3074C12.2187 29.2484 13.1785 29.2484 14.1356 29.3074C14.9713 29.3672 15.8028 29.4764 16.6256 29.6344C15.8293 30.6832 14.9729 31.6848 14.0606 32.6344Z" fill="#8E0A3F"/>
</g>
<defs>
<clipPath id="clip0_3033_6840">
<rect width="197.143" height="60" fill="white" transform="translate(0.746582)"/>
</clipPath>
</defs>
</svg>
