<svg width="112" height="104" viewBox="0 0 112 104" fill="none" xmlns="http://www.w3.org/2000/svg">
<path d="M0 0V80L80 0H0Z" fill="#F7F3F4"/>
<path d="M98 20H108V100H28V20H80.83" stroke="#0081C6" stroke-width="3" stroke-miterlimit="10"/>
<path d="M68 46.5C79.8741 46.5 89.5 56.1259 89.5 68C89.5 79.8741 79.8741 89.5 68 89.5C56.1259 89.5 46.5 79.8741 46.5 68C46.5 56.1259 56.1259 46.5 68 46.5Z" fill="#0081C6" stroke="#0081C6"/>
<path d="M28 36H108" stroke="#0081C6" stroke-width="3" stroke-miterlimit="10"/>
<path d="M34.0698 28H37.0698" stroke="#0081C6" stroke-width="3" stroke-miterlimit="10"/>
<path d="M41.0298 28H44.0298" stroke="#0081C6" stroke-width="3" stroke-miterlimit="10"/>
<path d="M48 28H51" stroke="#0081C6" stroke-width="3" stroke-miterlimit="10"/>
<path d="M56 67.5H80" stroke="white" stroke-width="3" stroke-miterlimit="10"/>
<path d="M68 79.5V55.5" stroke="white" stroke-width="3" stroke-miterlimit="10"/>
</svg>
