<svg width="112" height="104" viewBox="0 0 112 104" fill="none" xmlns="http://www.w3.org/2000/svg">
<circle cx="40" cy="40" r="40" fill="#F7F3F4"/>
<path d="M68 90C84.5685 90 98 76.5685 98 60C98 43.4315 84.5685 30 68 30C51.4315 30 38 43.4315 38 60C38 76.5685 51.4315 90 68 90Z" fill="#09223D"/>
<path d="M96.3 31.7C88.3 23.8 77.1 19.2 64.8 20.1C44.9 21.7 29.1 38 28.1 57.8C27.4 69.7 32 80.4 39.6 88.1L28 100H67.2C89.3 100 107.8 82.4 108 60.3C108 55.2 107.1 50.3 105.4 45.7" stroke="#09223D" stroke-width="3" stroke-miterlimit="10"/>
<path d="M53 49H83" stroke="white" stroke-width="3" stroke-miterlimit="10"/>
<path d="M53 60H83" stroke="white" stroke-width="3" stroke-miterlimit="10"/>
<path d="M53 72H69" stroke="white" stroke-width="3" stroke-miterlimit="10"/>
</svg>
