<svg width="112" height="104" viewBox="0 0 112 104" fill="none" xmlns="http://www.w3.org/2000/svg">
<circle cx="40" cy="40" r="40" fill="#F7F3F4"/>
<path d="M68 86C82.3594 86 94 74.3594 94 60C94 45.6406 82.3594 34 68 34C53.6406 34 42 45.6406 42 60C42 74.3594 53.6406 86 68 86Z" stroke="#404297" stroke-width="3" stroke-miterlimit="10"/>
<path d="M68 100.001V86.0007C73.1409 85.9988 78.1659 84.4729 82.4398 81.6159C86.7137 78.7588 90.0448 74.6989 92.0119 69.9492C93.9789 65.1995 94.4938 59.9732 93.4914 54.931C92.489 49.8887 90.0142 45.2568 86.38 41.6207L96.28 31.7207C101.872 37.3148 105.681 44.4413 107.223 52.1994C108.766 59.9576 107.974 67.9989 104.947 75.3069C101.92 82.6149 96.7947 88.8614 90.2183 93.2568C83.6419 97.6521 75.91 99.999 68 100.001Z" fill="#404297"/>
<path d="M53.76 22.6105C63.0013 19.0589 73.2302 19.0542 82.4747 22.5972C91.7192 26.1403 99.3249 32.9803 103.825 41.7985C108.326 50.6167 109.402 60.7888 106.847 70.3537C104.293 79.9187 98.2872 88.1991 89.9891 93.5988C81.6911 98.9985 71.6878 101.135 61.9078 99.5966C52.1278 98.0581 43.2636 92.9535 37.0241 85.267C30.7846 77.5804 27.6116 67.8561 28.1168 57.9687C28.622 48.0814 32.7696 38.7311 39.76 31.7205" stroke="#404297" stroke-width="3" stroke-miterlimit="10"/>
<path d="M42 60H28" stroke="#404297" stroke-width="3" stroke-miterlimit="10"/>
</svg>
