<svg version="1.2" xmlns="http://www.w3.org/2000/svg" xmlns:xlink="http://www.w3.org/1999/xlink" overflow="visible" preserveAspectRatio="none" viewBox="0 0 126.69999694824219 58.70000076293945" xml:space="preserve" y="0px" x="0px" id="Layer_1_1578923407364" width="124" height="56"><g transform="translate(1, 1)"><style type="text/css">
	.st0_1578923407364{fill-rule:evenodd;clip-rule:evenodd;fill:#00A6EB;}
	.st1_1578923407364{fill:#E60004;}
	.st2_1578923407364{fill:#FFFFFF;}
</style><g>
	<path d="M72.8,42.5h31.6c0.1,7.8-6.3,10.5-8.4,11.2c-0.4,0.1-0.7,0.1-0.7,0.1H72.9L72.8,42.5L72.8,42.5z M4.9,28.1   h32.2c0.1-7.9-6.5-10.8-8.2-11.1c-0.3-0.1-0.7-0.1-0.7-0.1H5L4.9,28.1L4.9,28.1z M75,51.8l-0.1-7.3l27.4-0.1   c-1.1,5.9-7.4,7.4-7.4,7.4L75,51.8L75,51.8z M6.9,18.8l-0.1,7.3L34.9,26c-0.7-4.3-4.7-6.5-6.2-7.1c-0.3-0.1-0.7-0.1-0.7-0.1H6.9   L6.9,18.8z M104.5,28.1H72.9c0-2.4,0.6-4.3,1.5-5.9c1.5-2.5,3.7-3.7,5.3-4.7c0.6-0.4,1.4-0.5,1.7-0.6c0.3-0.1,0.7-0.1,0.7-0.1h22.4   V28.1L104.5,28.1z M102.5,18.8l0.1,7.3L75,26c0.9-5.2,6.8-7.2,6.8-7.2H102.5L102.5,18.8z M40.9,18.8l-0.1,7.3L68.9,26   c-0.7-4.3-4.6-6.5-6-7.1c-0.3-0.1-0.6-0.1-0.6-0.1H40.9L40.9,18.8z M39,28.1h32.2C71.3,20.2,65,17.6,63,17   c-0.4-0.1-0.6-0.1-0.6-0.1H39.1L39,28.1L39,28.1z M72.8,29.8C72.4,38.2,80,40.6,82,41.1c0.3,0.1,0.5,0,0.5,0h21.8   c-0.5-7.9-6.2-10.5-8-11.2c-0.4-0.1-0.6-0.1-0.6-0.1L72.8,29.8L72.8,29.8z M74.9,31.8c0.9,6.1,7.7,7.3,7.7,7.3l19.2-0.1   c-1.3-6.4-7-7.3-7-7.3L74.9,31.8L74.9,31.8z M38.8,29.8v23.5l11.5,0.1l-0.1-12.2h11.1c1.8,0,4.2-1.4,5.6-2.5   c1.6-1.3,2.6-2.9,3.1-4.3c1-2.4,0.8-4.5,0.8-4.5L38.8,29.8L38.8,29.8z M40.9,31.8v19.9h7.7V39.2h13.2c1.7,0.1,5-2.6,6.1-4.3   s1.3-3.1,1.3-3.1L40.9,31.8L40.9,31.8z M6.8,31.8v19.9h7.7V39.2h13.2c1,0.1,1.5-0.3,2.4-0.9c1.5-0.9,3-2.4,3.6-3.4   c1.1-1.7,1.3-3.1,1.3-3.1L6.8,31.8L6.8,31.8z M4.9,29.8v23.5l11.5,0.1l-0.1-12.2h11.1c1.9-0.1,2.6-0.7,3.6-1.3   c6.4-3.3,6-10.1,6-10.1L4.9,29.8L4.9,29.8z" class="st0_1578923407364" vector-effect="non-scaling-stroke"/>
	<circle r="6" cy="9" cx="113.8" class="st1_1578923407364" vector-effect="non-scaling-stroke"/>
</g><g>
	<path d="M118.6,10.7l-1-0.8c-0.3-0.2-0.7-0.4-1.1-0.4h-0.6V9h0.6c0.5,0,1,0.2,1.4,0.5l1,0.8L118.6,10.7z" class="st2_1578923407364" vector-effect="non-scaling-stroke"/>
</g><g>
	<path d="M113.4,13.5l-0.4-0.3c1.4-1.6,2-2.7,2-2.7c0-0.2,0-0.4-0.2-0.6l-0.5-0.4l0.3-0.4l0.5,0.4   c0.3,0.3,0.4,0.7,0.3,1.1C115.5,10.7,114.9,11.9,113.4,13.5z" class="st2_1578923407364" vector-effect="non-scaling-stroke"/>
</g><g>
	<path d="M110.4,12.9l-0.3-0.4l2.9-1.9c0.1-0.1,0.2-0.2,0.2-0.4l0-0.9l0.5,0l0,0.9c0.1,0.3-0.1,0.7-0.4,0.9L110.4,12.9z" class="st2_1578923407364" vector-effect="non-scaling-stroke"/>
</g><path d="M119.8,8.8c0-0.6-0.1-1.2-0.3-1.7c-1.4-1.3-3.3-1.2-3.9-1.1c-0.5-0.3-1.9-1.2-4.2-0.4c-2.2,0.7-3.2,2.5-3.6,3.9  c0,0.7,0.2,1.3,0.4,1.9c0-0.3,0.3-4,3.4-5c2.3-0.7,3.5,0.3,3.6,0.4l0.2,0.1l0.2,0C115.7,6.8,118.5,6.2,119.8,8.8z" class="st2_1578923407364" vector-effect="non-scaling-stroke"/></g></svg>