<svg width="112" height="104" viewBox="0 0 112 104" fill="none" xmlns="http://www.w3.org/2000/svg">
<circle cx="40" cy="40" r="40" fill="#F7F3F4"/>
<g clip-path="url(#clip0_3241_5381)">
<path d="M85.6401 38.3201C88.5565 45.1972 88.8069 52.9139 86.3425 59.9656C83.8782 67.0173 78.8758 72.8983 72.3108 76.4619C65.7457 80.0256 58.0888 81.0163 50.8329 79.2409C43.5771 77.4656 37.2426 73.0514 33.0647 66.8592C28.8867 60.667 27.1648 53.1406 28.2347 45.7478C29.3047 38.3549 33.0897 31.6256 38.8519 26.872C44.614 22.1183 51.94 19.6812 59.4015 20.0359C66.8629 20.3905 73.9248 23.5114 79.2101 28.7901" stroke="#8BBC08" stroke-width="3" stroke-miterlimit="10"/>
<path d="M58 72C70.1503 72 80 62.1503 80 50C80 37.8497 70.1503 28 58 28C45.8497 28 36 37.8497 36 50C36 62.1503 45.8497 72 58 72Z" fill="#8BBC08"/>
<path d="M108 88.69L91.31 72L80 83.31L96.69 100H103.76L108 95.76V88.69Z" stroke="#8BBC08" stroke-width="3" stroke-miterlimit="10"/>
<path d="M47 40.5H69" stroke="white" stroke-width="3" stroke-miterlimit="10"/>
<path d="M47 49.5H69" stroke="white" stroke-width="3" stroke-miterlimit="10"/>
<path d="M47 59.5H59" stroke="white" stroke-width="3" stroke-miterlimit="10"/>
<path d="M86.0004 77.9995L79.1904 71.1895" stroke="#8BBC08" stroke-width="3" stroke-miterlimit="10"/>
</g>
<defs>
<clipPath id="clip0_3241_5381">
<rect width="88" height="88" fill="white" transform="translate(24 16)"/>
</clipPath>
</defs>
</svg>
