<svg width="301" height="373" viewBox="0 0 301 373" fill="none" xmlns="http://www.w3.org/2000/svg">
<path d="M21.5904 226.85C8.26246 204.11 1.16152 178.261 1.00272 151.904C0.843922 125.547 7.63287 99.6135 20.6859 76.7153C33.7388 53.817 52.595 34.7625 75.3553 21.4705C98.1157 8.17858 123.977 1.11856 150.334 1.00148L151 151L21.5904 226.85Z" fill="#C20653"/>
<path d="M151 1C178.699 1 205.857 8.66967 229.464 23.159C253.072 37.6483 272.206 58.3912 284.746 83.0889C297.287 107.787 302.744 135.474 300.513 163.083C298.281 190.692 288.449 217.145 272.105 239.508L151 151V1Z" fill="#8E0A3F"/>
<circle cx="151" cy="151" r="130" fill="white"/>
<path d="M151 21C170.868 21 190.471 25.5538 208.305 34.3116C226.138 43.0694 241.727 55.7982 253.874 71.5203C266.02 87.2423 274.402 105.539 278.375 125.006C282.347 144.472 281.805 164.591 276.79 183.815L151 151V21Z" fill="#E0CCD1"/>
<circle cx="151" cy="151" r="110" fill="white"/>
<path d="M151 41C177.473 41 203.058 50.547 223.059 67.889C243.061 85.231 256.138 109.205 259.89 135.41L151 151V41Z" fill="#EDE4E6"/>
<circle cx="151" cy="151" r="90" fill="white"/>
<path d="M151 61C171.932 61 192.21 68.2962 208.343 81.633L151 151V61Z" fill="#F7F3F4"/>
<circle cx="150" cy="151" r="70" fill="white"/>
<path d="M90.6247 151.736C91.3847 155.739 93.7154 157.74 97.6167 157.74C100.302 157.74 102.202 156.549 103.317 154.168C104.431 151.787 104.989 147.911 104.989 142.54C103.874 144.111 102.354 145.327 100.429 146.188C98.5034 147.049 96.35 147.48 93.9687 147.48C90.726 147.48 87.838 146.821 85.3047 145.504C82.7714 144.136 80.77 142.135 79.3007 139.5C77.882 136.815 77.1727 133.572 77.1727 129.772C77.1727 126.023 77.9327 122.755 79.4527 119.968C81.0234 117.181 83.2274 115.028 86.0647 113.508C88.9527 111.988 92.3474 111.228 96.2487 111.228C103.747 111.228 108.991 113.559 111.981 118.22C114.97 122.881 116.465 129.747 116.465 138.816C116.465 145.403 115.857 150.849 114.641 155.156C113.475 159.412 111.474 162.655 108.637 164.884C105.85 167.113 102.025 168.228 97.1607 168.228C93.31 168.228 90.0167 167.468 87.2807 165.948C84.5954 164.428 82.518 162.427 81.0487 159.944C79.63 157.461 78.8194 154.725 78.6167 151.736H90.6247ZM96.9327 137.22C99.0607 137.22 100.758 136.587 102.025 135.32C103.291 134.003 103.925 132.229 103.925 130C103.925 127.568 103.266 125.693 101.949 124.376C100.631 123.059 98.858 122.4 96.6287 122.4C94.3994 122.4 92.626 123.084 91.3087 124.452C90.042 125.769 89.4087 127.593 89.4087 129.924C89.4087 132.103 90.042 133.876 91.3087 135.244C92.626 136.561 94.5007 137.22 96.9327 137.22ZM158.815 122.248L139.739 168H126.439L145.743 123.692H122.107V112.596H158.815V122.248ZM163.006 126.504C163.006 122.4 164.172 119.233 166.502 117.004C168.884 114.775 171.949 113.66 175.698 113.66C179.448 113.66 182.488 114.775 184.818 117.004C187.149 119.233 188.314 122.4 188.314 126.504C188.314 130.608 187.149 133.775 184.818 136.004C182.488 138.233 179.448 139.348 175.698 139.348C171.949 139.348 168.884 138.233 166.502 136.004C164.172 133.775 163.006 130.608 163.006 126.504ZM214.61 114.496L185.35 168H172.81L202.07 114.496H214.61ZM175.622 121.26C173.19 121.26 171.974 123.008 171.974 126.504C171.974 129.949 173.19 131.672 175.622 131.672C176.788 131.672 177.7 131.241 178.358 130.38C179.017 129.519 179.346 128.227 179.346 126.504C179.346 123.008 178.105 121.26 175.622 121.26ZM199.182 155.992C199.182 151.888 200.348 148.721 202.678 146.492C205.009 144.263 208.049 143.148 211.798 143.148C215.548 143.148 218.588 144.263 220.918 146.492C223.249 148.721 224.414 151.888 224.414 155.992C224.414 160.096 223.249 163.263 220.918 165.492C218.588 167.721 215.548 168.836 211.798 168.836C208.049 168.836 205.009 167.721 202.678 165.492C200.348 163.263 199.182 160.096 199.182 155.992ZM211.722 150.748C210.557 150.748 209.645 151.179 208.986 152.04C208.378 152.901 208.074 154.219 208.074 155.992C208.074 159.437 209.29 161.16 211.722 161.16C212.888 161.16 213.8 160.729 214.458 159.868C215.117 159.007 215.446 157.715 215.446 155.992C215.446 154.269 215.117 152.977 214.458 152.116C213.8 151.204 212.888 150.748 211.722 150.748Z" fill="#333333"/>
<path d="M99.8896 190.808C100.252 190.52 100.418 190.387 100.386 190.408C101.431 189.544 102.252 188.835 102.85 188.28C103.458 187.725 103.97 187.144 104.386 186.536C104.802 185.928 105.01 185.336 105.01 184.76C105.01 184.323 104.908 183.981 104.706 183.736C104.503 183.491 104.199 183.368 103.794 183.368C103.388 183.368 103.068 183.523 102.834 183.832C102.61 184.131 102.498 184.557 102.498 185.112H99.8576C99.879 184.205 100.071 183.448 100.434 182.84C100.807 182.232 101.292 181.784 101.89 181.496C102.498 181.208 103.17 181.064 103.906 181.064C105.175 181.064 106.13 181.389 106.77 182.04C107.42 182.691 107.746 183.539 107.746 184.584C107.746 185.725 107.356 186.787 106.578 187.768C105.799 188.739 104.807 189.688 103.602 190.616H107.922V192.84H99.8896V190.808ZM117.35 183.704H112.358V185.912C112.572 185.677 112.87 185.485 113.254 185.336C113.638 185.187 114.054 185.112 114.502 185.112C115.302 185.112 115.964 185.293 116.486 185.656C117.02 186.019 117.409 186.488 117.654 187.064C117.9 187.64 118.022 188.264 118.022 188.936C118.022 190.184 117.67 191.176 116.966 191.912C116.262 192.637 115.27 193 113.99 193C113.137 193 112.396 192.856 111.766 192.568C111.137 192.269 110.652 191.859 110.31 191.336C109.969 190.813 109.782 190.211 109.75 189.528H112.422C112.486 189.859 112.641 190.136 112.886 190.36C113.132 190.573 113.468 190.68 113.894 190.68C114.396 190.68 114.769 190.52 115.014 190.2C115.26 189.88 115.382 189.453 115.382 188.92C115.382 188.397 115.254 187.997 114.998 187.72C114.742 187.443 114.369 187.304 113.878 187.304C113.516 187.304 113.217 187.395 112.982 187.576C112.748 187.747 112.593 187.976 112.518 188.264H109.878V181.304H117.35V183.704ZM126.685 186.248V188.52H119.645V186.248H126.685ZM128.878 190.92V188.712L133.934 181.48H136.99V188.552H138.302V190.92H136.99V193H134.254V190.92H128.878ZM134.446 184.488L131.758 188.552H134.446V184.488ZM139.706 190.92V188.712L144.762 181.48H147.818V188.552H149.13V190.92H147.818V193H145.082V190.92H139.706ZM145.274 184.488L142.586 188.552H145.274V184.488ZM161.173 181.768V189.416C161.173 190.6 160.837 191.512 160.165 192.152C159.503 192.792 158.607 193.112 157.477 193.112C156.293 193.112 155.343 192.776 154.629 192.104C153.914 191.432 153.557 190.477 153.557 189.24H156.277C156.277 189.709 156.373 190.067 156.565 190.312C156.757 190.547 157.034 190.664 157.397 190.664C157.727 190.664 157.983 190.557 158.165 190.344C158.346 190.131 158.437 189.821 158.437 189.416V181.768H161.173ZM162.839 188.52C162.839 187.603 163.009 186.797 163.351 186.104C163.703 185.411 164.177 184.877 164.775 184.504C165.372 184.131 166.039 183.944 166.775 183.944C167.404 183.944 167.953 184.072 168.423 184.328C168.903 184.584 169.271 184.92 169.527 185.336V184.072H172.263V193H169.527V191.736C169.26 192.152 168.887 192.488 168.407 192.744C167.937 193 167.388 193.128 166.759 193.128C166.033 193.128 165.372 192.941 164.775 192.568C164.177 192.184 163.703 191.645 163.351 190.952C163.009 190.248 162.839 189.437 162.839 188.52ZM169.527 188.536C169.527 187.853 169.335 187.315 168.951 186.92C168.577 186.525 168.119 186.328 167.575 186.328C167.031 186.328 166.567 186.525 166.183 186.92C165.809 187.304 165.623 187.837 165.623 188.52C165.623 189.203 165.809 189.747 166.183 190.152C166.567 190.547 167.031 190.744 167.575 190.744C168.119 190.744 168.577 190.547 168.951 190.152C169.335 189.757 169.527 189.219 169.527 188.536ZM179.73 183.976C180.754 183.976 181.575 184.317 182.194 185C182.813 185.672 183.122 186.6 183.122 187.784V193H180.402V188.152C180.402 187.555 180.247 187.091 179.938 186.76C179.629 186.429 179.213 186.264 178.69 186.264C178.167 186.264 177.751 186.429 177.442 186.76C177.133 187.091 176.978 187.555 176.978 188.152V193H174.242V181.16H176.978V185.272C177.255 184.877 177.634 184.563 178.114 184.328C178.594 184.093 179.133 183.976 179.73 183.976ZM187.759 185.56C188.079 185.069 188.479 184.685 188.959 184.408C189.439 184.12 189.973 183.976 190.559 183.976V186.872H189.807C189.125 186.872 188.613 187.021 188.271 187.32C187.93 187.608 187.759 188.12 187.759 188.856V193H185.023V184.072H187.759V185.56ZM200.283 188.392C200.283 188.648 200.267 188.915 200.235 189.192H194.043C194.086 189.747 194.262 190.173 194.571 190.472C194.891 190.76 195.28 190.904 195.739 190.904C196.422 190.904 196.896 190.616 197.163 190.04H200.075C199.926 190.627 199.654 191.155 199.259 191.624C198.875 192.093 198.39 192.461 197.803 192.728C197.216 192.995 196.56 193.128 195.835 193.128C194.96 193.128 194.182 192.941 193.499 192.568C192.816 192.195 192.283 191.661 191.899 190.968C191.515 190.275 191.323 189.464 191.323 188.536C191.323 187.608 191.51 186.797 191.883 186.104C192.267 185.411 192.8 184.877 193.483 184.504C194.166 184.131 194.95 183.944 195.835 183.944C196.699 183.944 197.467 184.125 198.139 184.488C198.811 184.851 199.334 185.368 199.707 186.04C200.091 186.712 200.283 187.496 200.283 188.392ZM197.483 187.672C197.483 187.203 197.323 186.829 197.003 186.552C196.683 186.275 196.283 186.136 195.803 186.136C195.344 186.136 194.955 186.269 194.635 186.536C194.326 186.803 194.134 187.181 194.059 187.672H197.483Z" fill="#333333"/>
<path d="M158.206 14.004C158.346 14.7413 158.775 15.11 159.494 15.11C159.989 15.11 160.339 14.8907 160.544 14.452C160.749 14.0133 160.852 13.2993 160.852 12.31C160.647 12.5993 160.367 12.8233 160.012 12.982C159.657 13.1407 159.261 13.22 158.822 13.22C158.225 13.22 157.693 13.0987 157.226 12.856C156.759 12.604 156.391 12.2353 156.12 11.75C155.859 11.2553 155.728 10.658 155.728 9.958C155.728 9.26733 155.868 8.66533 156.148 8.152C156.437 7.63867 156.843 7.242 157.366 6.962C157.898 6.682 158.523 6.542 159.242 6.542C160.623 6.542 161.589 6.97133 162.14 7.83C162.691 8.68867 162.966 9.95333 162.966 11.624C162.966 12.8373 162.854 13.8407 162.63 14.634C162.415 15.418 162.047 16.0153 161.524 16.426C161.011 16.8367 160.306 17.042 159.41 17.042C158.701 17.042 158.094 16.902 157.59 16.622C157.095 16.342 156.713 15.9733 156.442 15.516C156.181 15.0587 156.031 14.5547 155.994 14.004H158.206ZM159.368 11.33C159.76 11.33 160.073 11.2133 160.306 10.98C160.539 10.7373 160.656 10.4107 160.656 10C160.656 9.552 160.535 9.20667 160.292 8.964C160.049 8.72133 159.723 8.6 159.312 8.6C158.901 8.6 158.575 8.726 158.332 8.978C158.099 9.22067 157.982 9.55667 157.982 9.986C157.982 10.3873 158.099 10.714 158.332 10.966C158.575 11.2087 158.92 11.33 159.368 11.33ZM170.767 8.572L167.253 17H164.803L168.359 8.838H164.005V6.794H170.767V8.572Z" fill="white"/>
<path d="M129.118 14.004C129.258 14.7413 129.687 15.11 130.406 15.11C130.901 15.11 131.251 14.8907 131.456 14.452C131.661 14.0133 131.764 13.2993 131.764 12.31C131.559 12.5993 131.279 12.8233 130.924 12.982C130.569 13.1407 130.173 13.22 129.734 13.22C129.137 13.22 128.605 13.0987 128.138 12.856C127.671 12.604 127.303 12.2353 127.032 11.75C126.771 11.2553 126.64 10.658 126.64 9.958C126.64 9.26733 126.78 8.66533 127.06 8.152C127.349 7.63867 127.755 7.242 128.278 6.962C128.81 6.682 129.435 6.542 130.154 6.542C131.535 6.542 132.501 6.97133 133.052 7.83C133.603 8.68867 133.878 9.95333 133.878 11.624C133.878 12.8373 133.766 13.8407 133.542 14.634C133.327 15.418 132.959 16.0153 132.436 16.426C131.923 16.8367 131.218 17.042 130.322 17.042C129.613 17.042 129.006 16.902 128.502 16.622C128.007 16.342 127.625 15.9733 127.354 15.516C127.093 15.0587 126.943 14.5547 126.906 14.004H129.118ZM130.28 11.33C130.672 11.33 130.985 11.2133 131.218 10.98C131.451 10.7373 131.568 10.4107 131.568 10C131.568 9.552 131.447 9.20667 131.204 8.964C130.961 8.72133 130.635 8.6 130.224 8.6C129.813 8.6 129.487 8.726 129.244 8.978C129.011 9.22067 128.894 9.55667 128.894 9.986C128.894 10.3873 129.011 10.714 129.244 10.966C129.487 11.2087 129.832 11.33 130.28 11.33ZM135.211 15.18V13.248L139.635 6.92H142.309V13.108H143.457V15.18H142.309V17H139.915V15.18H135.211ZM140.083 9.552L137.731 13.108H140.083V9.552Z" fill="white"/>
<path d="M158.206 34.004C158.346 34.7413 158.775 35.11 159.494 35.11C159.989 35.11 160.339 34.8907 160.544 34.452C160.749 34.0133 160.852 33.2993 160.852 32.31C160.647 32.5993 160.367 32.8233 160.012 32.982C159.657 33.1407 159.261 33.22 158.822 33.22C158.225 33.22 157.693 33.0987 157.226 32.856C156.759 32.604 156.391 32.2353 156.12 31.75C155.859 31.2553 155.728 30.658 155.728 29.958C155.728 29.2673 155.868 28.6653 156.148 28.152C156.437 27.6387 156.843 27.242 157.366 26.962C157.898 26.682 158.523 26.542 159.242 26.542C160.623 26.542 161.589 26.9713 162.14 27.83C162.691 28.6887 162.966 29.9533 162.966 31.624C162.966 32.8373 162.854 33.8407 162.63 34.634C162.415 35.418 162.047 36.0153 161.524 36.426C161.011 36.8367 160.306 37.042 159.41 37.042C158.701 37.042 158.094 36.902 157.59 36.622C157.095 36.342 156.713 35.9733 156.442 35.516C156.181 35.0587 156.031 34.5547 155.994 34.004H158.206ZM159.368 31.33C159.76 31.33 160.073 31.2133 160.306 30.98C160.539 30.7373 160.656 30.4107 160.656 30C160.656 29.552 160.535 29.2067 160.292 28.964C160.049 28.7213 159.723 28.6 159.312 28.6C158.901 28.6 158.575 28.726 158.332 28.978C158.099 29.2207 157.982 29.5567 157.982 29.986C157.982 30.3873 158.099 30.714 158.332 30.966C158.575 31.2087 158.92 31.33 159.368 31.33ZM163.991 29.006V26.78H167.869V37H165.377V29.006H163.991Z" fill="white"/>
<path d="M157.31 51.512C156.433 51.0453 155.994 50.3127 155.994 49.314C155.994 48.81 156.125 48.3527 156.386 47.942C156.647 47.522 157.044 47.1907 157.576 46.948C158.108 46.696 158.761 46.57 159.536 46.57C160.311 46.57 160.959 46.696 161.482 46.948C162.014 47.1907 162.411 47.522 162.672 47.942C162.933 48.3527 163.064 48.81 163.064 49.314C163.064 49.818 162.943 50.2567 162.7 50.63C162.467 51.0033 162.149 51.2973 161.748 51.512C162.252 51.7547 162.639 52.0907 162.91 52.52C163.181 52.94 163.316 53.4347 163.316 54.004C163.316 54.6667 163.148 55.2407 162.812 55.726C162.476 56.202 162.019 56.566 161.44 56.818C160.871 57.07 160.236 57.196 159.536 57.196C158.836 57.196 158.197 57.07 157.618 56.818C157.049 56.566 156.596 56.202 156.26 55.726C155.924 55.2407 155.756 54.6667 155.756 54.004C155.756 53.4253 155.891 52.926 156.162 52.506C156.433 52.0767 156.815 51.7453 157.31 51.512ZM160.74 49.678C160.74 49.2953 160.628 49.0013 160.404 48.796C160.189 48.5813 159.9 48.474 159.536 48.474C159.172 48.474 158.878 48.5813 158.654 48.796C158.439 49.0107 158.332 49.3093 158.332 49.692C158.332 50.056 158.444 50.3453 158.668 50.56C158.892 50.7653 159.181 50.868 159.536 50.868C159.891 50.868 160.18 50.7607 160.404 50.546C160.628 50.3313 160.74 50.042 160.74 49.678ZM159.536 52.548C159.097 52.548 158.743 52.6693 158.472 52.912C158.201 53.1453 158.066 53.472 158.066 53.892C158.066 54.284 158.197 54.606 158.458 54.858C158.729 55.11 159.088 55.236 159.536 55.236C159.984 55.236 160.334 55.11 160.586 54.858C160.847 54.606 160.978 54.284 160.978 53.892C160.978 53.4813 160.843 53.1547 160.572 52.912C160.311 52.6693 159.965 52.548 159.536 52.548ZM169.762 49.538C169.687 49.1927 169.557 48.936 169.37 48.768C169.183 48.5907 168.917 48.502 168.572 48.502C168.04 48.502 167.657 48.7353 167.424 49.202C167.191 49.6593 167.069 50.3873 167.06 51.386C167.265 51.0593 167.559 50.8027 167.942 50.616C168.334 50.4293 168.763 50.336 169.23 50.336C170.145 50.336 170.877 50.6253 171.428 51.204C171.988 51.7827 172.268 52.59 172.268 53.626C172.268 54.3073 172.128 54.9047 171.848 55.418C171.577 55.9313 171.176 56.3327 170.644 56.622C170.121 56.9113 169.501 57.056 168.782 57.056C167.345 57.056 166.346 56.608 165.786 55.712C165.226 54.8067 164.946 53.5093 164.946 51.82C164.946 50.0467 165.24 48.7307 165.828 47.872C166.425 47.004 167.377 46.57 168.684 46.57C169.384 46.57 169.972 46.71 170.448 46.99C170.933 47.2607 171.297 47.62 171.54 48.068C171.792 48.516 171.941 49.006 171.988 49.538H169.762ZM168.656 52.226C168.255 52.226 167.919 52.3473 167.648 52.59C167.387 52.8233 167.256 53.1593 167.256 53.598C167.256 54.046 167.377 54.396 167.62 54.648C167.872 54.9 168.227 55.026 168.684 55.026C169.095 55.026 169.417 54.9047 169.65 54.662C169.893 54.41 170.014 54.0693 170.014 53.64C170.014 53.2013 169.897 52.856 169.664 52.604C169.431 52.352 169.095 52.226 168.656 52.226Z" fill="white"/>
<path d="M155.686 75.18V73.248L160.11 66.92H162.784V73.108H163.932V75.18H162.784V77H160.39V75.18H155.686ZM160.558 69.552L158.206 73.108H160.558V69.552ZM166.785 71.512C165.907 71.0453 165.469 70.3127 165.469 69.314C165.469 68.81 165.599 68.3527 165.861 67.942C166.122 67.522 166.519 67.1907 167.051 66.948C167.583 66.696 168.236 66.57 169.011 66.57C169.785 66.57 170.434 66.696 170.957 66.948C171.489 67.1907 171.885 67.522 172.147 67.942C172.408 68.3527 172.539 68.81 172.539 69.314C172.539 69.818 172.417 70.2567 172.175 70.63C171.941 71.0033 171.624 71.2973 171.223 71.512C171.727 71.7547 172.114 72.0907 172.385 72.52C172.655 72.94 172.791 73.4347 172.791 74.004C172.791 74.6667 172.623 75.2407 172.287 75.726C171.951 76.202 171.493 76.566 170.915 76.818C170.345 77.07 169.711 77.196 169.011 77.196C168.311 77.196 167.671 77.07 167.093 76.818C166.523 76.566 166.071 76.202 165.735 75.726C165.399 75.2407 165.231 74.6667 165.231 74.004C165.231 73.4253 165.366 72.926 165.637 72.506C165.907 72.0767 166.29 71.7453 166.785 71.512ZM170.215 69.678C170.215 69.2953 170.103 69.0013 169.879 68.796C169.664 68.5813 169.375 68.474 169.011 68.474C168.647 68.474 168.353 68.5813 168.129 68.796C167.914 69.0107 167.807 69.3093 167.807 69.692C167.807 70.056 167.919 70.3453 168.143 70.56C168.367 70.7653 168.656 70.868 169.011 70.868C169.365 70.868 169.655 70.7607 169.879 70.546C170.103 70.3313 170.215 70.042 170.215 69.678ZM169.011 72.548C168.572 72.548 168.217 72.6693 167.947 72.912C167.676 73.1453 167.541 73.472 167.541 73.892C167.541 74.284 167.671 74.606 167.933 74.858C168.203 75.11 168.563 75.236 169.011 75.236C169.459 75.236 169.809 75.11 170.061 74.858C170.322 74.606 170.453 74.284 170.453 73.892C170.453 73.4813 170.317 73.1547 170.047 72.912C169.785 72.6693 169.44 72.548 169.011 72.548Z" fill="white"/>
<circle cx="87" cy="269" r="8" fill="#8E0A3F"/>
<path d="M113.217 274H107.586V273.162L109.842 270.895C110.529 270.199 110.982 269.703 111.201 269.406C111.42 269.109 111.584 268.82 111.693 268.539C111.803 268.258 111.857 267.955 111.857 267.631C111.857 267.174 111.719 266.812 111.441 266.547C111.164 266.277 110.779 266.143 110.287 266.143C109.932 266.143 109.594 266.201 109.273 266.318C108.957 266.436 108.604 266.648 108.213 266.957L107.697 266.295C108.486 265.639 109.346 265.311 110.275 265.311C111.08 265.311 111.711 265.518 112.168 265.932C112.625 266.342 112.854 266.895 112.854 267.59C112.854 268.133 112.701 268.67 112.396 269.201C112.092 269.732 111.521 270.404 110.686 271.217L108.811 273.051V273.098H113.217V274ZM117.131 268.768C118.033 268.768 118.742 268.992 119.258 269.441C119.777 269.887 120.037 270.498 120.037 271.275C120.037 272.162 119.754 272.857 119.188 273.361C118.625 273.865 117.848 274.117 116.855 274.117C115.891 274.117 115.154 273.963 114.646 273.654V272.717C114.92 272.893 115.26 273.031 115.666 273.133C116.072 273.23 116.473 273.279 116.867 273.279C117.555 273.279 118.088 273.117 118.467 272.793C118.85 272.469 119.041 272 119.041 271.387C119.041 270.191 118.309 269.594 116.844 269.594C116.473 269.594 115.977 269.65 115.355 269.764L114.852 269.441L115.174 265.434H119.434V266.33H116.006L115.789 268.902C116.238 268.812 116.686 268.768 117.131 268.768ZM121.227 271.229V270.338H124.104V271.229H121.227ZM131.223 272.031H129.951V274H129.02V272.031H124.854V271.182L128.92 265.387H129.951V271.146H131.223V272.031ZM129.02 271.146V268.299C129.02 267.74 129.039 267.109 129.078 266.406H129.031C128.844 266.781 128.668 267.092 128.504 267.338L125.826 271.146H129.02ZM138.09 272.031H136.818V274H135.887V272.031H131.721V271.182L135.787 265.387H136.818V271.146H138.09V272.031ZM135.887 271.146V268.299C135.887 267.74 135.906 267.109 135.945 266.406H135.898C135.711 266.781 135.535 267.092 135.371 267.338L132.693 271.146H135.887ZM141.383 276.256C141.016 276.256 140.727 276.203 140.516 276.098V275.248C140.793 275.326 141.082 275.365 141.383 275.365C141.77 275.365 142.062 275.248 142.262 275.014C142.465 274.779 142.566 274.441 142.566 274V265.434H143.562V273.918C143.562 274.66 143.375 275.234 143 275.641C142.625 276.051 142.086 276.256 141.383 276.256ZM149.645 274L149.451 273.086H149.404C149.084 273.488 148.764 273.762 148.443 273.906C148.127 274.047 147.73 274.117 147.254 274.117C146.617 274.117 146.117 273.953 145.754 273.625C145.395 273.297 145.215 272.83 145.215 272.225C145.215 270.928 146.252 270.248 148.326 270.186L149.416 270.15V269.752C149.416 269.248 149.307 268.877 149.088 268.639C148.873 268.396 148.527 268.275 148.051 268.275C147.516 268.275 146.91 268.439 146.234 268.768L145.936 268.023C146.252 267.852 146.598 267.717 146.973 267.619C147.352 267.521 147.73 267.473 148.109 267.473C148.875 267.473 149.441 267.643 149.809 267.982C150.18 268.322 150.365 268.867 150.365 269.617V274H149.645ZM147.447 273.314C148.053 273.314 148.527 273.148 148.871 272.816C149.219 272.484 149.393 272.02 149.393 271.422V270.842L148.42 270.883C147.646 270.91 147.088 271.031 146.744 271.246C146.404 271.457 146.234 271.787 146.234 272.236C146.234 272.588 146.34 272.855 146.551 273.039C146.766 273.223 147.064 273.314 147.447 273.314ZM156.77 274V269.846C156.77 269.322 156.65 268.932 156.412 268.674C156.174 268.416 155.801 268.287 155.293 268.287C154.617 268.287 154.123 268.471 153.811 268.838C153.502 269.205 153.348 269.807 153.348 270.643V274H152.375V264.883H153.348V267.643C153.348 267.975 153.332 268.25 153.301 268.469H153.359C153.551 268.16 153.822 267.918 154.174 267.742C154.529 267.562 154.934 267.473 155.387 267.473C156.172 267.473 156.76 267.66 157.15 268.035C157.545 268.406 157.742 268.998 157.742 269.811V274H156.77ZM162.676 267.461C162.961 267.461 163.217 267.484 163.443 267.531L163.309 268.434C163.043 268.375 162.809 268.346 162.605 268.346C162.086 268.346 161.641 268.557 161.27 268.979C160.902 269.4 160.719 269.926 160.719 270.555V274H159.746V267.578H160.549L160.66 268.768H160.707C160.945 268.35 161.232 268.027 161.568 267.801C161.904 267.574 162.273 267.461 162.676 267.461ZM167.357 274.117C166.408 274.117 165.658 273.828 165.107 273.25C164.561 272.672 164.287 271.869 164.287 270.842C164.287 269.807 164.541 268.984 165.049 268.375C165.561 267.766 166.246 267.461 167.105 267.461C167.91 267.461 168.547 267.727 169.016 268.258C169.484 268.785 169.719 269.482 169.719 270.35V270.965H165.295C165.314 271.719 165.504 272.291 165.863 272.682C166.227 273.072 166.736 273.268 167.393 273.268C168.084 273.268 168.768 273.123 169.443 272.834V273.701C169.1 273.85 168.773 273.955 168.465 274.018C168.16 274.084 167.791 274.117 167.357 274.117ZM167.094 268.275C166.578 268.275 166.166 268.443 165.857 268.779C165.553 269.115 165.373 269.58 165.318 270.174H168.676C168.676 269.561 168.539 269.092 168.266 268.768C167.992 268.439 167.602 268.275 167.094 268.275Z" fill="#A3A3A3"/>
<circle cx="87" cy="293" r="8" fill="#E0CCD1"/>
<path d="M113.621 296.031H112.35V298H111.418V296.031H107.252V295.182L111.318 289.387H112.35V295.146H113.621V296.031ZM111.418 295.146V292.299C111.418 291.74 111.438 291.109 111.477 290.406H111.43C111.242 290.781 111.066 291.092 110.902 291.338L108.225 295.146H111.418ZM117.131 292.768C118.033 292.768 118.742 292.992 119.258 293.441C119.777 293.887 120.037 294.498 120.037 295.275C120.037 296.162 119.754 296.857 119.188 297.361C118.625 297.865 117.848 298.117 116.855 298.117C115.891 298.117 115.154 297.963 114.646 297.654V296.717C114.92 296.893 115.26 297.031 115.666 297.133C116.072 297.23 116.473 297.279 116.867 297.279C117.555 297.279 118.088 297.117 118.467 296.793C118.85 296.469 119.041 296 119.041 295.387C119.041 294.191 118.309 293.594 116.844 293.594C116.473 293.594 115.977 293.65 115.355 293.764L114.852 293.441L115.174 289.434H119.434V290.33H116.006L115.789 292.902C116.238 292.812 116.686 292.768 117.131 292.768ZM121.227 295.229V294.338H124.104V295.229H121.227ZM125.287 294.338C125.287 292.654 125.613 291.396 126.266 290.564C126.922 289.729 127.891 289.311 129.172 289.311C129.613 289.311 129.961 289.348 130.215 289.422V290.26C129.914 290.162 129.57 290.113 129.184 290.113C128.266 290.113 127.564 290.4 127.08 290.975C126.596 291.545 126.33 292.443 126.283 293.67H126.354C126.783 292.998 127.463 292.662 128.393 292.662C129.162 292.662 129.768 292.895 130.209 293.359C130.654 293.824 130.877 294.455 130.877 295.252C130.877 296.143 130.633 296.844 130.145 297.355C129.66 297.863 129.004 298.117 128.176 298.117C127.289 298.117 126.586 297.785 126.066 297.121C125.547 296.453 125.287 295.525 125.287 294.338ZM128.164 297.291C128.719 297.291 129.148 297.117 129.453 296.77C129.762 296.418 129.916 295.912 129.916 295.252C129.916 294.686 129.773 294.24 129.488 293.916C129.203 293.592 128.777 293.43 128.211 293.43C127.859 293.43 127.537 293.502 127.244 293.646C126.951 293.791 126.717 293.99 126.541 294.244C126.369 294.498 126.283 294.762 126.283 295.035C126.283 295.438 126.361 295.812 126.518 296.16C126.674 296.508 126.895 296.783 127.18 296.986C127.469 297.189 127.797 297.291 128.164 297.291ZM138.09 296.031H136.818V298H135.887V296.031H131.721V295.182L135.787 289.387H136.818V295.146H138.09V296.031ZM135.887 295.146V292.299C135.887 291.74 135.906 291.109 135.945 290.406H135.898C135.711 290.781 135.535 291.092 135.371 291.338L132.693 295.146H135.887ZM141.383 300.256C141.016 300.256 140.727 300.203 140.516 300.098V299.248C140.793 299.326 141.082 299.365 141.383 299.365C141.77 299.365 142.062 299.248 142.262 299.014C142.465 298.779 142.566 298.441 142.566 298V289.434H143.562V297.918C143.562 298.66 143.375 299.234 143 299.641C142.625 300.051 142.086 300.256 141.383 300.256ZM149.645 298L149.451 297.086H149.404C149.084 297.488 148.764 297.762 148.443 297.906C148.127 298.047 147.73 298.117 147.254 298.117C146.617 298.117 146.117 297.953 145.754 297.625C145.395 297.297 145.215 296.83 145.215 296.225C145.215 294.928 146.252 294.248 148.326 294.186L149.416 294.15V293.752C149.416 293.248 149.307 292.877 149.088 292.639C148.873 292.396 148.527 292.275 148.051 292.275C147.516 292.275 146.91 292.439 146.234 292.768L145.936 292.023C146.252 291.852 146.598 291.717 146.973 291.619C147.352 291.521 147.73 291.473 148.109 291.473C148.875 291.473 149.441 291.643 149.809 291.982C150.18 292.322 150.365 292.867 150.365 293.617V298H149.645ZM147.447 297.314C148.053 297.314 148.527 297.148 148.871 296.816C149.219 296.484 149.393 296.02 149.393 295.422V294.842L148.42 294.883C147.646 294.91 147.088 295.031 146.744 295.246C146.404 295.457 146.234 295.787 146.234 296.236C146.234 296.588 146.34 296.855 146.551 297.039C146.766 297.223 147.064 297.314 147.447 297.314ZM156.77 298V293.846C156.77 293.322 156.65 292.932 156.412 292.674C156.174 292.416 155.801 292.287 155.293 292.287C154.617 292.287 154.123 292.471 153.811 292.838C153.502 293.205 153.348 293.807 153.348 294.643V298H152.375V288.883H153.348V291.643C153.348 291.975 153.332 292.25 153.301 292.469H153.359C153.551 292.16 153.822 291.918 154.174 291.742C154.529 291.562 154.934 291.473 155.387 291.473C156.172 291.473 156.76 291.66 157.15 292.035C157.545 292.406 157.742 292.998 157.742 293.811V298H156.77ZM162.676 291.461C162.961 291.461 163.217 291.484 163.443 291.531L163.309 292.434C163.043 292.375 162.809 292.346 162.605 292.346C162.086 292.346 161.641 292.557 161.27 292.979C160.902 293.4 160.719 293.926 160.719 294.555V298H159.746V291.578H160.549L160.66 292.768H160.707C160.945 292.35 161.232 292.027 161.568 291.801C161.904 291.574 162.273 291.461 162.676 291.461ZM167.357 298.117C166.408 298.117 165.658 297.828 165.107 297.25C164.561 296.672 164.287 295.869 164.287 294.842C164.287 293.807 164.541 292.984 165.049 292.375C165.561 291.766 166.246 291.461 167.105 291.461C167.91 291.461 168.547 291.727 169.016 292.258C169.484 292.785 169.719 293.482 169.719 294.35V294.965H165.295C165.314 295.719 165.504 296.291 165.863 296.682C166.227 297.072 166.736 297.268 167.393 297.268C168.084 297.268 168.768 297.123 169.443 296.834V297.701C169.1 297.85 168.773 297.955 168.465 298.018C168.16 298.084 167.791 298.117 167.357 298.117ZM167.094 292.275C166.578 292.275 166.166 292.443 165.857 292.779C165.553 293.115 165.373 293.58 165.318 294.174H168.676C168.676 293.561 168.539 293.092 168.266 292.768C167.992 292.439 167.602 292.275 167.094 292.275Z" fill="#A3A3A3"/>
<circle cx="87" cy="317" r="8" fill="#EDE4E6"/>
<path d="M107.686 318.338C107.686 316.654 108.012 315.396 108.664 314.564C109.32 313.729 110.289 313.311 111.57 313.311C112.012 313.311 112.359 313.348 112.613 313.422V314.26C112.312 314.162 111.969 314.113 111.582 314.113C110.664 314.113 109.963 314.4 109.479 314.975C108.994 315.545 108.729 316.443 108.682 317.67H108.752C109.182 316.998 109.861 316.662 110.791 316.662C111.561 316.662 112.166 316.895 112.607 317.359C113.053 317.824 113.275 318.455 113.275 319.252C113.275 320.143 113.031 320.844 112.543 321.355C112.059 321.863 111.402 322.117 110.574 322.117C109.688 322.117 108.984 321.785 108.465 321.121C107.945 320.453 107.686 319.525 107.686 318.338ZM110.562 321.291C111.117 321.291 111.547 321.117 111.852 320.77C112.16 320.418 112.314 319.912 112.314 319.252C112.314 318.686 112.172 318.24 111.887 317.916C111.602 317.592 111.176 317.43 110.609 317.43C110.258 317.43 109.936 317.502 109.643 317.646C109.35 317.791 109.115 317.99 108.939 318.244C108.768 318.498 108.682 318.762 108.682 319.035C108.682 319.438 108.76 319.812 108.916 320.16C109.072 320.508 109.293 320.783 109.578 320.986C109.867 321.189 110.195 321.291 110.562 321.291ZM117.131 316.768C118.033 316.768 118.742 316.992 119.258 317.441C119.777 317.887 120.037 318.498 120.037 319.275C120.037 320.162 119.754 320.857 119.188 321.361C118.625 321.865 117.848 322.117 116.855 322.117C115.891 322.117 115.154 321.963 114.646 321.654V320.717C114.92 320.893 115.26 321.031 115.666 321.133C116.072 321.23 116.473 321.279 116.867 321.279C117.555 321.279 118.088 321.117 118.467 320.793C118.85 320.469 119.041 320 119.041 319.387C119.041 318.191 118.309 317.594 116.844 317.594C116.473 317.594 115.977 317.65 115.355 317.764L114.852 317.441L115.174 313.434H119.434V314.33H116.006L115.789 316.902C116.238 316.812 116.686 316.768 117.131 316.768ZM123.781 324.256C123.414 324.256 123.125 324.203 122.914 324.098V323.248C123.191 323.326 123.48 323.365 123.781 323.365C124.168 323.365 124.461 323.248 124.66 323.014C124.863 322.779 124.965 322.441 124.965 322V313.434H125.961V321.918C125.961 322.66 125.773 323.234 125.398 323.641C125.023 324.051 124.484 324.256 123.781 324.256ZM132.043 322L131.85 321.086H131.803C131.482 321.488 131.162 321.762 130.842 321.906C130.525 322.047 130.129 322.117 129.652 322.117C129.016 322.117 128.516 321.953 128.152 321.625C127.793 321.297 127.613 320.83 127.613 320.225C127.613 318.928 128.65 318.248 130.725 318.186L131.814 318.15V317.752C131.814 317.248 131.705 316.877 131.486 316.639C131.271 316.396 130.926 316.275 130.449 316.275C129.914 316.275 129.309 316.439 128.633 316.768L128.334 316.023C128.65 315.852 128.996 315.717 129.371 315.619C129.75 315.521 130.129 315.473 130.508 315.473C131.273 315.473 131.84 315.643 132.207 315.982C132.578 316.322 132.764 316.867 132.764 317.617V322H132.043ZM129.846 321.314C130.451 321.314 130.926 321.148 131.27 320.816C131.617 320.484 131.791 320.02 131.791 319.422V318.842L130.818 318.883C130.045 318.91 129.486 319.031 129.143 319.246C128.803 319.457 128.633 319.787 128.633 320.236C128.633 320.588 128.738 320.855 128.949 321.039C129.164 321.223 129.463 321.314 129.846 321.314ZM139.168 322V317.846C139.168 317.322 139.049 316.932 138.811 316.674C138.572 316.416 138.199 316.287 137.691 316.287C137.016 316.287 136.521 316.471 136.209 316.838C135.9 317.205 135.746 317.807 135.746 318.643V322H134.773V312.883H135.746V315.643C135.746 315.975 135.73 316.25 135.699 316.469H135.758C135.949 316.16 136.221 315.918 136.572 315.742C136.928 315.562 137.332 315.473 137.785 315.473C138.57 315.473 139.158 315.66 139.549 316.035C139.943 316.406 140.141 316.998 140.141 317.811V322H139.168ZM145.074 315.461C145.359 315.461 145.615 315.484 145.842 315.531L145.707 316.434C145.441 316.375 145.207 316.346 145.004 316.346C144.484 316.346 144.039 316.557 143.668 316.979C143.301 317.4 143.117 317.926 143.117 318.555V322H142.145V315.578H142.947L143.059 316.768H143.105C143.344 316.35 143.631 316.027 143.967 315.801C144.303 315.574 144.672 315.461 145.074 315.461ZM149.756 322.117C148.807 322.117 148.057 321.828 147.506 321.25C146.959 320.672 146.686 319.869 146.686 318.842C146.686 317.807 146.939 316.984 147.447 316.375C147.959 315.766 148.645 315.461 149.504 315.461C150.309 315.461 150.945 315.727 151.414 316.258C151.883 316.785 152.117 317.482 152.117 318.35V318.965H147.693C147.713 319.719 147.902 320.291 148.262 320.682C148.625 321.072 149.135 321.268 149.791 321.268C150.482 321.268 151.166 321.123 151.842 320.834V321.701C151.498 321.85 151.172 321.955 150.863 322.018C150.559 322.084 150.189 322.117 149.756 322.117ZM149.492 316.275C148.977 316.275 148.564 316.443 148.256 316.779C147.951 317.115 147.771 317.58 147.717 318.174H151.074C151.074 317.561 150.938 317.092 150.664 316.768C150.391 316.439 150 316.275 149.492 316.275ZM157.812 315.578V319.744C157.812 320.268 157.932 320.658 158.17 320.916C158.408 321.174 158.781 321.303 159.289 321.303C159.961 321.303 160.451 321.119 160.76 320.752C161.072 320.385 161.229 319.785 161.229 318.953V315.578H162.201V322H161.398L161.258 321.139H161.205C161.006 321.455 160.729 321.697 160.373 321.865C160.021 322.033 159.619 322.117 159.166 322.117C158.385 322.117 157.799 321.932 157.408 321.561C157.021 321.189 156.828 320.596 156.828 319.779V315.578H157.812ZM168.664 322V317.846C168.664 317.322 168.545 316.932 168.307 316.674C168.068 316.416 167.695 316.287 167.188 316.287C166.516 316.287 166.023 316.469 165.711 316.832C165.398 317.195 165.242 317.795 165.242 318.631V322H164.27V315.578H165.061L165.219 316.457H165.266C165.465 316.141 165.744 315.896 166.104 315.725C166.463 315.549 166.863 315.461 167.305 315.461C168.078 315.461 168.66 315.648 169.051 316.023C169.441 316.395 169.637 316.99 169.637 317.811V322H168.664ZM176.012 321.139H175.959C175.51 321.791 174.838 322.117 173.943 322.117C173.104 322.117 172.449 321.83 171.98 321.256C171.516 320.682 171.283 319.865 171.283 318.807C171.283 317.748 171.518 316.926 171.986 316.34C172.455 315.754 173.107 315.461 173.943 315.461C174.814 315.461 175.482 315.777 175.947 316.41H176.023L175.982 315.947L175.959 315.496V312.883H176.932V322H176.141L176.012 321.139ZM174.066 321.303C174.73 321.303 175.211 321.123 175.508 320.764C175.809 320.4 175.959 319.816 175.959 319.012V318.807C175.959 317.896 175.807 317.248 175.502 316.861C175.201 316.471 174.719 316.275 174.055 316.275C173.484 316.275 173.047 316.498 172.742 316.943C172.441 317.385 172.291 318.01 172.291 318.818C172.291 319.639 172.441 320.258 172.742 320.676C173.043 321.094 173.484 321.303 174.066 321.303ZM186.066 322L185.873 321.086H185.826C185.506 321.488 185.186 321.762 184.865 321.906C184.549 322.047 184.152 322.117 183.676 322.117C183.039 322.117 182.539 321.953 182.176 321.625C181.816 321.297 181.637 320.83 181.637 320.225C181.637 318.928 182.674 318.248 184.748 318.186L185.838 318.15V317.752C185.838 317.248 185.729 316.877 185.51 316.639C185.295 316.396 184.949 316.275 184.473 316.275C183.938 316.275 183.332 316.439 182.656 316.768L182.357 316.023C182.674 315.852 183.02 315.717 183.395 315.619C183.773 315.521 184.152 315.473 184.531 315.473C185.297 315.473 185.863 315.643 186.23 315.982C186.602 316.322 186.787 316.867 186.787 317.617V322H186.066ZM183.869 321.314C184.475 321.314 184.949 321.148 185.293 320.816C185.641 320.484 185.814 320.02 185.814 319.422V318.842L184.842 318.883C184.068 318.91 183.51 319.031 183.166 319.246C182.826 319.457 182.656 319.787 182.656 320.236C182.656 320.588 182.762 320.855 182.973 321.039C183.188 321.223 183.486 321.314 183.869 321.314ZM182.721 313.838C182.721 313.635 182.771 313.488 182.873 313.398C182.979 313.309 183.104 313.264 183.248 313.264C183.396 313.264 183.523 313.309 183.629 313.398C183.738 313.488 183.793 313.635 183.793 313.838C183.793 314.033 183.738 314.18 183.629 314.277C183.523 314.371 183.396 314.418 183.248 314.418C183.104 314.418 182.979 314.371 182.873 314.277C182.771 314.18 182.721 314.033 182.721 313.838ZM184.953 313.838C184.953 313.635 185.004 313.488 185.105 313.398C185.211 313.309 185.336 313.264 185.48 313.264C185.625 313.264 185.75 313.309 185.855 313.398C185.965 313.488 186.02 313.635 186.02 313.838C186.02 314.033 185.965 314.18 185.855 314.277C185.75 314.371 185.625 314.418 185.48 314.418C185.336 314.418 185.211 314.371 185.105 314.277C185.004 314.18 184.953 314.033 184.953 313.838ZM189.77 322H188.797V312.883H189.77V322ZM193.906 321.314C194.078 321.314 194.244 321.303 194.404 321.279C194.564 321.252 194.691 321.225 194.785 321.197V321.941C194.68 321.992 194.523 322.033 194.316 322.064C194.113 322.1 193.93 322.117 193.766 322.117C192.523 322.117 191.902 321.463 191.902 320.154V316.334H190.982V315.865L191.902 315.461L192.312 314.09H192.875V315.578H194.738V316.334H192.875V320.113C192.875 320.5 192.967 320.797 193.15 321.004C193.334 321.211 193.586 321.314 193.906 321.314ZM198.787 322.117C197.838 322.117 197.088 321.828 196.537 321.25C195.99 320.672 195.717 319.869 195.717 318.842C195.717 317.807 195.971 316.984 196.479 316.375C196.99 315.766 197.676 315.461 198.535 315.461C199.34 315.461 199.977 315.727 200.445 316.258C200.914 316.785 201.148 317.482 201.148 318.35V318.965H196.725C196.744 319.719 196.934 320.291 197.293 320.682C197.656 321.072 198.166 321.268 198.822 321.268C199.514 321.268 200.197 321.123 200.873 320.834V321.701C200.529 321.85 200.203 321.955 199.895 322.018C199.59 322.084 199.221 322.117 198.787 322.117ZM198.523 316.275C198.008 316.275 197.596 316.443 197.287 316.779C196.982 317.115 196.803 317.58 196.748 318.174H200.105C200.105 317.561 199.969 317.092 199.695 316.768C199.422 316.439 199.031 316.275 198.523 316.275ZM205.742 315.461C206.027 315.461 206.283 315.484 206.51 315.531L206.375 316.434C206.109 316.375 205.875 316.346 205.672 316.346C205.152 316.346 204.707 316.557 204.336 316.979C203.969 317.4 203.785 317.926 203.785 318.555V322H202.812V315.578H203.615L203.727 316.768H203.773C204.012 316.35 204.299 316.027 204.635 315.801C204.971 315.574 205.34 315.461 205.742 315.461Z" fill="#A3A3A3"/>
<circle cx="87" cy="341" r="8" fill="#F7F3F4"/>
<path d="M111.189 346H110.24V339.895C110.24 339.387 110.256 338.906 110.287 338.453C110.205 338.535 110.113 338.621 110.012 338.711C109.91 338.801 109.445 339.182 108.617 339.854L108.102 339.186L110.369 337.434H111.189V346ZM120.131 341.705C120.131 343.186 119.896 344.291 119.428 345.021C118.963 345.752 118.25 346.117 117.289 346.117C116.367 346.117 115.666 345.744 115.186 344.998C114.705 344.248 114.465 343.15 114.465 341.705C114.465 340.213 114.697 339.105 115.162 338.383C115.627 337.66 116.336 337.299 117.289 337.299C118.219 337.299 118.924 337.676 119.404 338.43C119.889 339.184 120.131 340.275 120.131 341.705ZM115.449 341.705C115.449 342.951 115.596 343.859 115.889 344.43C116.182 344.996 116.648 345.279 117.289 345.279C117.938 345.279 118.406 344.992 118.695 344.418C118.988 343.84 119.135 342.936 119.135 341.705C119.135 340.475 118.988 339.574 118.695 339.004C118.406 338.43 117.938 338.143 117.289 338.143C116.648 338.143 116.182 338.426 115.889 338.992C115.596 339.555 115.449 340.459 115.449 341.705ZM121.227 343.229V342.338H124.104V343.229H121.227ZM128.791 346H127.842V339.895C127.842 339.387 127.857 338.906 127.889 338.453C127.807 338.535 127.715 338.621 127.613 338.711C127.512 338.801 127.047 339.182 126.219 339.854L125.703 339.186L127.971 337.434H128.791V346ZM134.732 340.768C135.635 340.768 136.344 340.992 136.859 341.441C137.379 341.887 137.639 342.498 137.639 343.275C137.639 344.162 137.355 344.857 136.789 345.361C136.227 345.865 135.449 346.117 134.457 346.117C133.492 346.117 132.756 345.963 132.248 345.654V344.717C132.521 344.893 132.861 345.031 133.268 345.133C133.674 345.23 134.074 345.279 134.469 345.279C135.156 345.279 135.689 345.117 136.068 344.793C136.451 344.469 136.643 344 136.643 343.387C136.643 342.191 135.91 341.594 134.445 341.594C134.074 341.594 133.578 341.65 132.957 341.764L132.453 341.441L132.775 337.434H137.035V338.33H133.607L133.391 340.902C133.84 340.812 134.287 340.768 134.732 340.768ZM141.383 348.256C141.016 348.256 140.727 348.203 140.516 348.098V347.248C140.793 347.326 141.082 347.365 141.383 347.365C141.77 347.365 142.062 347.248 142.262 347.014C142.465 346.779 142.566 346.441 142.566 346V337.434H143.562V345.918C143.562 346.66 143.375 347.234 143 347.641C142.625 348.051 142.086 348.256 141.383 348.256ZM149.645 346L149.451 345.086H149.404C149.084 345.488 148.764 345.762 148.443 345.906C148.127 346.047 147.73 346.117 147.254 346.117C146.617 346.117 146.117 345.953 145.754 345.625C145.395 345.297 145.215 344.83 145.215 344.225C145.215 342.928 146.252 342.248 148.326 342.186L149.416 342.15V341.752C149.416 341.248 149.307 340.877 149.088 340.639C148.873 340.396 148.527 340.275 148.051 340.275C147.516 340.275 146.91 340.439 146.234 340.768L145.936 340.023C146.252 339.852 146.598 339.717 146.973 339.619C147.352 339.521 147.73 339.473 148.109 339.473C148.875 339.473 149.441 339.643 149.809 339.982C150.18 340.322 150.365 340.867 150.365 341.617V346H149.645ZM147.447 345.314C148.053 345.314 148.527 345.148 148.871 344.816C149.219 344.484 149.393 344.02 149.393 343.422V342.842L148.42 342.883C147.646 342.91 147.088 343.031 146.744 343.246C146.404 343.457 146.234 343.787 146.234 344.236C146.234 344.588 146.34 344.855 146.551 345.039C146.766 345.223 147.064 345.314 147.447 345.314ZM156.77 346V341.846C156.77 341.322 156.65 340.932 156.412 340.674C156.174 340.416 155.801 340.287 155.293 340.287C154.617 340.287 154.123 340.471 153.811 340.838C153.502 341.205 153.348 341.807 153.348 342.643V346H152.375V336.883H153.348V339.643C153.348 339.975 153.332 340.25 153.301 340.469H153.359C153.551 340.16 153.822 339.918 154.174 339.742C154.529 339.562 154.934 339.473 155.387 339.473C156.172 339.473 156.76 339.66 157.15 340.035C157.545 340.406 157.742 340.998 157.742 341.811V346H156.77ZM162.676 339.461C162.961 339.461 163.217 339.484 163.443 339.531L163.309 340.434C163.043 340.375 162.809 340.346 162.605 340.346C162.086 340.346 161.641 340.557 161.27 340.979C160.902 341.4 160.719 341.926 160.719 342.555V346H159.746V339.578H160.549L160.66 340.768H160.707C160.945 340.35 161.232 340.027 161.568 339.801C161.904 339.574 162.273 339.461 162.676 339.461ZM167.357 346.117C166.408 346.117 165.658 345.828 165.107 345.25C164.561 344.672 164.287 343.869 164.287 342.842C164.287 341.807 164.541 340.984 165.049 340.375C165.561 339.766 166.246 339.461 167.105 339.461C167.91 339.461 168.547 339.727 169.016 340.258C169.484 340.785 169.719 341.482 169.719 342.35V342.965H165.295C165.314 343.719 165.504 344.291 165.863 344.682C166.227 345.072 166.736 345.268 167.393 345.268C168.084 345.268 168.768 345.123 169.443 344.834V345.701C169.1 345.85 168.773 345.955 168.465 346.018C168.16 346.084 167.791 346.117 167.357 346.117ZM167.094 340.275C166.578 340.275 166.166 340.443 165.857 340.779C165.553 341.115 165.373 341.58 165.318 342.174H168.676C168.676 341.561 168.539 341.092 168.266 340.768C167.992 340.439 167.602 340.275 167.094 340.275Z" fill="#A3A3A3"/>
<circle cx="87" cy="365" r="8" fill="#C20653"/>
<path d="M111.189 370H110.24V363.895C110.24 363.387 110.256 362.906 110.287 362.453C110.205 362.535 110.113 362.621 110.012 362.711C109.91 362.801 109.445 363.182 108.617 363.854L108.102 363.186L110.369 361.434H111.189V370ZM114.553 366.338C114.553 364.654 114.879 363.396 115.531 362.564C116.188 361.729 117.156 361.311 118.438 361.311C118.879 361.311 119.227 361.348 119.48 361.422V362.26C119.18 362.162 118.836 362.113 118.449 362.113C117.531 362.113 116.83 362.4 116.346 362.975C115.861 363.545 115.596 364.443 115.549 365.67H115.619C116.049 364.998 116.729 364.662 117.658 364.662C118.428 364.662 119.033 364.895 119.475 365.359C119.92 365.824 120.143 366.455 120.143 367.252C120.143 368.143 119.898 368.844 119.41 369.355C118.926 369.863 118.27 370.117 117.441 370.117C116.555 370.117 115.852 369.785 115.332 369.121C114.812 368.453 114.553 367.525 114.553 366.338ZM117.43 369.291C117.984 369.291 118.414 369.117 118.719 368.77C119.027 368.418 119.182 367.912 119.182 367.252C119.182 366.686 119.039 366.24 118.754 365.916C118.469 365.592 118.043 365.43 117.477 365.43C117.125 365.43 116.803 365.502 116.51 365.646C116.217 365.791 115.982 365.99 115.807 366.244C115.635 366.498 115.549 366.762 115.549 367.035C115.549 367.438 115.627 367.812 115.783 368.16C115.939 368.508 116.16 368.783 116.445 368.986C116.734 369.189 117.062 369.291 117.43 369.291ZM121.227 367.229V366.338H124.104V367.229H121.227ZM130.818 370H125.188V369.162L127.443 366.895C128.131 366.199 128.584 365.703 128.803 365.406C129.021 365.109 129.186 364.82 129.295 364.539C129.404 364.258 129.459 363.955 129.459 363.631C129.459 363.174 129.32 362.812 129.043 362.547C128.766 362.277 128.381 362.143 127.889 362.143C127.533 362.143 127.195 362.201 126.875 362.318C126.559 362.436 126.205 362.648 125.814 362.957L125.299 362.295C126.088 361.639 126.947 361.311 127.877 361.311C128.682 361.311 129.312 361.518 129.77 361.932C130.227 362.342 130.455 362.895 130.455 363.59C130.455 364.133 130.303 364.67 129.998 365.201C129.693 365.732 129.123 366.404 128.287 367.217L126.412 369.051V369.098H130.818V370ZM138.09 368.031H136.818V370H135.887V368.031H131.721V367.182L135.787 361.387H136.818V367.146H138.09V368.031ZM135.887 367.146V364.299C135.887 363.74 135.906 363.109 135.945 362.406H135.898C135.711 362.781 135.535 363.092 135.371 363.338L132.693 367.146H135.887ZM141.383 372.256C141.016 372.256 140.727 372.203 140.516 372.098V371.248C140.793 371.326 141.082 371.365 141.383 371.365C141.77 371.365 142.062 371.248 142.262 371.014C142.465 370.779 142.566 370.441 142.566 370V361.434H143.562V369.918C143.562 370.66 143.375 371.234 143 371.641C142.625 372.051 142.086 372.256 141.383 372.256ZM149.645 370L149.451 369.086H149.404C149.084 369.488 148.764 369.762 148.443 369.906C148.127 370.047 147.73 370.117 147.254 370.117C146.617 370.117 146.117 369.953 145.754 369.625C145.395 369.297 145.215 368.83 145.215 368.225C145.215 366.928 146.252 366.248 148.326 366.186L149.416 366.15V365.752C149.416 365.248 149.307 364.877 149.088 364.639C148.873 364.396 148.527 364.275 148.051 364.275C147.516 364.275 146.91 364.439 146.234 364.768L145.936 364.023C146.252 363.852 146.598 363.717 146.973 363.619C147.352 363.521 147.73 363.473 148.109 363.473C148.875 363.473 149.441 363.643 149.809 363.982C150.18 364.322 150.365 364.867 150.365 365.617V370H149.645ZM147.447 369.314C148.053 369.314 148.527 369.148 148.871 368.816C149.219 368.484 149.393 368.02 149.393 367.422V366.842L148.42 366.883C147.646 366.91 147.088 367.031 146.744 367.246C146.404 367.457 146.234 367.787 146.234 368.236C146.234 368.588 146.34 368.855 146.551 369.039C146.766 369.223 147.064 369.314 147.447 369.314ZM156.77 370V365.846C156.77 365.322 156.65 364.932 156.412 364.674C156.174 364.416 155.801 364.287 155.293 364.287C154.617 364.287 154.123 364.471 153.811 364.838C153.502 365.205 153.348 365.807 153.348 366.643V370H152.375V360.883H153.348V363.643C153.348 363.975 153.332 364.25 153.301 364.469H153.359C153.551 364.16 153.822 363.918 154.174 363.742C154.529 363.562 154.934 363.473 155.387 363.473C156.172 363.473 156.76 363.66 157.15 364.035C157.545 364.406 157.742 364.998 157.742 365.811V370H156.77ZM162.676 363.461C162.961 363.461 163.217 363.484 163.443 363.531L163.309 364.434C163.043 364.375 162.809 364.346 162.605 364.346C162.086 364.346 161.641 364.557 161.27 364.979C160.902 365.4 160.719 365.926 160.719 366.555V370H159.746V363.578H160.549L160.66 364.768H160.707C160.945 364.35 161.232 364.027 161.568 363.801C161.904 363.574 162.273 363.461 162.676 363.461ZM167.357 370.117C166.408 370.117 165.658 369.828 165.107 369.25C164.561 368.672 164.287 367.869 164.287 366.842C164.287 365.807 164.541 364.984 165.049 364.375C165.561 363.766 166.246 363.461 167.105 363.461C167.91 363.461 168.547 363.727 169.016 364.258C169.484 364.785 169.719 365.482 169.719 366.35V366.965H165.295C165.314 367.719 165.504 368.291 165.863 368.682C166.227 369.072 166.736 369.268 167.393 369.268C168.084 369.268 168.768 369.123 169.443 368.834V369.701C169.1 369.85 168.773 369.955 168.465 370.018C168.16 370.084 167.791 370.117 167.357 370.117ZM167.094 364.275C166.578 364.275 166.166 364.443 165.857 364.779C165.553 365.115 165.373 365.58 165.318 366.174H168.676C168.676 365.561 168.539 365.092 168.266 364.768C167.992 364.439 167.602 364.275 167.094 364.275Z" fill="#A3A3A3"/>
</svg>
