<?xml version="1.0" encoding="utf-8"?>
<svg version="1.1" id="Robert_Bosch_Stiftung_Logo" xmlns="http://www.w3.org/2000/svg" xmlns:xlink="http://www.w3.org/1999/xlink"
     x="0px" y="0px" viewBox="0 0 283.5 116.2" style="enable-background:new 0 0 283.5 116.2;" xml:space="preserve">
<style type="text/css">
	.st0{fill:#FFFFFF;}
</style>
    <g>
	<polygon class="st0" points="31.9,37.6 18,37.6 18,23.7 24.9,23.7 31.9,23.7 	"/>
        <polygon class="st0" points="0,55.6 13.9,55.6 13.9,23.7 7,23.7 0,23.7 	"/>
        <polygon class="st0" points="36,55.6 49.9,55.6 49.9,0 42.9,0 36,0 	"/>
        <path class="st0" d="M53.9,23.7v31.9c8.8,0,15.9-7.1,15.9-15.9S62.7,23.7,53.9,23.7z"/>
        <g>
		<path class="st0" d="M93.7,55.6c5.8,0,8.9,1.9,8.9,5.3c0,2.9-2.1,4.6-6.3,5.2c2,0.4,3,1.2,4.3,3.3l2.6,4.3
			c0.8,1.2,1.1,1.4,2.5,1.5v1.2h-6.9l-4.6-8c-0.7-1.2-1.4-1.7-2.5-1.7h-0.3V74c0,0.8,0.4,1,2.8,1.3v1.2H83.8v-1.2
			c2.1-0.3,2.5-0.5,2.5-1.3V58c0-0.8-0.4-1-2.5-1.3v-1.2L93.7,55.6L93.7,55.6z M91.5,65.4H93c2.9,0,4.2-1.4,4.2-4.3
			c0-2.8-1.3-4.3-3.9-4.3h-1.9v8.6H91.5z"/>
            <path class="st0" d="M119.5,62.2c1.8,1.5,2.8,3.7,2.8,6.3c0,2.9-1.2,5.2-3.3,6.7c-1.5,1-3.2,1.6-5,1.6s-3.9-0.8-5.3-2
			c-1.8-1.5-2.8-3.7-2.8-6.3c0-2.9,1.2-5.3,3.3-6.7c1.4-1,3.2-1.5,4.9-1.5C116,60.2,118.1,61,119.5,62.2z M110.8,68.6
			c0,4.6,1.1,6.8,3.3,6.8c2.3,0,3.3-2.2,3.3-7c0-4.7-1.1-7-3.3-7C111.9,61.5,110.8,63.8,110.8,68.6z"/>
            <path class="st0" d="M130,63.1c1.4-1.9,3.2-2.9,5.3-2.9c3.9,0,6.2,3.1,6.2,8.1c0,3-0.9,5.2-2.7,6.7c-1.3,1.1-3.2,1.8-5.1,1.8
			c-2.1,0-3.8-0.8-5.5-2.3l-2.1,2h-0.9V57c0-1-0.6-1.3-2.4-1.4v-1.1l5.9-1.6h1.3V63.1z M130,70.2c0,3.2,1.2,5,3.4,5s3.3-2,3.3-6.5
			c0-4.1-1-5.9-3.3-5.9c-2,0-3.3,1.5-3.3,3.9L130,70.2L130,70.2z"/>
            <path class="st0" d="M158.8,73c-1.4,2.5-3.7,3.8-6.7,3.8c-4.9,0-8.3-3.3-8.3-8.3c0-4.9,3.3-8.3,8.1-8.3c2.2,0,4.1,0.8,5.3,2.2
			s1.6,2.9,1.7,5.8h-10.3v0.3c0,4.4,1.5,6.4,4.6,6.4c2,0,3.3-0.7,4.6-2.5L158.8,73z M154,66.1c0-3.2-0.7-4.6-2.4-4.6
			c-1.9,0-2.7,1.5-2.9,5.4h5.3L154,66.1L154,66.1z"/>
            <path class="st0" d="M166.9,60.4l0.4,3.3c1.4-2.3,2.9-3.5,4.8-3.5c1.8,0,2.8,0.9,2.8,2.5c0,1.6-1,2.6-2.7,2.6H171v-2
			c-0.3-0.2-0.5-0.3-0.8-0.3c-1.5,0-2.5,1.6-2.5,4.1v7.2c0,0.7,0.2,0.8,1.7,1v1.1h-8.3v-1.1c1.7-0.2,1.9-0.3,1.9-1v-10
			c0-1-0.6-1.3-2.3-1.4v-1.1l5.2-1.5L166.9,60.4L166.9,60.4z"/>
            <path class="st0" d="M187.6,72.9c-0.8,2.6-2.4,3.9-4.9,3.9c-2.9,0-4.6-1.6-4.6-4.5V62.2h-1.9v-1.5l0.6-0.1
			c2.6-0.4,4.3-2.2,4.8-5.1h1.3v5h4.1v1.6h-4.1V73c0,1.2,0.4,1.8,1.3,1.8c1,0,1.6-0.5,2.4-2.3L187.6,72.9z"/>
            <path class="st0" d="M207.2,65.2c2.3,0.1,3.5,0.4,4.9,1.2c1.6,1,2.5,2.5,2.5,4.3c0,3.7-3.9,5.8-10.8,5.8h-8.5v-1.2
			c2.1-0.3,2.5-0.5,2.5-1.3V58c0-0.8-0.4-1-2.5-1.3v-1.2h8.9c6,0,8.8,1.5,8.8,4.8c0,2.5-1.9,4-5.8,4.7L207.2,65.2L207.2,65.2z
			 M204.2,64.7c2.5,0,3.7-1.2,3.7-3.9s-1.2-4-3.8-4H203v7.9H204.2z M203,74.2c0,0.8,0.4,1,1.8,1c2.7,0,4.3-1.7,4.3-4.6
			s-1.7-4.6-4.6-4.6H203V74.2z"/>
            <path class="st0" d="M230.3,62.2c1.8,1.5,2.8,3.7,2.8,6.3c0,2.9-1.2,5.2-3.3,6.7c-1.5,1-3.2,1.6-5,1.6s-3.9-0.8-5.3-2
			c-1.8-1.5-2.8-3.7-2.8-6.3c0-2.9,1.2-5.3,3.3-6.7c1.4-1,3.2-1.5,4.9-1.5C226.8,60.2,228.8,61,230.3,62.2z M221.6,68.6
			c0,4.6,1.1,6.8,3.3,6.8c2.3,0,3.3-2.2,3.3-7c0-4.7-1.1-7-3.3-7C222.7,61.5,221.6,63.8,221.6,68.6z"/>
            <path class="st0" d="M244.7,64.5c-0.7-2.1-1.6-2.9-3.5-2.9c-1.7,0-2.6,0.8-2.6,2.1c0,1.2,0.7,1.8,3.2,2.6c4,1.3,5.4,2.7,5.4,5.3
			c0,3.2-2.5,5.2-6.7,5.2c-1.8,0-3.4-0.2-5.3-0.8v-4h1.6c1.4,3,2,3.6,4,3.6c1.8,0,2.8-0.8,2.8-2.2c0-1-0.4-1.6-1.3-2.2
			c-0.5-0.3-0.9-0.5-2.5-1c-3.1-1.1-4.5-2.5-4.5-4.8c0-3.1,2.5-5,6.3-5c1.6,0,3.1,0.2,4.6,0.5v3.7L244.7,64.5L244.7,64.5z"/>
            <path class="st0" d="M263.5,72.4c-1.1,2.9-3.3,4.4-6.5,4.4c-4.6,0-7.7-3.3-7.7-8.3s3.2-8.3,8.2-8.3c3.7,0,5.9,1.4,5.9,3.6
			c0,1.2-0.8,2-2.2,2h-2V62c-0.6-0.4-1.1-0.6-1.9-0.6c-2.2,0-3.2,2.1-3.2,6.9c0,4.6,1.1,6.5,3.9,6.5c2.1,0,3.3-0.8,4.4-3L263.5,72.4
			z"/>
            <path class="st0" d="M271.5,63.1c1.6-1.9,3.3-2.8,5.4-2.8c2.9,0,4.6,1.7,4.6,4.5v9.6c0,0.7,0.2,0.8,1.9,1v1.1h-8.3v-1.1
			c1.5-0.2,1.7-0.4,1.7-1v-9c0-1.6-0.8-2.5-2.2-2.5c-1.8,0-3.1,1.3-3.1,3v8.5c0,0.7,0.2,0.8,1.7,1v1.1h-8.3v-1.1
			c1.7-0.2,1.9-0.3,1.9-1V57c0-1-0.6-1.3-2.4-1.4v-1.1l5.9-1.6h1.3v10.2C271.6,63.1,271.5,63.1,271.5,63.1z"/>
	</g>
        <g>
		<path class="st0" d="M96.1,93.4c-1.2-3-2.2-3.8-4.6-3.8s-3.8,1.1-3.8,3s0.9,2.6,4.3,3.8c2.6,0.9,3.6,1.3,4.6,1.9
			c1.6,1.2,2.5,2.8,2.5,4.9c0,4.1-3,6.5-8.1,6.5c-2.2,0-4-0.3-7-1.2v-5.2h1.6c0.8,2,1.2,2.9,1.8,3.6c0.9,1,2,1.5,3.7,1.5
			c2.6,0,4.2-1.3,4.2-3.3c0-1.3-0.6-2.3-1.9-3c-0.7-0.4-1.2-0.6-3.6-1.4c-4.1-1.4-5.7-3.2-5.7-6.3c0-3.9,3-6.3,7.8-6.3
			c2.2,0,3.9,0.2,5.7,0.8v4.4L96.1,93.4L96.1,93.4z"/>
            <path class="st0" d="M111.4,105.9c-0.8,2.6-2.4,3.9-4.9,3.9c-2.9,0-4.6-1.6-4.6-4.5V95.2H100v-1.5l0.6-0.1
			c2.6-0.4,4.3-2.2,4.8-5.1h1.3v5h4.1v1.6h-4.1V106c0,1.2,0.4,1.8,1.3,1.8c1,0,1.6-0.5,2.4-2.3L111.4,105.9z"/>
            <path class="st0" d="M119.6,93.4v13.9c0,0.6,0.3,0.8,1.9,1v1.1H113v-1.1c1.7-0.2,1.9-0.3,1.9-1v-10c0-1-0.6-1.3-2.3-1.4v-1.1
			l5.9-1.5L119.6,93.4L119.6,93.4z M119.7,89.1c0,1.5-1.1,2.5-2.6,2.5c-1.4,0-2.5-1.1-2.5-2.5s1.1-2.5,2.5-2.5
			C118.6,86.5,119.7,87.6,119.7,89.1z"/>
            <path class="st0" d="M122.8,93.6h2.4v-2.1c0-3.8,2.4-5.9,6.6-5.9c2.9,0,4.7,1,4.7,2.6c0,1.1-0.8,1.9-1.9,1.9h-2v-3
			c-0.3-0.2-0.6-0.3-1.1-0.3c-1.2,0-1.6,0.8-1.6,3.7v3h3.6v1.6H130v12.1c0,0.7,0.3,0.8,1.7,1l0.6,0.1v1.1h-9.1v-1.1l0.5-0.1
			c1.3-0.2,1.5-0.3,1.5-1v-12h-2.4V93.6z"/>
            <path class="st0" d="M146.4,105.9c-0.8,2.6-2.4,3.9-4.9,3.9c-2.9,0-4.6-1.6-4.6-4.5V95.2H135v-1.5l0.6-0.1
			c2.6-0.4,4.3-2.2,4.8-5.1h1.3v5h4.1v1.6h-4.1V106c0,1.2,0.4,1.8,1.3,1.8c1,0,1.6-0.5,2.4-2.3L146.4,105.9z"/>
            <path class="st0" d="M159.4,106.6c-1.5,2.2-3.2,3.2-5.5,3.2c-2.9,0-4.6-1.7-4.6-4.5v-9.6c0-0.6-0.3-0.8-1.4-1l-0.5-0.1v-1.1h6.7
			v11.1c0,1.6,0.8,2.5,2.2,2.5c1.7,0,2.8-1.2,2.8-3v-8.5c0-0.7-0.2-0.8-1.7-1v-1.1h6.5v11.9c0,1,0.6,1.4,2.3,1.4v1.1l-5.2,1.5h-1.2
			L159.4,106.6z"/>
            <path class="st0" d="M173.5,93.4l0.4,3c1.6-2.1,3.5-3.2,5.7-3.2c2.9,0,4.6,1.7,4.6,4.5v9.6c0,0.7,0.2,0.8,1.9,1v1.1h-8.3v-1.1
			c1.5-0.2,1.7-0.4,1.7-1v-9c0-1.6-0.8-2.5-2.2-2.5c-1.8,0-3.1,1.3-3.1,3v8.5c0,0.7,0.2,0.8,1.7,1v1.1h-8.3v-1.1
			c1.7-0.2,1.9-0.3,1.9-1v-10c0-1-0.6-1.3-2.3-1.4v-1.1l5.2-1.5L173.5,93.4L173.5,93.4z"/>
            <path class="st0" d="M201.1,96.3c0.3,0.8,0.5,1.5,0.5,2.3c0,3.2-2.7,5.3-6.8,5.3c-0.6,0-1.2-0.1-1.8-0.2c-0.2-0.1-0.3-0.1-0.5-0.1
			c-0.8,0-1.6,0.6-1.6,1.2c0,0.7,0.6,0.9,2.5,0.9h4.4c3.6,0,5.7,1.7,5.7,4.6c0,1.7-0.8,3.1-2.4,4.2c-1.6,1.1-3.6,1.6-6.2,1.6
			c-4.9,0-7.9-1.4-7.9-3.7c0-1.5,1.1-2.4,3.4-3c-1.5-0.6-2.3-1.5-2.3-2.8c0-1.5,1.1-2.7,3.2-3.5c-2-1-3.1-2.6-3.1-4.6
			c0-3.2,2.8-5.4,6.9-5.4c2.1,0,3.7,0.5,5.1,1.6l2.5-1.3h1.1v2.8L201.1,96.3L201.1,96.3z M192.5,109.8c-1.3,0-2.1,0.9-2.1,2.2
			c0,2,1.6,3,4.6,3c3.1,0,4.9-1.2,4.9-3.1c0-1.5-0.9-2.1-3.3-2.1H192.5z M192.5,98.6c0,3.1,0.6,4.2,2.3,4.2c1.8,0,2.4-1.1,2.4-4.2
			s-0.7-4.3-2.3-4.3C193.1,94.3,192.5,95.4,192.5,98.6z"/>
	</g>
</g>
</svg>
