<svg width="85" height="84" viewBox="0 0 85 84" fill="none" xmlns="http://www.w3.org/2000/svg">
<g clip-path="url(#clip0_3033_6773)">
<path d="M0.291992 0V84H84.292V0H0.291992ZM81.1659 80.8739H3.41804V3.12605H81.1659V80.8739V80.8739Z" fill="white"/>
<path d="M72.3929 62.7229H68.4602V51.0254H65.2333V47.6977H75.519V51.0254H72.2921V62.7229H72.3929ZM56.7627 54.454H57.166C58.477 54.454 59.8887 54.2523 59.8887 52.6389C59.8887 51.0254 58.477 50.8237 57.166 50.8237H56.7627V54.454ZM65.3341 62.7229H60.4938L56.7627 56.975V62.7229H52.8299V47.7985H58.6786C61.603 47.7985 63.8215 49.2103 63.8215 52.4372C63.8215 54.454 62.7123 56.2691 60.5946 56.6725L65.3341 62.7229ZM38.5106 54.9582C38.5106 57.58 40.4265 59.3952 42.7459 59.3952C45.0652 59.3952 46.9812 57.4792 46.9812 54.9582C46.9812 52.9414 45.0652 51.0254 42.7459 51.0254C40.4265 51.0254 38.5106 52.9414 38.5106 54.9582ZM51.0148 54.9582C51.0148 59.7985 47.5862 63.2271 42.7459 63.2271C37.9055 63.2271 34.477 59.7985 34.477 54.9582C34.477 50.4204 38.4097 47.2943 42.7459 47.2943C47.082 47.2943 51.0148 50.4204 51.0148 54.9582ZM25.9055 54.6557H26.5106C27.9223 54.6557 29.3341 54.6557 29.3341 52.8405C29.3341 50.9246 28.0232 50.9246 26.5106 50.9246H25.9055V54.6557ZM21.9728 47.7985H27.9223C31.1492 47.7985 33.3677 49.3111 33.3677 52.7397C33.3677 56.2691 31.4518 57.7817 28.124 57.7817H25.9055V62.7229H21.9728V47.7985ZM17.7375 51.6305C17.0316 51.0254 16.124 50.6221 15.1156 50.6221C14.4097 50.6221 13.5022 51.0254 13.5022 51.8321C13.5022 52.7397 14.5106 53.0422 15.2165 53.2439L16.2249 53.5464C18.3425 54.1515 19.956 55.1599 19.956 57.58C19.956 59.0926 19.5526 60.6052 18.4433 61.6136C17.2333 62.6221 15.7207 63.0254 14.2081 63.0254C12.2921 63.0254 10.477 62.4204 8.96436 61.3111L10.6786 58.1851C11.687 58.9918 12.7963 59.6977 14.1072 59.6977C15.0148 59.6977 16.0232 59.1935 16.0232 58.1851C16.0232 57.0758 14.5106 56.6725 13.7039 56.4708C11.2837 55.7649 9.67024 55.1599 9.67024 52.2355C9.67024 49.2103 11.7879 47.1935 14.8131 47.1935C16.3257 47.1935 18.1408 47.6977 19.4518 48.4036L17.7375 51.6305ZM56.6618 23.1935C57.166 20.6725 58.6786 19.6641 58.7795 19.5632C58.9812 19.4624 60.2921 18.9582 60.2921 20.6725C60.2921 21.7817 60.2921 22.1851 59.3845 23.0926C58.7795 23.5968 56.9644 24.7061 56.9644 24.7061C56.8635 24.8069 56.7627 24.7061 56.7627 24.5044C56.561 24.0002 56.561 23.5968 56.6618 23.1935ZM19.2501 25.3111C19.2501 25.8153 19.1492 25.9162 19.6534 25.8153C20.9644 25.5128 21.7711 24.9078 22.2753 24.6052C23.2837 23.8994 24.2921 22.2859 24.5946 21.0758C24.8971 19.9666 24.6954 19.4624 24.4938 18.454C24.0904 17.2439 23.3845 16.7397 23.082 16.538C22.7795 16.3363 22.2753 16.0338 21.4686 16.538C20.9644 16.9414 20.1576 17.4456 19.6534 19.1599C19.3509 20.37 19.3509 20.7733 19.2501 21.9834C19.1492 22.9918 19.2501 25.0086 19.2501 25.3111ZM54.4433 36.9078C54.4433 36.9078 54.8467 37.0086 55.1492 37.1094C55.4518 37.2103 56.4602 37.3111 57.7711 37.6137C59.2837 37.9162 61.9055 38.2187 63.6198 38.2187C65.5358 38.3195 67.3509 37.9162 68.1576 37.412C69.4686 36.6052 70.1744 34.9918 69.6702 34.0842C69.0652 32.975 68.0568 32.8742 66.645 32.7733C65.0316 32.6725 63.0148 33.2775 61.3005 33.7817C58.8803 34.5884 56.561 35.7985 55.0484 36.5044C54.8467 36.7061 54.645 36.7061 54.4433 36.9078ZM35.687 19.8658C35.8887 19.7649 36.3929 19.5632 36.3929 20.1683C36.3929 20.8742 35.8887 23.8994 33.2669 25.1095C32.9644 25.2103 32.2585 25.3111 32.561 24.7061C32.8635 24.101 33.6702 22.1851 33.0652 21.4792C32.8635 21.1767 32.7627 20.975 33.2669 20.7733C33.6702 20.5716 35.687 19.8658 35.687 19.8658ZM30.5442 27.3279C30.04 27.4288 30.2417 27.8321 30.3425 27.933C30.5442 28.0338 30.7459 28.0338 31.1492 28.0338C31.5526 28.1347 31.5526 28.1347 31.5526 28.4372C31.5526 28.4372 31.5526 34.2859 31.5526 34.5884C31.5526 35.0926 31.7543 35.496 32.0568 36.0002C32.8635 37.0086 34.477 37.0086 35.082 36.7061C36.2921 36.101 36.998 34.891 37.3005 34.2859C37.7039 33.4792 37.1997 33.4792 36.998 33.58C36.6954 33.6809 36.3929 33.8826 35.9896 34.0842C35.4854 34.2859 35.5862 33.6809 35.5862 33.3784C35.5862 33.0758 35.5862 26.3195 35.5862 26.3195C35.5862 25.6137 35.1828 25.8153 34.8803 25.9162C34.6786 25.9162 30.8467 27.2271 30.5442 27.3279ZM43.0484 19.3616V23.1935C43.0484 23.2943 43.0484 23.3952 43.1492 23.3952C43.4518 23.3952 44.0568 23.2943 44.4602 23.2943C44.8635 23.1935 44.8635 24.101 44.3593 24.3027C43.956 24.5044 43.5526 24.6052 43.1492 24.8069C43.0484 24.8069 43.0484 24.9078 43.0484 25.2103V31.6641C43.0484 31.8658 43.1492 32.1683 43.4517 32.0674C43.8551 31.8658 44.2585 31.6641 44.4602 31.5632C44.6618 31.4624 45.166 31.4624 44.8635 32.1683C44.6618 32.5716 44.2585 33.8826 42.7459 34.5884C42.1408 34.891 40.8299 34.9918 40.0232 34.2859C39.4181 33.7817 39.1156 33.0758 39.1156 32.6725C39.1156 32.2691 39.1156 26.4204 39.1156 26.2187C39.1156 26.017 39.2165 25.9162 38.7123 25.8153C38.2081 25.8153 37.3005 25.8153 37.9055 25.3111C40.0232 23.6977 41.4349 22.2859 42.2417 18.9582C42.3425 18.3531 42.9475 18.1515 42.9475 18.8574C43.0484 19.1599 43.0484 19.2607 43.0484 19.3616ZM51.1156 16.538C51.1156 15.8321 50.5106 16.0338 50.4097 16.6389C49.603 20.0674 48.1912 21.3784 46.0736 22.9918C45.4686 23.496 46.477 23.496 46.8803 23.496C47.3845 23.496 47.1828 23.6977 47.2837 23.8994C47.2837 24.0002 47.2837 29.9498 47.2837 30.3531C47.3845 30.8573 47.687 31.5632 48.1912 31.9666C48.998 32.5716 50.3089 32.5716 50.9139 32.2691C52.3257 31.4624 52.8299 30.1515 53.0316 29.8489C53.3341 29.1431 52.8299 29.2439 52.6282 29.2439C52.4265 29.3447 52.0232 29.5464 51.6198 29.7481C51.3173 29.9498 51.2165 29.5464 51.2165 29.3447V22.891C51.2165 22.5884 51.2165 22.5884 51.3173 22.4876C51.7207 22.2859 52.124 22.1851 52.5274 21.9834C52.9307 21.7817 52.9307 20.8742 52.6282 20.975C52.2249 21.0758 51.6198 21.0758 51.3173 21.0758C51.2165 21.0758 51.2165 20.975 51.2165 20.8742V17.0422C51.1156 16.9414 51.1156 16.8405 51.1156 16.538ZM69.0652 17.5464C69.166 17.3447 70.1744 16.3363 70.1744 16.2355C70.2753 16.1347 70.3761 15.933 70.7795 16.2355C70.9812 16.4372 71.8887 17.0422 71.9896 17.1431C72.0904 17.2439 72.4938 17.4456 72.998 17.4456C73.4013 17.3447 73.5022 17.2439 73.8047 17.0422C74.0064 16.8405 74.6114 16.6389 74.2081 17.4456C73.9055 18.0506 73.3005 18.7565 72.0904 19.6641C71.7879 19.8658 71.082 20.2691 70.1744 19.7649C69.6702 19.5632 69.4686 19.3616 69.3677 19.2607C69.166 19.1599 68.8635 18.9582 68.8635 19.3616V24.3027C68.8635 24.5044 68.7627 25.1095 69.3677 24.9078C69.7711 24.7061 70.0736 24.6053 70.3761 24.4036C70.5778 24.3027 70.9812 24.3027 70.6786 25.1095C70.3761 25.7145 70.1744 26.5212 68.561 27.5296C68.0568 27.8321 66.7459 28.0338 65.8383 27.0254C65.4349 26.6221 65.1324 26.017 65.1324 25.5128C65.1324 25.1095 65.0316 19.059 65.0316 19.059C65.0316 18.9582 65.0316 18.7565 64.7291 18.7565C64.4265 18.7565 63.519 18.8574 64.0232 18.3531C64.4265 17.8489 65.9392 16.6389 66.1408 16.538C66.2417 16.3363 67.1492 16.1347 67.7543 16.7397C68.2585 17.1431 68.2585 17.1431 68.6618 17.4456C68.7627 17.6473 68.8635 17.6473 69.0652 17.5464ZM57.3677 25.7145C58.2753 25.1095 62.2081 22.6893 62.5106 22.3868C63.1156 22.0842 63.7207 21.2775 63.1156 19.9666C61.9055 17.7481 60.2921 17.7481 58.477 18.2523C55.6534 19.059 54.2417 21.9834 53.7375 23.5968C53.1324 26.017 53.9391 27.4288 54.7459 28.3363C55.8551 29.6473 57.5694 30.6557 59.082 30.0506C60.998 29.2439 62.1072 27.4288 62.2081 27.2271C62.3089 27.1263 62.4097 26.8237 62.4097 26.5212C62.4097 26.1179 62.1072 26.017 61.4013 26.6221C59.2837 28.3363 58.0736 26.8237 57.7711 26.5212C57.6702 26.4204 57.5694 26.3195 57.3677 26.017C57.2669 25.9162 57.2669 25.8153 57.3677 25.7145ZM20.2585 16.1347C20.6618 15.933 20.561 15.8321 20.2585 15.7313C16.0232 15.2271 11.3845 17.8489 11.2837 20.6725C11.2837 20.975 11.1828 21.4792 11.5862 22.1851C11.687 22.2859 11.687 22.4876 11.9896 22.2859C12.1912 22.1851 13.3005 21.8826 13.5022 22.7901C13.603 23.496 13.5022 24.0002 12.8971 24.4036C12.3929 24.7061 11.8887 25.0086 11.2837 24.9078C10.7795 24.8069 9.87192 24.2019 9.5694 23.3952C9.36772 22.6893 9.16604 21.3784 9.87192 20.0674C10.477 18.9582 12.5946 15.2271 19.3509 14.1179C21.7711 13.9162 26.1072 13.7145 28.124 16.8405C29.8383 19.4624 28.5274 22.9918 26.9139 24.2019C25.603 25.3111 24.5946 25.9162 22.477 26.6221C22.1744 26.7229 22.0736 26.7229 22.7795 27.0254C23.082 27.2271 24.8971 28.4372 26.3089 30.3531C27.3173 31.6641 28.124 33.58 29.0316 35.2943C29.6366 36.4036 30.5442 38.5212 32.6618 40.4372C33.8719 41.4456 34.477 41.7481 36.1912 41.8489C37.7039 41.9498 39.2165 42.1515 41.9391 41.4456C44.4602 40.7397 46.0736 39.933 47.3845 39.2271C48.8971 38.4204 50.4097 37.7145 51.1156 37.2103C49.603 36.8069 47.1828 37.1094 46.2753 37.3111C45.166 37.5128 43.956 38.1179 43.0484 38.4204C42.2417 38.7229 42.1408 38.1179 42.645 37.8153C43.1492 37.5128 43.6534 37.3111 44.561 36.9078C46.3761 36.101 47.8887 36.101 49.3005 36.0002C50.3089 36.0002 52.0232 36.101 53.0316 36.2019C53.7375 35.7985 54.7459 35.2943 56.0568 34.5884C57.4686 33.8826 60.6954 32.37 63.0148 31.5632C64.3257 31.059 67.6534 29.8489 69.9728 29.8489C72.3929 29.6473 74.8131 30.454 75.6198 32.4708C76.5274 34.4876 74.8131 36.5044 73.7039 37.3111C72.6955 38.017 70.9812 39.2271 68.0568 39.4288C65.8383 39.6305 62.1072 39.3279 60.0904 38.9246C58.3761 38.6221 54.3425 37.7145 53.5358 37.6137C53.0316 37.9162 48.6954 40.6389 46.9812 41.5464C45.4686 42.3531 42.7459 43.5632 40.9307 44.1683C39.1156 44.8742 34.8803 45.6809 31.6534 44.37C27.519 42.8573 24.998 38.8237 23.687 35.2943C22.1744 31.6641 21.9728 27.933 20.0568 27.4288C19.7543 27.3279 19.7543 27.4288 19.8551 27.7313V37.412C19.8551 37.8153 19.8551 38.6221 20.4602 39.1263C20.8635 39.4288 20.8635 39.4288 21.0652 39.6305C21.5694 39.8321 21.5694 40.7397 20.561 40.6389C19.956 40.6389 18.04 40.538 16.6282 40.9414C15.6198 41.2439 14.3089 41.8489 12.5946 42.6557C11.5862 43.1599 10.0736 43.3616 10.477 42.5548C10.7795 41.9498 11.8887 41.8489 12.998 40.9414C13.7039 40.3363 14.4097 39.933 14.7123 38.1179C14.8131 37.2103 15.0148 35.2943 15.1156 34.5884C15.1156 34.0842 15.4181 26.8237 15.4181 25.9162C15.4181 25.2103 15.519 21.2775 16.9307 19.2607C17.6366 17.6473 18.2417 17.0422 20.2585 16.1347Z" fill="white"/>
</g>
<defs>
<clipPath id="clip0_3033_6773">
<rect width="84" height="84" fill="white" transform="translate(0.291992)"/>
</clipPath>
</defs>
</svg>
