<svg width="174" height="60" viewBox="0 0 174 60" fill="none" xmlns="http://www.w3.org/2000/svg">
<g clip-path="url(#clip0_3033_6836)">
<path d="M19.3597 21.1329H21.1002V10.2666H12.0449V12.5833H18.6423C18.8187 16.3465 16.2668 19.3218 12.0214 19.3218C7.42318 19.3218 4.9418 15.394 4.9418 11.078C4.9418 6.76205 7.01158 2.31674 12.0214 2.31674C15.0908 2.31674 17.6074 3.72795 18.1484 6.85613H20.9003C20.1123 2.02274 16.5255 0 12.0214 0C5.48277 0 2.18994 5.20972 2.18994 11.2191C2.18994 16.5935 5.85909 21.6268 12.0214 21.6268C14.4557 21.6268 17.0547 20.733 18.6423 18.5574L19.3597 21.1329ZM35.8944 15.9232C35.8944 17.2873 34.5655 19.3101 31.3315 19.3101C29.8262 19.3101 28.4385 18.7338 28.4385 17.1109C28.4385 15.2881 29.8262 14.7119 31.4491 14.4179C33.0955 14.1239 34.9536 14.1004 35.9061 13.4065V15.9232H35.8944ZM39.881 19.1572C39.5635 19.2748 39.3283 19.2983 39.1284 19.2983C38.3522 19.2983 38.3522 18.7809 38.3522 17.6166V9.92552C38.3522 6.42101 35.4357 5.82125 32.7427 5.82125C29.4146 5.82125 26.5569 7.12662 26.404 10.8193H28.8618C28.9794 8.62015 30.5082 7.9851 32.5898 7.9851C34.1539 7.9851 35.9179 8.33791 35.9179 10.4665C35.9179 12.3128 33.6012 12.1482 30.8846 12.6656C28.3444 13.1595 25.8277 13.8769 25.8277 17.2638C25.8277 20.2391 28.0504 21.4622 30.767 21.4622C32.8485 21.4622 34.6713 20.733 36.0355 19.1454C36.0355 20.7683 36.8469 21.4622 38.117 21.4622C38.8932 21.4622 39.4459 21.3211 39.881 21.0623V19.1572ZM44.0794 21.1211H46.5373V6.18581H44.0794V21.1329V21.1211ZM46.549 0.493924H44.0912V3.50451H46.549V0.493924ZM52.0057 21.1446H54.4636V0.493924H52.0057V21.1329V21.1446ZM59.9202 21.1446H62.3781V6.18581H59.9202V21.1329V21.1446ZM62.3899 0.493924H59.932V3.50451H62.3899V0.493924ZM67.7877 21.1446H70.2456V12.7009C70.2456 10.0078 71.6921 8.02038 74.6674 8.02038C76.549 8.02038 77.7015 9.20815 77.7015 11.031V21.1564H80.1594V11.3014C80.1594 8.09094 78.9481 5.83301 75.0084 5.83301C72.8681 5.83301 71.1864 6.70325 70.1515 8.54959H70.0927V6.17405H67.776V21.1211L67.7877 21.1446ZM91.5314 19.1454C88.2974 19.1454 87.3095 16.1348 87.3095 13.4535C87.3095 10.5958 88.5796 8.02038 91.7313 8.02038C94.883 8.02038 95.9767 10.737 95.9767 13.3712C95.9767 16.1701 94.7654 19.1572 91.5196 19.1572L91.5314 19.1454ZM98.411 6.18581H96.0943V8.32615H96.0708C95.177 6.67973 93.4953 5.84477 91.6137 5.84477C86.4393 5.84477 84.6988 10.2078 84.6988 13.7358C84.6988 17.8165 86.9214 21.3093 91.3785 21.3093C93.2601 21.3093 95.2241 20.4155 96.0355 18.5927H96.0943V19.5806C96.0943 22.9322 94.8242 25.2489 91.6137 25.2489C89.9908 25.2489 87.8505 24.6139 87.7329 22.8146H85.275C85.4161 26.0839 88.6619 27.2129 91.4608 27.2129C96.1766 27.2129 98.3993 24.7315 98.3993 19.8628V6.18581H98.411Z" fill="black"/>
<path d="M0.943359 31.517V28.6123H170.359V31.517H0.943359Z" fill="black"/>
<path d="M52.7703 45.7937C52.9702 45.9819 53.0761 46.2288 53.0761 46.5228C53.0761 46.7933 52.9938 47.0167 52.8409 47.2049C52.6762 47.3931 52.4646 47.4872 52.2058 47.4872C52.1118 47.4872 52.0177 47.4636 51.9001 47.4166C51.7825 47.3696 51.7001 47.3108 51.6413 47.2167C51.4414 47.4284 51.3121 47.6871 51.2533 47.9928C51.1945 48.2986 51.1592 48.6161 51.1592 48.9572C51.1592 49.4158 51.265 49.8627 51.4885 50.2861C51.7119 50.7094 52.0294 51.0857 52.4528 51.4033C52.8762 51.7208 53.3701 51.9795 53.9581 52.1794C54.5461 52.3794 55.1929 52.4734 55.9103 52.4734C57.1216 52.4734 58.1447 52.2029 58.9796 51.6502C59.8146 51.0975 60.4967 50.3919 61.0141 49.5334C61.5316 48.6749 61.9079 47.7106 62.1314 46.6639C62.3666 45.6173 62.4842 44.5942 62.5077 43.6181C62.5194 42.0305 62.6841 40.6075 62.9781 39.3492C63.2721 38.0908 63.6954 37.0089 64.2364 36.1269C64.7774 35.2449 65.4595 34.5628 66.2709 34.0806C67.0824 33.5985 68.0114 33.3633 69.058 33.3633C69.9989 33.3633 70.7633 33.5867 71.3513 34.0454C71.9393 34.504 72.2333 35.092 72.2333 35.8211C72.2333 36.3856 72.0334 36.8207 71.6335 37.103C71.2337 37.3852 70.7515 37.5264 70.2105 37.5264C70.4105 37.2206 70.5516 36.9266 70.6457 36.6443C70.7397 36.3621 70.7985 35.9975 70.7985 35.5742C70.7985 34.9274 70.6104 34.457 70.2341 34.1512C69.8577 33.8454 69.4109 33.6808 68.9052 33.6808C68.2113 33.6808 67.6233 33.8219 67.1294 34.0924C66.6355 34.3629 66.2239 34.751 65.8828 35.2214C65.5418 35.7035 65.2713 36.268 65.0714 36.9031C64.8715 37.5381 64.7068 38.2202 64.5775 38.9493C64.4481 39.6667 64.3658 40.4193 64.2952 41.1837C64.2364 41.9481 64.1776 42.7008 64.1188 43.4534C63.9894 45.288 63.6719 46.8051 63.1427 48.0046C62.6135 49.2041 61.9785 50.1567 61.2023 50.8741C60.4379 51.5914 59.5794 52.0853 58.6386 52.3676C57.6978 52.6498 56.7217 52.791 55.7339 52.791C54.9342 52.791 54.1933 52.6616 53.5347 52.4029C52.8644 52.1442 52.2882 51.7913 51.8177 51.3327C51.3356 50.8741 50.971 50.3449 50.7123 49.7216C50.4536 49.0983 50.3242 48.4162 50.3242 47.6636C50.3242 47.0403 50.4653 46.5228 50.7476 46.1112C51.0298 45.6996 51.4061 45.4997 51.8648 45.4997C52.2764 45.4997 52.5822 45.5938 52.7821 45.7819L52.7703 45.7937ZM77.0784 45.6761C76.6668 46.3347 76.1259 47.0403 75.4673 47.8047C74.797 48.5573 74.0796 49.2747 73.2917 49.9215C72.3274 50.7212 71.3748 51.368 70.4105 51.8619C69.4461 52.3558 68.5053 52.591 67.5763 52.591C66.9177 52.591 66.365 52.4146 65.9181 52.0736C65.4712 51.7208 65.2478 51.2151 65.2478 50.533C65.2478 49.6745 65.4947 48.8043 65.9769 47.9223C66.4708 47.0285 67.0824 46.2171 67.8232 45.4762C68.5641 44.7353 69.3756 44.1355 70.2576 43.6769C71.1396 43.2182 71.9746 42.983 72.7507 42.983C73.2682 42.983 73.715 43.0771 74.1031 43.2653C74.4912 43.4534 74.6794 43.7827 74.6794 44.2414C74.6794 44.453 74.6206 44.6294 74.503 44.7706C74.3854 44.9117 74.2442 45.0293 74.0796 45.1234C73.915 45.2175 73.7268 45.2763 73.5151 45.3233C73.3152 45.3703 73.127 45.3939 72.9624 45.4174C73.033 45.241 73.0918 45.0528 73.1506 44.8647C73.1976 44.6765 73.2329 44.4883 73.2329 44.2884C73.2329 43.6298 72.9271 43.3006 72.3038 43.3006C71.8452 43.3006 71.2925 43.524 70.6574 43.9826C70.0224 44.4413 69.4344 45.0058 68.8699 45.6996C68.3054 46.3935 67.835 47.1579 67.4469 47.9928C67.0588 48.8278 66.8589 49.6392 66.8589 50.4154C66.8589 50.8976 66.9648 51.3092 67.1882 51.6385C67.4116 51.9795 67.7527 52.1442 68.2113 52.1442C68.8346 52.1442 69.552 51.9442 70.3634 51.5326C71.1749 51.121 71.9628 50.6153 72.7272 50.0156C73.5269 49.3923 74.3031 48.6749 75.0322 47.8635C75.7731 47.052 76.3846 46.2641 76.8903 45.4997L77.0784 45.6526V45.6761ZM85.9926 33.9042L76.5492 47.9458L76.5963 48.0046C76.9491 47.5577 77.3724 47.052 77.8546 46.464C78.3368 45.8878 78.8542 45.3351 79.4187 44.8176C79.9832 44.3002 80.5712 43.865 81.1945 43.5122C81.8177 43.1594 82.441 42.983 83.0643 42.983C84.1463 42.983 84.6872 43.524 84.6872 44.6059C84.6872 44.8882 84.5814 45.2292 84.3815 45.6173C84.1815 46.0054 83.9228 46.417 83.6053 46.8639C83.2878 47.299 82.9585 47.7459 82.6057 48.181C82.2529 48.6279 81.9118 49.063 81.6061 49.4746C81.3003 49.898 81.0416 50.2861 80.8299 50.6506C80.63 51.0152 80.5241 51.3209 80.5241 51.5679C80.5241 51.7678 80.5829 51.9325 80.7005 52.0618C80.8181 52.1912 80.971 52.2617 81.1709 52.2617C81.5826 52.2617 82.0294 52.1324 82.5234 51.8737C83.0173 51.6149 83.523 51.2739 84.0404 50.8623C84.5696 50.4389 85.0871 49.9803 85.6045 49.4629C86.1219 48.9454 86.5923 48.4397 87.0275 47.934C87.4626 47.4284 87.8507 46.9462 88.2035 46.4875C88.5563 46.0289 88.8032 45.6643 88.9679 45.3821L89.1325 45.4409C88.9326 45.7819 88.6621 46.1818 88.3093 46.6639C87.9565 47.1461 87.5449 47.6518 87.098 48.181C86.6394 48.7102 86.1572 49.2394 85.628 49.7686C85.0988 50.2978 84.5814 50.7682 84.0522 51.1798C83.523 51.6032 83.0055 51.9325 82.4881 52.1912C81.9706 52.4499 81.4885 52.5793 81.0416 52.5793C80.5947 52.5793 80.2066 52.4382 79.9126 52.1559C79.6186 51.8737 79.4775 51.4738 79.4775 50.9799C79.4775 50.6271 79.5833 50.2273 79.7833 49.8039C79.9832 49.3805 80.2419 48.9454 80.5594 48.5103C80.8652 48.0752 81.2062 47.64 81.559 47.2049C81.9118 46.7698 82.2529 46.3582 82.5586 45.9583C82.8644 45.5703 83.1231 45.2057 83.3348 44.8764C83.5347 44.5471 83.6406 44.2649 83.6406 44.0297C83.6406 43.7474 83.5583 43.5475 83.4054 43.4417C83.2407 43.3358 83.0526 43.277 82.8174 43.277C82.3705 43.277 81.8766 43.4417 81.3356 43.771C80.7946 44.1002 80.2301 44.5354 79.6539 45.0646C79.0777 45.5938 78.5014 46.1935 77.9369 46.8639C77.3724 47.5342 76.8315 48.2045 76.3258 48.8748C75.8201 49.5452 75.3732 50.192 74.9851 50.7917C74.5971 51.3915 74.3031 51.9089 74.0914 52.3323L72.3509 52.3558C73.327 50.827 74.3383 49.2629 75.3615 47.6871C76.3963 46.0995 77.4195 44.5236 78.4426 42.9595C79.4657 41.3954 80.4653 39.8549 81.4414 38.326C82.4175 36.809 83.3466 35.3507 84.2168 33.963L86.0043 33.8807L85.9926 33.9042ZM98.2113 33.7984C96.6237 36.1975 95.2478 38.279 94.0718 40.0313C92.8958 41.7835 91.8962 43.277 91.0612 44.5236C90.2262 45.7702 89.5441 46.7933 89.0032 47.6048C88.474 48.4162 88.0506 49.0748 87.7448 49.5922C87.4391 50.1097 87.2274 50.5213 87.1216 50.8153C87.004 51.121 86.9452 51.3797 86.9452 51.5914C86.9452 52.0383 87.1451 52.2617 87.5332 52.2617C87.98 52.2617 88.4975 52.0854 89.0973 51.709C89.697 51.3445 90.3321 50.8505 91.0141 50.2155C91.6962 49.5805 92.4018 48.8396 93.1074 48.0046C93.8248 47.1579 94.5187 46.2523 95.189 45.2998L95.483 45.4056C94.8362 46.3111 94.1659 47.1931 93.4485 48.0399C92.7311 48.8866 92.049 49.6157 91.3905 50.239C90.5202 51.0622 89.7676 51.6502 89.1325 52.0266C88.4975 52.4029 87.9212 52.591 87.4156 52.591C86.8628 52.591 86.463 52.4617 86.2278 52.2147C85.9926 51.9678 85.8632 51.6385 85.8632 51.2269C85.8632 50.8505 85.9338 50.4625 86.0631 50.0626C86.1925 49.6628 86.4277 49.1806 86.7452 48.6161C87.0628 48.0516 87.4861 47.3696 88.0153 46.5699C88.5445 45.7702 89.1913 44.7823 89.9675 43.6181C90.7437 42.4538 91.6492 41.0661 92.7076 39.455C93.7542 37.8439 94.9655 35.9505 96.3415 33.7866H98.2113V33.7984ZM102.586 43.1712L104.327 43.1947C103.668 44.1238 103.033 45.0175 102.433 45.8878C101.833 46.758 101.292 47.5695 100.822 48.2986C100.352 49.0395 99.9753 49.6863 99.6931 50.2508C99.4109 50.8153 99.2697 51.2504 99.2697 51.5679C99.2697 52.0265 99.5049 52.2617 99.9871 52.2617C100.363 52.2617 100.834 52.0854 101.41 51.709C101.986 51.3445 102.621 50.8388 103.292 50.2037C103.962 49.5569 104.656 48.816 105.373 47.9576C106.079 47.0991 106.761 46.1935 107.408 45.2292L107.572 45.288C107.09 46.0171 106.526 46.8051 105.879 47.6518C105.232 48.4985 104.55 49.2864 103.833 50.0156C103.127 50.7447 102.41 51.3562 101.692 51.8384C100.975 52.3323 100.316 52.5675 99.6931 52.5675C99.1757 52.5675 98.7993 52.4382 98.5641 52.1794C98.3289 51.9207 98.1996 51.6149 98.1996 51.2621C98.1996 51.0152 98.2348 50.7682 98.3172 50.533C98.3995 50.2978 98.4818 50.0509 98.5759 49.8039L98.5171 49.7804C98.2819 50.0273 97.9996 50.3213 97.6468 50.6506C97.294 50.9799 96.9295 51.2857 96.5296 51.5679C96.1298 51.8501 95.7182 52.0971 95.2831 52.2853C94.8597 52.4852 94.4481 52.5793 94.06 52.5793C93.4014 52.5793 92.9428 52.3794 92.6723 51.9677C92.4018 51.5561 92.2725 51.0975 92.2725 50.5801C92.2725 49.8509 92.5077 49.0512 92.9663 48.1692C93.425 47.2872 94.013 46.464 94.7303 45.6879C95.4477 44.9117 96.2121 44.2649 97.0471 43.7474C97.882 43.23 98.67 42.9713 99.4226 42.9713C99.7754 42.9713 100.093 43.0183 100.352 43.1124C100.622 43.2065 100.846 43.3476 101.022 43.5122C101.198 43.6769 101.34 43.8768 101.434 44.0885C101.528 44.3002 101.61 44.5236 101.657 44.7588H101.716L102.598 43.1594L102.586 43.1712ZM93.7778 51.6149C93.9424 51.8384 94.1776 51.9442 94.4834 51.9442C94.7891 51.9442 95.1419 51.8266 95.5535 51.6149C95.9651 51.3915 96.3885 51.0975 96.8354 50.7212C97.2823 50.3449 97.7174 49.9215 98.1525 49.4276C98.5877 48.9336 98.9757 48.4162 99.3168 47.8635C99.6578 47.3108 99.9283 46.7463 100.14 46.1818C100.352 45.6173 100.458 45.0763 100.458 44.5589C100.458 44.1473 100.34 43.8415 100.105 43.6298C99.8695 43.4182 99.5873 43.3123 99.2462 43.3123C98.717 43.3123 98.1172 43.5475 97.4587 44.0062C96.8001 44.4648 96.1768 45.0646 95.5888 45.7819C95.0008 46.4993 94.5069 47.299 94.1071 48.1692C93.7072 49.0395 93.5073 49.8745 93.5073 50.6741C93.5073 51.0857 93.5896 51.4033 93.766 51.6267L93.7778 51.6149ZM106.396 43.5122V43.1947H108.454C109.148 42.0893 109.854 40.9838 110.583 39.8549C111.312 38.7376 112.076 37.7263 112.876 36.8207C113.676 35.927 114.511 35.1979 115.381 34.6334C116.251 34.0689 117.169 33.7984 118.133 33.7984C118.697 33.7984 119.168 33.916 119.521 34.163C119.873 34.3982 120.05 34.7745 120.05 35.2684C120.05 35.6918 119.92 36.0446 119.65 36.3268C119.38 36.5973 119.05 36.7619 118.639 36.7972C118.709 36.5503 118.768 36.3151 118.815 36.0916C118.862 35.8682 118.886 35.6095 118.886 35.3037C118.886 34.9509 118.803 34.6687 118.627 34.4452C118.462 34.2335 118.168 34.1277 117.757 34.1277C117.098 34.1277 116.428 34.4217 115.746 35.0215C115.064 35.6212 114.381 36.3739 113.723 37.2794C113.053 38.1849 112.406 39.1728 111.771 40.2312C111.136 41.2896 110.536 42.2774 109.971 43.2065H116.004V43.524H109.807C108.102 46.4405 106.573 48.9454 105.22 51.0269C103.868 53.1085 102.574 54.8137 101.328 56.1543C100.081 57.4832 98.8346 58.4711 97.588 59.0944C96.3415 59.7177 94.9655 60.0234 93.4485 60.0234C92.9193 60.0234 92.4018 59.9529 91.9079 59.8235C91.414 59.6941 90.9906 59.4942 90.6143 59.2237C90.238 58.9532 89.944 58.624 89.7088 58.2241C89.4736 57.8243 89.356 57.3539 89.356 56.8247C89.356 56.1308 89.5794 55.5428 90.0145 55.0489C90.4497 54.555 91.1905 54.3198 92.2137 54.3198H92.4489V54.5314C91.9197 54.5667 91.461 54.7667 91.0847 55.143C90.7084 55.5193 90.5202 56.0367 90.5202 56.6953C90.5202 57.6244 90.7789 58.3535 91.2964 58.8944C91.8138 59.4354 92.5665 59.7059 93.5661 59.7059C94.5657 59.7059 95.4477 59.4824 96.3179 59.0473C97.1882 58.6122 98.0349 58.0124 98.8464 57.248C99.6578 56.4836 100.446 55.5781 101.222 54.555C101.998 53.5201 102.774 52.4029 103.55 51.2033C104.327 50.0038 105.103 48.7455 105.891 47.4401C106.679 46.1347 107.478 44.8294 108.29 43.5358H106.396V43.5122ZM123.496 33.9042C122.037 36.221 120.579 38.4907 119.121 40.7251C117.663 42.9595 116.145 45.1587 114.581 47.3343L114.64 47.3813C115.099 46.8639 115.557 46.3464 116.016 45.8172C116.463 45.288 116.945 44.8176 117.427 44.406C117.921 43.9826 118.427 43.6416 118.944 43.3829C119.474 43.1124 120.015 42.983 120.591 42.983C121.167 42.983 121.602 43.1242 121.861 43.4064C122.12 43.6886 122.249 44.0414 122.249 44.453C122.249 44.8647 122.12 45.2527 121.861 45.582C121.602 45.9113 121.285 46.1935 120.897 46.4405C120.508 46.6757 120.097 46.8756 119.638 47.0167C119.18 47.1579 118.768 47.2637 118.392 47.3343V47.3813C118.603 47.4872 118.791 47.6871 118.944 47.9811C119.097 48.2751 119.168 48.5808 119.168 48.8984C119.168 49.11 119.133 49.3335 119.05 49.5687C118.968 49.8039 118.874 50.0391 118.768 50.2861C118.662 50.533 118.568 50.78 118.486 51.0152C118.403 51.2504 118.368 51.4973 118.368 51.7443C118.368 52.0854 118.509 52.25 118.791 52.25C119.274 52.25 119.873 52.0383 120.603 51.6149C121.332 51.1916 122.108 50.5683 122.919 49.7451C123.484 49.1806 124.072 48.5456 124.66 47.8517C125.248 47.1579 125.883 46.3229 126.553 45.3468L126.788 45.5115C126.447 45.9936 125.953 46.6522 125.307 47.4872C124.66 48.3221 123.895 49.1806 123.025 50.0509C122.19 50.8858 121.402 51.5209 120.65 51.9442C119.897 52.3676 119.215 52.5793 118.592 52.5793C118.062 52.5793 117.639 52.4617 117.345 52.2265C117.051 51.9913 116.91 51.6385 116.91 51.1563C116.91 50.9093 116.969 50.6271 117.098 50.3213C117.227 50.0038 117.357 49.7098 117.498 49.4158C117.639 49.1218 117.768 48.8513 117.898 48.5926C118.027 48.3339 118.086 48.1222 118.086 47.9693C118.086 47.6283 117.933 47.4636 117.627 47.4636C117.451 47.4636 117.239 47.4989 117.004 47.5695C116.769 47.64 116.487 47.6753 116.193 47.6753C115.922 47.6753 115.793 47.593 115.793 47.4401C115.793 47.2872 115.922 47.2049 116.193 47.2049C116.298 47.2049 116.416 47.2049 116.557 47.2284C116.686 47.252 116.851 47.252 117.051 47.252C117.58 47.252 118.074 47.1932 118.533 47.0638C118.991 46.9344 119.379 46.758 119.721 46.5111C120.062 46.2759 120.32 45.9819 120.508 45.6408C120.697 45.2998 120.791 44.9235 120.791 44.4883C120.791 44.112 120.697 43.8415 120.52 43.6651C120.344 43.4887 120.132 43.3946 119.873 43.3946C119.532 43.3946 119.144 43.5358 118.697 43.8062C118.251 44.0767 117.78 44.453 117.274 44.9235C116.769 45.3939 116.251 45.9348 115.722 46.5463C115.193 47.1579 114.687 47.7929 114.205 48.4632C113.711 49.1336 113.252 49.7921 112.829 50.4625C112.406 51.1328 112.041 51.7561 111.735 52.3441L109.971 52.3676C111.947 49.2864 113.923 46.2288 115.887 43.1947C117.851 40.1606 119.838 37.0912 121.826 33.9748L123.484 33.8925L123.496 33.9042ZM129.764 43.1947C129.07 44.1355 128.399 45.0411 127.764 45.8878C127.129 46.7463 126.553 47.5224 126.059 48.2398C125.565 48.9572 125.165 49.5687 124.871 50.0979C124.577 50.6271 124.436 51.0387 124.436 51.3445C124.436 51.6267 124.507 51.8384 124.648 51.9677C124.789 52.0971 124.977 52.1677 125.213 52.1677C125.554 52.1677 125.918 52.0618 126.318 51.8501C126.718 51.6385 127.129 51.3562 127.541 51.0269C127.964 50.6859 128.364 50.3213 128.764 49.9097C129.164 49.4981 129.54 49.0983 129.881 48.6984C130.222 48.2986 130.528 47.934 130.787 47.593C131.046 47.252 131.234 46.9932 131.363 46.7933L133.715 43.2182H135.561C134.597 44.5354 133.786 45.6526 133.115 46.5699C132.445 47.4872 131.904 48.2633 131.492 48.9101C131.069 49.5569 130.775 50.0744 130.599 50.4742C130.422 50.8741 130.328 51.2269 130.328 51.5326C130.328 51.7443 130.387 51.9325 130.516 52.0854C130.646 52.2382 130.822 52.3088 131.046 52.3088C131.398 52.3088 131.81 52.1794 132.269 51.9207C132.727 51.662 133.209 51.3209 133.715 50.9093C134.209 50.486 134.703 50.0156 135.197 49.4981C135.691 48.9689 136.149 48.4515 136.585 47.934C137.02 47.4166 137.419 46.9344 137.772 46.4758C138.125 46.0171 138.407 45.6526 138.595 45.3703L138.866 45.4527C138.654 45.7584 138.372 46.1465 138.007 46.6169C137.655 47.0873 137.255 47.5812 136.808 48.1104C136.361 48.6396 135.891 49.1688 135.397 49.7098C134.903 50.2508 134.385 50.7329 133.856 51.1681C133.327 51.5914 132.821 51.9442 132.304 52.2265C131.798 52.497 131.316 52.6381 130.881 52.6381C130.387 52.6381 129.987 52.497 129.693 52.2265C129.399 51.956 129.258 51.5797 129.258 51.121C129.258 50.7682 129.317 50.4272 129.434 50.0979C129.552 49.7686 129.634 49.5569 129.693 49.4746L129.634 49.4158C129.258 49.8392 128.87 50.2508 128.458 50.6389C128.047 51.0269 127.635 51.368 127.235 51.662C126.824 51.956 126.412 52.1912 125.989 52.3676C125.565 52.544 125.154 52.6381 124.742 52.6381C124.178 52.6381 123.766 52.5087 123.519 52.25C123.272 51.9913 123.143 51.6855 123.143 51.3327C123.143 50.8858 123.26 50.4037 123.507 49.8862C123.742 49.3688 124.084 48.7925 124.507 48.1575C124.93 47.5224 125.448 46.7933 126.047 45.9936C126.647 45.1939 127.294 44.2766 128.011 43.2418H129.775L129.764 43.1947ZM147.78 33.7984C146.193 36.1975 144.817 38.279 143.641 40.0313C142.465 41.7835 141.465 43.277 140.63 44.5236C139.795 45.7702 139.113 46.7933 138.572 47.6048C138.043 48.4162 137.619 49.0748 137.314 49.5922C137.008 50.1097 136.796 50.5213 136.69 50.8153C136.573 51.121 136.514 51.3797 136.514 51.5914C136.514 52.0383 136.714 52.2617 137.102 52.2617C137.549 52.2617 138.066 52.0854 138.666 51.709C139.266 51.3445 139.901 50.8505 140.583 50.2155C141.265 49.5805 141.971 48.8396 142.676 48.0046C143.382 47.1579 144.087 46.2523 144.758 45.2998L145.052 45.4056C144.417 46.3111 143.735 47.1931 143.029 48.0399C142.312 48.8866 141.63 49.6157 140.971 50.239C140.101 51.0622 139.348 51.6502 138.713 52.0266C138.078 52.4029 137.502 52.591 136.996 52.591C136.443 52.591 136.044 52.4617 135.808 52.2147C135.573 51.9678 135.444 51.6385 135.444 51.2269C135.444 50.8505 135.514 50.4625 135.644 50.0626C135.773 49.6628 136.008 49.1806 136.326 48.6161C136.643 48.0516 137.067 47.3696 137.596 46.5699C138.125 45.7702 138.772 44.7823 139.548 43.6181C140.324 42.4538 141.23 41.0661 142.288 39.455C143.335 37.8439 144.546 35.9505 145.922 33.7866H147.792L147.78 33.7984ZM149.709 40.1018L147.604 43.1947H151.132L150.967 43.5122H147.392C146.675 44.6647 146.04 45.6643 145.487 46.5111C144.922 47.3578 144.452 48.0869 144.076 48.6984C143.688 49.31 143.405 49.8274 143.205 50.2508C143.006 50.6741 142.911 51.0387 142.911 51.3562C142.911 51.6973 143.029 51.9325 143.252 52.0618C143.488 52.1912 143.746 52.2617 144.052 52.2617C144.687 52.2617 145.405 52.0148 146.169 51.5326C146.945 51.0387 147.71 50.4389 148.474 49.7333C149.238 49.0277 149.967 48.2633 150.661 47.4636C151.355 46.6639 151.943 45.9466 152.425 45.2998L152.59 45.4056C151.99 46.17 151.32 46.9815 150.603 47.8164C149.885 48.6632 149.144 49.4393 148.368 50.1332C147.604 50.8388 146.828 51.415 146.063 51.8854C145.287 52.3441 144.558 52.5793 143.864 52.5793C143.311 52.5793 142.841 52.4146 142.441 52.0736C142.041 51.7325 141.841 51.2621 141.841 50.6624C141.841 50.2508 141.959 49.7921 142.194 49.2864C142.429 48.7808 142.723 48.228 143.1 47.64C143.476 47.052 143.899 46.417 144.37 45.7231C144.84 45.0293 145.322 44.2884 145.828 43.5122H144.381L144.546 43.1947H146.04L148.121 40.1018H149.721H149.709ZM155.612 43.1947C154.919 44.1355 154.248 45.0411 153.613 45.8878C152.966 46.7463 152.402 47.5224 151.908 48.2398C151.414 48.9572 151.014 49.5687 150.72 50.0979C150.426 50.6271 150.285 51.0387 150.285 51.3445C150.285 51.6267 150.356 51.8384 150.497 51.9677C150.638 52.0971 150.826 52.1677 151.061 52.1677C151.402 52.1677 151.767 52.0618 152.167 51.8501C152.566 51.6385 152.978 51.3562 153.39 51.0269C153.813 50.6859 154.213 50.3213 154.613 49.9097C155.013 49.4981 155.389 49.0983 155.73 48.6984C156.071 48.2986 156.377 47.934 156.635 47.593C156.894 47.252 157.082 46.9932 157.212 46.7933L159.564 43.2182H161.41C160.446 44.5354 159.634 45.6526 158.964 46.5699C158.294 47.4872 157.753 48.2633 157.341 48.9101C156.918 49.5569 156.624 50.0744 156.447 50.4742C156.271 50.8741 156.177 51.2269 156.177 51.5326C156.177 51.7443 156.236 51.9325 156.365 52.0854C156.494 52.2382 156.671 52.3088 156.894 52.3088C157.247 52.3088 157.659 52.1794 158.117 51.9207C158.576 51.662 159.058 51.3209 159.564 50.9093C160.058 50.486 160.552 50.0156 161.046 49.4981C161.539 48.9689 161.998 48.4515 162.433 47.934C162.868 47.4166 163.268 46.9344 163.621 46.4758C163.974 46.0171 164.256 45.6526 164.444 45.3703L164.715 45.4527C164.503 45.7584 164.221 46.1465 163.856 46.6169C163.503 47.0873 163.104 47.5812 162.657 48.1104C162.21 48.6396 161.739 49.1688 161.245 49.7098C160.752 50.2508 160.234 50.7329 159.717 51.1681C159.187 51.5914 158.682 51.9442 158.164 52.2265C157.659 52.497 157.176 52.6381 156.741 52.6381C156.247 52.6381 155.848 52.497 155.554 52.2265C155.26 51.956 155.107 51.5797 155.107 51.121C155.107 50.7682 155.165 50.4272 155.283 50.0979C155.401 49.7686 155.483 49.5569 155.542 49.4746L155.483 49.4158C155.107 49.8392 154.719 50.2508 154.307 50.6389C153.895 51.0269 153.484 51.368 153.084 51.662C152.672 51.956 152.261 52.1912 151.837 52.3676C151.414 52.544 151.002 52.6381 150.591 52.6381C150.026 52.6381 149.615 52.5087 149.368 52.25C149.121 51.9913 148.991 51.6855 148.991 51.3327C148.991 50.8858 149.109 50.4037 149.356 49.8862C149.591 49.3688 149.932 48.7925 150.356 48.1575C150.779 47.5224 151.296 46.7933 151.884 45.9936C152.484 45.1939 153.131 44.2766 153.848 43.2418H155.612V43.1947ZM167.384 43.1947L163.997 48.134L164.056 48.1928C164.303 47.887 164.621 47.5342 165.009 47.1344C165.385 46.7345 165.808 46.3229 166.267 45.9113C166.726 45.4879 167.196 45.0763 167.69 44.6647C168.184 44.2531 168.678 43.8886 169.16 43.571C169.254 43.3946 169.348 43.2535 169.454 43.1477C169.56 43.0418 169.771 42.983 170.101 42.983C170.301 42.983 170.465 42.983 170.618 42.9948C170.771 42.9948 170.924 43.0183 171.089 43.0301C170.783 43.3358 170.489 43.7004 170.207 44.1355C169.924 44.5706 169.783 45.0528 169.783 45.5585C169.783 45.9701 169.889 46.2876 170.089 46.5228C170.289 46.758 170.548 46.8639 170.853 46.8639C171.124 46.8639 171.383 46.8168 171.641 46.6992C171.9 46.5934 172.147 46.464 172.37 46.2994C172.606 46.1347 172.829 45.9701 173.041 45.7937C173.252 45.6173 173.441 45.4527 173.605 45.3115L173.77 45.4174C173.594 45.5938 173.382 45.7819 173.158 45.9936C172.923 46.1935 172.676 46.3935 172.418 46.5699C172.147 46.7463 171.865 46.8991 171.559 47.005C171.253 47.1226 170.948 47.1814 170.63 47.1814C170.065 47.1814 169.607 47.005 169.254 46.6639C168.901 46.3111 168.737 45.829 168.737 45.2057C168.737 44.7823 168.831 44.3942 169.031 44.0532L168.972 43.9944C168.243 44.4883 167.443 45.1469 166.573 45.9583C165.703 46.7698 164.773 47.7224 163.797 48.8278C163.445 49.2159 163.068 49.7333 162.692 50.3801C162.304 51.0152 161.975 51.6737 161.692 52.3558H159.952C160.916 50.827 161.869 49.2982 162.833 47.7929C163.797 46.2759 164.785 44.7353 165.797 43.1712H167.419L167.384 43.1947Z" fill="black"/>
</g>
<defs>
<clipPath id="clip0_3033_6836">
<rect width="172.803" height="60" fill="black" transform="translate(0.943359)"/>
</clipPath>
</defs>
</svg>
