<svg width="112" height="104" viewBox="0 0 112 104" fill="none" xmlns="http://www.w3.org/2000/svg">
<path d="M80 80V0L0 80H80Z" fill="#F7F3F4"/>
<path d="M100.21 36.2793C104.598 42.237 107.247 49.2949 107.863 56.6682C108.479 64.0415 107.038 71.4412 103.7 78.0445C100.362 84.6478 95.2583 90.1959 88.9557 94.0718C82.6531 97.9478 75.399 99.9996 68 99.9993C64.6276 100.002 61.2681 99.5816 58 98.7493" stroke="#404297" stroke-width="3" stroke-miterlimit="10"/>
<path d="M35.79 83.72C31.4024 77.7623 28.7532 70.7044 28.137 63.3311C27.5209 55.9578 28.9619 48.5581 32.2998 41.9548C35.6377 35.3515 40.7417 29.8034 47.0443 25.9275C53.3469 22.0515 60.601 19.9997 68 20C71.3724 19.9978 74.7319 20.4177 78 21.25" stroke="#404297" stroke-width="3" stroke-miterlimit="10"/>
<path d="M40 94C43.3137 94 46 91.3137 46 88C46 84.6863 43.3137 82 40 82C36.6863 82 34 84.6863 34 88C34 91.3137 36.6863 94 40 94Z" stroke="#404297" stroke-width="3" stroke-miterlimit="10"/>
<path d="M96 38C99.3137 38 102 35.3137 102 32C102 28.6863 99.3137 26 96 26C92.6863 26 90 28.6863 90 32C90 35.3137 92.6863 38 96 38Z" stroke="#404297" stroke-width="3" stroke-miterlimit="10"/>
<path d="M80.44 60.09V82H55.56V60.09H49L68 34L87 60.09H80.44Z" fill="#404297"/>
</svg>
