<svg width="139" height="82" viewBox="0 0 139 82" fill="none" xmlns="http://www.w3.org/2000/svg">
<path d="M21.6697 41.5588C21.6697 41.4471 21.558 41.112 21.4463 40.6652C21.3346 40.4418 21.2229 39.995 21.1112 39.5482L20.1059 35.862C19.6591 34.2982 19.4357 33.4045 19.324 32.9577C18.9889 31.9524 18.8772 31.3939 18.6538 31.2822C18.6538 31.1705 18.5421 31.1705 18.4304 31.1705C18.207 31.0588 17.8719 31.0588 17.2017 31.0588V30.0535C18.207 30.0535 19.324 30.0535 20.5527 30.0535C21.7814 30.0535 22.8985 30.0535 24.0155 30.0535V31.0588C23.1219 31.0588 22.5634 31.0588 22.4517 31.1705C22.34 31.2822 22.34 31.2822 22.34 31.5056C22.34 31.6173 22.34 31.9524 22.4517 32.1758L23.9038 37.7609L26.0261 33.0694L26.808 31.5056L27.59 29.8301H28.8187L32.2814 37.8726L33.5102 34.2982C33.7336 33.7397 33.8453 33.0694 34.0687 32.3992C34.1804 32.0641 34.1804 31.8407 34.1804 31.729C34.1804 31.5056 34.0687 31.3939 33.957 31.3939C33.8453 31.3939 33.2868 31.2822 32.3931 31.2822V30.2769C33.2868 30.2769 34.0687 30.2769 34.8506 30.2769C35.6325 30.2769 36.4144 30.2769 37.4197 30.2769V31.2822C36.8612 31.2822 36.5261 31.2822 36.5261 31.3939C36.4144 31.3939 36.3027 31.5056 36.191 31.5056C36.0793 31.6173 35.9676 31.729 35.9676 31.729C35.8559 31.8407 35.7442 32.3992 35.4091 33.2928C35.2974 33.6279 35.074 34.2982 34.7389 35.3035L33.957 36.979L33.7336 37.5375C33.6219 37.8726 33.3985 38.6545 32.9517 39.8833L32.3931 41.5588H30.3825C29.6006 39.6599 29.1538 38.6545 29.0421 38.3194L27.0314 33.8514C26.3612 35.3035 25.8027 36.4205 25.4676 37.2024C25.1325 37.9843 24.7974 38.6545 24.574 39.2131L23.6804 41.5588H21.6697Z" fill="white"/>
<path d="M49.7071 40.5536V41.4472C48.8134 41.4472 47.9198 41.3355 47.2496 41.3355C46.5794 41.3355 45.9092 41.3355 45.239 41.4472L45.1273 41.3355L45.239 39.7717C44.9039 39.9951 44.122 40.5536 42.6698 41.6707C42.3347 41.7824 41.9996 41.7824 41.6645 41.7824C40.7709 41.7824 40.1007 41.5589 39.5422 41.0004C38.9837 40.4419 38.7603 39.7717 38.7603 38.7664C38.7603 38.0962 38.872 37.5377 39.0954 37.0909C39.3188 36.6441 39.5422 36.3089 39.7656 36.1972C39.989 35.9738 40.4358 35.7504 40.9943 35.6387C42.3347 35.1919 43.6751 34.8568 45.239 34.5217C45.239 33.5164 45.0156 32.8462 44.6805 32.2877C44.2337 31.7292 43.5634 31.5058 42.7815 31.5058C42.4464 31.5058 42.1113 31.5058 41.7762 31.6175C41.6645 31.6175 41.4411 31.7292 41.3294 31.8409L40.7709 33.0696L39.989 32.8462L40.1007 31.2824C40.6592 30.8355 41.3294 30.5004 41.7762 30.1653C42.3347 29.8302 42.6698 29.7185 42.8932 29.6068C43.2283 29.4951 43.6751 29.4951 44.122 29.4951C45.0156 29.4951 45.7975 29.6068 46.356 29.8302C46.9145 30.0536 47.3613 30.3887 47.5847 30.7238C47.8081 31.0589 48.0315 31.5058 48.1432 31.8409C48.2549 32.2877 48.2549 32.7345 48.2549 33.4047C48.2549 33.6281 48.2549 34.2983 48.1432 35.4153C48.1432 36.1972 48.1432 36.7558 48.1432 37.2026C48.1432 38.6547 48.1432 39.5483 48.2549 39.8834C48.2549 39.9951 48.3666 40.1068 48.4783 40.2185C48.59 40.4419 49.0369 40.5536 49.7071 40.5536ZM45.1273 35.527C44.4571 35.6387 43.7869 35.8621 43.2283 36.0855C42.6698 36.3089 42.223 36.5324 41.9996 36.8675C41.7762 37.2026 41.6645 37.5377 41.6645 37.9845C41.6645 38.543 41.7762 38.8781 42.1113 39.2132C42.3347 39.5483 42.7815 39.66 43.1166 39.66C43.4517 39.66 43.8986 39.5483 44.2337 39.3249C44.5688 39.1015 44.9039 38.8781 45.1273 38.543V35.527Z" fill="white"/>
<path d="M50.8237 32.1758V31.6173L51.9408 30.947C52.1642 30.8353 52.2759 30.7236 52.4993 30.6119V28.9364C52.4993 28.3779 52.4993 27.596 52.3876 26.7024C53.1695 26.479 53.728 26.2555 53.9514 26.1438C53.9514 26.1438 54.5099 25.9204 55.5152 25.4736L55.8503 25.697L55.6269 26.9258L55.5152 28.3779L55.4035 30.5002H55.8503C56.9674 30.5002 57.7493 30.5002 58.3078 30.3885L58.0844 32.0641C57.9727 32.0641 57.861 32.0641 57.861 32.0641H56.6322H55.4035V36.197C55.4035 37.4258 55.4035 38.2077 55.4035 38.4311C55.4035 38.7662 55.6269 39.1013 55.8503 39.3247C56.0737 39.5481 56.4088 39.6598 56.8557 39.6598C57.0791 39.6598 57.3025 39.6598 57.5259 39.6598C57.6376 39.6598 57.861 39.5481 58.1961 39.5481L58.4195 39.9949L57.9727 40.4417C57.6376 40.7768 57.3025 41.1119 57.0791 41.447C56.7439 41.5587 56.5205 41.6704 56.1854 41.6704C55.962 41.6704 55.6269 41.7821 55.4035 41.7821C54.3982 41.7821 53.728 41.5587 53.1695 41.0002C52.611 40.5534 52.3876 39.8832 52.3876 39.213L52.4993 35.1917V32.1758H52.1642C51.6056 32.0641 51.2705 32.0641 50.8237 32.1758Z" fill="white"/>
<path d="M69.1432 39.8834L68.5847 41.1121C67.9145 41.4472 67.356 41.6706 66.9092 41.7823C66.4624 41.894 65.9039 41.8941 65.3454 41.8941C64.0049 41.8941 62.8879 41.6706 62.106 41.1121C61.3241 40.5536 60.6539 39.8834 60.2071 38.8781C59.872 38.2079 59.7603 37.3143 59.7603 36.0855C59.7603 35.1919 59.872 34.5217 59.9837 33.9632C60.0954 33.4047 60.4305 32.9579 60.6539 32.5111C60.8773 32.2877 61.1007 31.9526 61.4358 31.7292L63.3347 30.5004C64.0049 30.0536 64.4517 29.8302 64.6751 29.7185C65.122 29.6068 65.5688 29.4951 66.239 29.4951C66.7975 29.4951 67.2443 29.4951 67.6911 29.6068C68.1379 29.7185 68.5847 29.8302 68.9198 29.9419L69.0315 30.1653L68.6964 32.176C68.6964 32.3994 68.5847 32.9579 68.5847 33.8515H67.5794C67.5794 33.0696 67.4677 32.6228 67.356 32.176C67.1326 31.8409 66.9092 31.6175 66.5741 31.5058C66.239 31.2824 65.7922 31.2824 65.2337 31.2824C64.5634 31.2824 64.1166 31.3941 63.7815 31.6175C63.4464 31.8409 63.1113 32.176 62.9996 32.7345C62.7762 33.293 62.7762 33.9632 62.7762 34.7451C62.7762 35.7504 62.9996 36.6441 63.3347 37.5377C63.6698 38.3196 64.1166 38.9898 64.6751 39.3249C65.2337 39.66 66.0156 39.8834 66.7975 39.8834C67.1326 39.8834 67.5794 39.8834 67.9145 39.7717C68.2496 39.66 68.5847 39.5483 68.9198 39.4366L69.1432 39.8834Z" fill="white"/>
<path d="M84.4465 40.5533V41.4469C83.2178 41.4469 82.4359 41.4469 81.9891 41.4469C81.7657 41.4469 80.8721 41.4469 79.5316 41.4469L79.4199 41.3352L79.6434 38.7661C79.6434 38.3193 79.6434 37.7608 79.6434 37.2023V34.7448C79.6434 33.6278 79.4199 32.8459 79.0848 32.3991C78.7497 31.9523 78.1912 31.7288 77.521 31.7288C76.9625 31.7288 76.6274 31.8406 76.1806 32.064C75.8455 32.2874 75.5104 32.6225 75.287 33.0693C75.1753 33.181 75.1753 33.5161 75.1753 34.0746V35.8618C75.1753 36.532 75.1753 37.314 75.1753 38.3193C75.1753 39.3246 75.1753 39.8831 75.287 40.1065C75.287 40.2182 75.3987 40.3299 75.3987 40.3299C75.3987 40.3299 75.5104 40.4416 75.6221 40.4416C75.7338 40.5533 75.9572 40.5533 76.1806 40.5533H77.1859V41.4469C74.9519 41.3352 73.7231 41.3352 73.4997 41.3352L70.3721 41.4469V40.4416C71.154 40.4416 71.4891 40.3299 71.7125 40.3299C71.9359 40.3299 71.9359 40.2182 72.0476 40.2182C72.1593 40.1065 72.1593 40.1065 72.1593 39.9948C72.271 39.7714 72.271 38.9895 72.271 37.6491C72.271 36.3086 72.271 35.1916 72.271 34.1863V30.2767C72.271 28.9363 72.271 27.8193 72.1593 26.7023C72.1593 26.1437 72.0476 25.8086 72.0476 25.6969C72.0476 25.5852 71.9359 25.5852 71.9359 25.5852C71.8242 25.4735 71.7125 25.4735 71.4891 25.4735C71.3774 25.4735 71.0423 25.4735 70.3721 25.3618V24.4682C71.4891 24.3565 72.3827 24.2448 72.8295 24.1331C73.388 24.0214 74.0582 23.798 75.0636 23.4629L75.287 23.5746L75.1753 26.4788C75.1753 27.931 75.1753 29.3831 75.1753 30.6118V31.8406L77.2976 30.0533C77.8561 29.8299 78.4146 29.7182 79.0848 29.7182C79.7551 29.7182 80.3136 29.8299 80.7604 30.0533C81.2072 30.2767 81.654 30.5001 81.9891 30.8352C82.3242 31.1703 82.4359 31.5054 82.5476 31.9523C82.6593 32.3991 82.771 32.8459 82.771 33.5161C82.771 33.7395 82.771 34.4097 82.771 35.415C82.771 36.1969 82.771 36.8671 82.771 37.314C82.771 38.8778 82.771 39.7714 82.8827 39.9948C82.8827 40.2182 82.9944 40.3299 83.1061 40.3299C83.2178 40.4416 83.6646 40.5533 84.4465 40.5533Z" fill="white"/>
<path d="M88.2441 37.873C88.8027 37.873 89.2495 38.0965 89.5846 38.4316C89.9197 38.7667 90.1431 39.2135 90.1431 39.772C90.1431 40.3305 89.9197 40.7773 89.5846 41.1124C89.2495 41.4475 88.8027 41.6709 88.2441 41.6709C87.6856 41.6709 87.2388 41.4475 86.9037 41.1124C86.5686 40.7773 86.3452 40.3305 86.3452 39.772C86.3452 39.2135 86.5686 38.7667 86.9037 38.4316C87.2388 38.0965 87.6856 37.873 88.2441 37.873Z" fill="white"/>
<path d="M106.117 40.5533V41.4469H103.548H101.313L101.202 41.3352L101.313 40.3299V39.3246C100.755 39.7714 100.085 40.3299 99.4145 40.8884C99.1911 41.1118 98.856 41.3352 98.6326 41.5586C98.2975 41.6703 97.9624 41.782 97.4039 41.782C96.0635 41.782 94.9464 41.3352 94.0528 40.3299C93.1592 39.3246 92.7124 37.9842 92.7124 36.3086C92.7124 35.3033 92.8241 34.5214 93.1592 33.7395C93.3826 33.181 93.606 32.7342 93.8294 32.3991C94.0528 32.1757 94.6113 31.7288 95.505 31.0586C96.3986 30.3884 97.0688 30.0533 97.5156 29.8299C97.9624 29.7182 98.4092 29.6065 99.0794 29.6065C99.5262 29.6065 99.7496 29.6065 100.085 29.7182C100.308 29.8299 100.755 29.9416 101.425 30.165C101.425 29.7182 101.425 29.1597 101.425 28.7129C101.425 28.0427 101.425 27.3725 101.313 26.4788C101.313 26.032 101.202 25.8086 101.202 25.6969C101.09 25.5852 101.09 25.5852 100.978 25.5852C100.867 25.5852 100.42 25.5852 99.4145 25.4735V24.5799C101.202 24.3565 102.766 24.0214 104.218 23.4629L104.553 23.6863C104.441 25.9203 104.441 27.1491 104.441 27.5959C104.441 29.7182 104.441 32.7342 104.441 36.532V37.6491C104.441 38.2076 104.441 38.7661 104.553 39.4363C104.553 39.8831 104.665 40.2182 104.665 40.3299C104.776 40.4416 104.776 40.5533 105 40.5533C104.888 40.4416 105.335 40.5533 106.117 40.5533ZM101.202 32.7342C100.755 32.1757 100.42 31.8405 100.085 31.7288C99.5262 31.3937 98.9677 31.282 98.2975 31.282C97.739 31.282 97.2922 31.3937 96.9571 31.7288C96.622 31.9523 96.2869 32.3991 96.1752 33.0693C95.9518 33.6278 95.9518 34.4097 95.9518 35.1916C95.9518 36.6437 96.2869 37.8725 96.9571 38.6544C97.4039 39.2129 98.0741 39.548 98.856 39.548C99.4145 39.548 99.973 39.3246 100.42 38.9895C100.867 38.6544 101.09 38.3193 101.202 37.9842C101.313 37.6491 101.313 36.6437 101.313 35.0799L101.202 32.7342Z" fill="white"/>
<path d="M118.069 39.5489L117.51 40.7776C116.84 41.2244 116.17 41.4479 115.388 41.6713C114.829 41.783 114.271 41.8947 113.601 41.8947C112.819 41.8947 112.037 41.783 111.478 41.5596C110.808 41.3361 110.361 41.1127 109.914 40.7776C109.468 40.4425 109.133 39.9957 108.797 39.5489C108.462 39.1021 108.239 38.5436 108.127 37.8734C108.016 37.2032 107.904 36.533 107.904 35.8627C107.904 34.7457 108.016 33.8521 108.351 32.9585C108.574 32.4 108.797 31.9532 109.021 31.7298C109.133 31.6181 109.579 31.283 110.25 30.8361C110.92 30.3893 111.478 30.0542 111.702 29.9425C112.26 29.7191 112.93 29.6074 113.712 29.6074C114.829 29.6074 115.723 29.8308 116.393 30.2776C117.063 30.7244 117.622 31.283 117.845 32.0649C118.18 32.7351 118.292 33.6287 118.292 34.634C118.292 34.8574 118.292 35.0808 118.292 35.3042C118.069 35.4159 117.734 35.4159 117.398 35.5276C116.84 35.6393 116.505 35.6393 116.281 35.751C115.723 35.751 114.829 35.8627 113.824 35.8627C112.819 35.8627 112.26 35.8627 112.148 35.8627C112.037 35.8627 111.925 35.8627 111.813 35.8627H111.031C111.143 37.2032 111.478 38.2085 112.26 38.8787C113.042 39.6606 113.936 39.9957 114.941 39.9957C115.388 39.9957 115.835 39.9957 116.281 39.884C116.728 39.7723 117.175 39.5489 117.845 39.2138L118.069 39.5489ZM115.164 34.5223C115.164 33.1819 115.053 32.2883 114.606 31.8415C114.159 31.283 113.712 31.0596 113.042 31.0596C112.372 31.0596 111.925 31.283 111.478 31.8415C111.031 32.4 110.808 33.2936 110.92 34.5223C111.367 34.634 112.26 34.634 113.377 34.634C114.047 34.634 114.718 34.5223 115.164 34.5223Z" fill="white"/>
<path d="M122.425 48.2607H16.5312V49.2661H122.425V48.2607Z" fill="black"/>
<path d="M69.8133 4.58565C33.8452 4.58565 5.36118 20.5591 5.36118 41.0005C5.36118 61.3303 33.8452 77.192 69.8133 77.192C105.781 77.192 134.042 61.3303 134.042 41.0005C134.042 20.5591 105.781 4.58565 69.8133 4.58565ZM69.7016 81.8835C51.2708 81.8835 33.9569 77.6388 20.8878 70.0431C14.5208 66.2452 9.49416 61.8888 6.0314 56.974C2.34523 51.8357 0.446289 46.4739 0.446289 40.8888C0.446289 35.3037 2.34523 29.8303 6.0314 24.8037C9.49416 19.8888 14.5208 15.5325 20.8878 11.8463C33.9569 4.13884 51.2708 0.00585938 69.7016 0.00585938C88.1325 0.00585938 105.446 4.25054 118.515 11.8463C124.882 15.6442 129.909 20.0005 133.372 24.8037C137.058 29.942 138.957 35.3037 138.957 40.8888C138.957 46.4739 137.058 51.9474 133.372 56.974C129.909 61.8888 124.882 66.2452 118.515 69.9314C105.446 77.6388 88.1325 81.8835 69.7016 81.8835Z" fill="white"/>
<path d="M24.2388 55.8569C24.2388 55.6335 24.2388 55.5218 24.2388 55.4101C24.2388 55.2984 24.2388 55.1867 24.2388 55.1867C24.2388 55.1867 24.2388 55.075 24.1271 55.075H24.0154H23.792V54.8516C23.9037 54.8516 24.1271 54.8516 24.2388 54.8516C24.3505 54.8516 24.5739 54.8516 24.6856 54.8516C24.909 54.8516 25.1324 54.8516 25.3558 54.8516C25.5792 54.8516 25.8026 54.8516 25.9143 54.8516C26.026 54.8516 26.2494 54.8516 26.3611 54.8516C26.4728 54.8516 26.5845 54.9633 26.6962 54.9633C26.8079 55.075 26.808 55.075 26.9197 55.1867C26.9197 55.2984 27.0314 55.4101 27.0314 55.5218C27.0314 55.6335 27.0314 55.7452 26.9197 55.8569C26.9197 55.9686 26.8079 56.0803 26.6962 56.0803C26.5845 56.192 26.4728 56.192 26.3611 56.3037C26.2494 56.3037 26.1377 56.4154 25.9143 56.4154C26.026 56.4154 26.2494 56.4154 26.3611 56.5271C26.4728 56.5271 26.5845 56.6388 26.6962 56.6388C26.8079 56.7505 26.9197 56.8622 26.9197 56.9739C27.0314 57.0856 27.0314 57.1973 27.0314 57.4207C27.0314 57.5324 27.0314 57.7558 26.9197 57.8675C26.808 57.9792 26.6962 58.0909 26.5845 58.2026C26.4728 58.3143 26.2494 58.426 26.1377 58.426C25.9143 58.5377 25.8026 58.5377 25.5792 58.5377C25.3558 58.5377 25.2441 58.5377 25.0207 58.5377C24.909 58.5377 24.6856 58.5377 24.5739 58.5377C24.4622 58.5377 24.3505 58.5377 24.1271 58.5377C24.0154 58.5377 23.9037 58.5377 23.792 58.5377V58.2026L23.9037 58.0909C23.9037 58.0909 23.9037 58.0909 23.9037 57.9792C23.9037 57.7558 23.9037 57.6441 23.9037 57.4207C23.9037 57.1973 23.9037 56.9739 23.9037 56.7505V55.8569H24.2388ZM25.2441 56.0803H25.3558C25.4675 56.0803 25.6909 56.0803 25.6909 55.9686C25.8026 55.8569 25.8026 55.7452 25.8026 55.6335C25.8026 55.4101 25.8026 55.2984 25.6909 55.1867C25.5792 55.075 25.4675 55.075 25.3558 55.075C25.3558 55.075 25.3558 55.075 25.2441 55.075H25.1324C25.1324 55.1867 25.1324 55.2984 25.1324 55.2984C25.1324 55.4101 25.1324 55.5218 25.1324 55.6335V56.0803H25.2441ZM25.2441 57.4207C25.2441 57.5324 25.2441 57.6441 25.2441 57.7558C25.2441 57.8675 25.2441 57.8675 25.2441 57.9792C25.2441 57.9792 25.2441 57.9792 25.3558 57.9792H25.4675C25.6909 57.9792 25.8026 57.9792 25.9143 57.8675C26.026 57.7558 26.1377 57.5324 26.1377 57.309C26.1377 56.9739 26.026 56.8622 25.9143 56.7505C25.8026 56.6388 25.6909 56.5271 25.4675 56.5271H25.3558V57.4207H25.2441Z" fill="white"/>
<path d="M28.7067 58.0909L29.0418 57.9792H29.1535C29.1535 57.9792 29.1535 57.9792 29.2652 57.8675C29.2652 57.8675 29.2652 57.7558 29.2652 57.6441C29.2652 57.5324 29.2652 57.4207 29.2652 57.1973C29.2652 57.0856 29.2652 57.0856 29.2652 56.9739V56.8622C29.2652 56.8622 29.2652 56.8622 29.2652 56.7505C29.1535 56.5271 29.0418 56.3037 28.9301 56.192C28.8184 56.0803 28.7067 55.8569 28.7067 55.7452C28.595 55.6335 28.595 55.5218 28.4833 55.4101C28.3716 55.2984 28.3716 55.1867 28.2599 55.1867L28.1482 55.075C28.1482 55.075 28.0365 55.075 27.9248 55.075V54.8516H28.0365C28.1482 54.8516 28.1482 54.8516 28.2599 54.8516C28.3716 54.8516 28.4833 54.8516 28.595 54.8516C28.7067 54.8516 28.8184 54.8516 28.9301 54.8516C29.0418 54.8516 29.1535 54.8516 29.1535 54.8516C29.2652 54.9633 29.3769 54.9633 29.4886 55.1867C29.6003 55.2984 29.712 55.5218 29.8237 55.7452L30.2705 56.5271C30.3823 56.3037 30.6057 55.9686 30.7174 55.7452C30.8291 55.5218 31.0525 55.1867 31.1642 54.9633C31.2759 54.9633 31.2759 54.9633 31.3876 54.9633C31.4993 54.9633 31.4993 54.9633 31.611 54.9633C31.7227 54.9633 31.7227 54.9633 31.8344 54.9633C31.8344 54.9633 31.9461 54.9633 32.0578 54.9633C31.9461 55.075 31.8344 55.1867 31.7227 55.2984C31.611 55.4101 31.4993 55.6335 31.3876 55.7452C31.2759 55.8569 31.1642 56.0803 31.0525 56.3037C30.9408 56.5271 30.8291 56.6388 30.7174 56.8622C30.7174 56.8622 30.7174 56.8622 30.7174 56.9739V57.0856V57.1973C30.7174 57.309 30.7174 57.309 30.7174 57.4207C30.7174 57.6441 30.7174 57.7558 30.7174 57.8675C30.7174 57.9792 30.7174 58.0909 30.7174 58.0909C30.7174 58.0909 30.7174 58.2026 30.8291 58.2026H30.9408H31.1642V58.426C31.0525 58.426 30.8291 58.426 30.7174 58.426C30.6057 58.426 30.3823 58.426 30.2705 58.426C30.1588 58.426 29.9354 58.426 29.8237 58.426C29.712 58.426 29.4886 58.426 29.3769 58.426V58.0909H28.7067Z" fill="white"/>
<path d="M34.0684 54.6279C34.2918 54.6279 34.4035 54.6279 34.6269 54.6279C34.7386 54.6279 34.962 54.6279 35.0737 54.6279C35.1854 54.6279 35.4088 54.6279 35.5205 54.6279C35.6322 54.6279 35.8556 54.6279 35.9673 54.6279V54.8513H35.7439H35.6322C35.6322 54.8513 35.6322 54.8513 35.5205 54.963C35.5205 54.963 35.5205 55.0747 35.5205 55.1864C35.5205 55.2981 35.5205 55.4098 35.5205 55.6332V57.8673C35.5205 58.0907 35.5205 58.3141 35.4088 58.5375C35.2971 58.7609 35.1854 58.8726 35.0737 58.9843C34.962 59.096 34.7386 59.2077 34.6269 59.3194C34.4035 59.4311 34.2918 59.4311 34.0684 59.4311C33.9567 59.4311 33.9567 59.4311 33.845 59.4311C33.7333 59.4311 33.7333 59.4311 33.6216 59.4311C33.6216 59.3194 33.6216 59.2077 33.6216 59.096C33.6216 58.9843 33.6216 58.8726 33.6216 58.7609H33.7333C33.7333 58.8726 33.845 58.8726 33.9567 58.8726C34.0684 58.8726 34.0684 58.9843 34.1801 58.9843H34.2918C34.2918 58.9843 34.4035 58.9843 34.4035 58.8726C34.4035 58.8726 34.4035 58.7609 34.4035 58.6492C34.4035 58.5375 34.4035 58.4258 34.4035 58.3141V55.745C34.4035 55.5215 34.4035 55.4098 34.4035 55.2981C34.4035 55.1864 34.4035 55.0747 34.4035 55.0747C34.4035 55.0747 34.4035 54.963 34.2918 54.963H34.1801H33.9567V54.6279H34.0684Z" fill="white"/>
<path d="M36.5261 54.6279C36.7495 54.6279 36.8612 54.6279 37.0846 54.6279C37.1964 54.6279 37.4198 54.6279 37.5315 54.6279C37.6432 54.6279 37.8666 54.6279 37.9783 54.6279C38.09 54.6279 38.3134 54.6279 38.4251 54.6279V54.8513H38.2017H38.09C38.09 54.8513 38.09 54.8513 37.9783 54.963C37.9783 54.963 37.9783 55.0747 37.9783 55.1864C37.9783 55.2981 37.9783 55.4098 37.9783 55.6333V56.7503C37.9783 56.862 37.9783 56.9737 37.9783 57.0854C37.9783 57.1971 38.09 57.3088 38.09 57.3088C38.2017 57.4205 38.2017 57.4205 38.3134 57.5322C38.4251 57.5322 38.5368 57.6439 38.6485 57.6439C38.8719 57.6439 38.9836 57.6439 39.0953 57.6439C39.207 57.6439 39.3187 57.5322 39.4304 57.4205C39.5421 57.3088 39.5421 57.1971 39.5421 57.0854C39.5421 56.9737 39.5421 56.7503 39.5421 56.6386V55.6333C39.5421 55.4098 39.5421 55.2981 39.5421 55.1864C39.5421 55.0747 39.5421 54.963 39.5421 54.963C39.5421 54.963 39.5421 54.8513 39.4304 54.8513H39.3187H39.0953V54.6279C39.207 54.6279 39.3187 54.6279 39.4304 54.6279C39.5421 54.6279 39.6538 54.6279 39.7655 54.6279C39.8772 54.6279 39.9889 54.6279 40.1006 54.6279C40.2123 54.6279 40.324 54.6279 40.4357 54.6279V54.8513H40.2123H40.1006C40.1006 54.8513 40.1006 54.8513 39.9889 54.963C39.9889 54.963 39.9889 55.0747 39.9889 55.1864C39.9889 55.2981 39.9889 55.4098 39.9889 55.6333V56.6386C39.9889 56.862 39.9889 57.0854 39.8772 57.1971C39.8772 57.4205 39.7655 57.5322 39.6538 57.6439C39.5421 57.7556 39.3187 57.8673 39.0953 57.979C38.8719 58.0907 38.5368 58.0907 38.2017 58.0907C37.8666 58.0907 37.6432 58.0907 37.5315 57.979C37.3081 57.8673 37.1964 57.8673 37.0846 57.7556C36.9729 57.6439 36.8612 57.5322 36.8612 57.4205C36.8612 57.3088 36.7495 57.0854 36.7495 56.9737V55.6333C36.7495 55.4098 36.7495 55.2981 36.7495 55.1864C36.7495 55.0747 36.7495 54.963 36.7495 54.963C36.7495 54.963 36.7495 54.8513 36.6378 54.8513H36.5261H36.3027V54.6279H36.5261Z" fill="white"/>
<path d="M44.122 54.6279H44.5688L45.5742 56.9737L46.021 55.2981V55.1864V55.0747H45.9093C45.9093 55.0747 45.7976 55.0747 45.6859 55.0747V54.8513C45.6859 54.8513 45.6859 54.8513 45.7976 54.8513C45.9093 54.8513 45.9093 54.8513 46.021 54.8513C46.1327 54.8513 46.1327 54.8513 46.2444 54.8513C46.3561 54.8513 46.3561 54.8513 46.3561 54.8513H46.4678C46.5795 54.8513 46.5795 54.8513 46.6912 54.8513C46.8029 54.8513 46.8029 54.8513 46.9146 54.8513C47.0263 54.8513 47.0263 54.8513 47.0263 54.8513V55.0747C46.9146 55.0747 46.9146 55.0747 46.8029 55.0747C46.8029 55.0747 46.6912 55.0747 46.6912 55.1864L46.5795 55.2981C46.5795 55.4098 46.4678 55.5215 46.4678 55.6333L45.5742 58.5375H45.1273L44.0103 56.0801L42.7816 58.5375H42.3348L41.6646 55.6333C41.6646 55.5215 41.5529 55.4098 41.5529 55.2981C41.5529 55.1864 41.5529 55.1864 41.4412 55.1864C41.4412 55.1864 41.3295 55.1864 41.3295 55.0747H41.2178V54.8513C41.2178 54.8513 41.3295 54.8513 41.4412 54.8513C41.5529 54.8513 41.6646 54.8513 41.6646 54.8513C41.7763 54.8513 41.888 54.8513 41.888 54.8513C41.9997 54.8513 41.9997 54.8513 42.1114 54.8513C42.1114 54.8513 42.2231 54.8513 42.3348 54.8513C42.4465 54.8513 42.5582 54.8513 42.6699 54.8513C42.7816 54.8513 42.8933 54.8513 43.005 54.8513C43.1167 54.8513 43.1167 54.8513 43.2284 54.8513V55.0747C43.1167 55.0747 43.005 55.0747 42.8933 55.1864C42.7816 55.1864 42.7816 55.2981 42.7816 55.2981C42.7816 55.2981 42.7816 55.4098 42.7816 55.5215C42.7816 55.6332 42.7816 55.6332 42.7816 55.745L43.1167 57.0854L44.122 54.6279Z" fill="white"/>
<path d="M47.3613 54.6279C47.6964 54.6279 47.9198 54.6279 48.1432 54.6279C48.3666 54.6279 48.59 54.6279 48.9252 54.6279C49.1486 54.6279 49.4837 54.6279 49.7071 54.6279C49.9305 54.6279 50.1539 54.6279 50.489 54.6279C50.489 54.7396 50.489 54.7396 50.489 54.8513C50.489 54.963 50.489 54.963 50.489 55.0747C50.489 55.1864 50.489 55.1864 50.489 55.2981C50.489 55.4098 50.489 55.4098 50.489 55.5215H50.2656C50.2656 55.5215 50.2656 55.5215 50.2656 55.4098V55.2981V55.1864C50.2656 55.1864 50.2656 55.1864 50.2656 55.0747H50.1539C50.0422 55.0747 50.0422 55.0747 49.9305 55.0747C49.8188 55.0747 49.8188 55.0747 49.7071 55.0747C49.5954 55.0747 49.5954 55.0747 49.5954 55.0747H49.4837C49.372 55.0747 49.372 55.0747 49.2603 55.0747C49.2603 55.1864 49.2603 55.1864 49.2603 55.2981C49.2603 55.4098 49.2603 55.4098 49.2603 55.5215V56.3035C49.372 56.3035 49.4837 56.3035 49.5954 56.3035C49.7071 56.3035 49.8188 56.3035 49.9305 56.3035C50.0422 56.3035 50.0422 56.3035 50.0422 56.3035L50.1539 56.1918C50.1539 56.1918 50.1539 56.0801 50.1539 55.9684H50.3773C50.3773 56.0801 50.3773 56.1918 50.3773 56.1918C50.3773 56.3035 50.3773 56.3035 50.3773 56.3035V56.4152V56.5269V56.6386C50.3773 56.7503 50.3773 56.7503 50.3773 56.862C50.3773 56.9737 50.3773 56.9737 50.3773 57.0854V57.1971H50.1539C50.1539 57.0854 50.1539 57.0854 50.1539 56.9737V56.862C50.1539 56.862 50.1539 56.862 50.1539 56.7503C50.1539 56.7503 50.1539 56.7503 50.0422 56.7503H49.9305H49.8188H49.7071H49.5954H49.4837V57.3088C49.4837 57.4205 49.4837 57.5322 49.4837 57.6439C49.4837 57.7556 49.4837 57.8673 49.4837 58.0907H49.9305C50.0422 58.0907 50.1539 58.0907 50.2656 58.0907C50.3773 58.0907 50.489 58.0907 50.6007 57.979C50.6007 57.8673 50.6007 57.8673 50.7124 57.7556C50.7124 57.6439 50.7124 57.6439 50.7124 57.5322H50.9358C50.9358 57.6439 50.9358 57.6439 50.9358 57.7556C50.9358 57.8673 50.9358 57.8673 50.9358 57.979C50.9358 58.0907 50.9358 58.0907 50.9358 58.2024C50.9358 58.3141 50.9358 58.3141 50.9358 58.4258C50.7124 58.4258 50.489 58.4258 50.2656 58.4258C50.0422 58.4258 49.8188 58.4258 49.5954 58.4258C49.372 58.4258 49.1486 58.4258 48.9252 58.4258C48.7017 58.4258 48.4783 58.4258 48.2549 58.4258V58.2024H48.3666C48.4783 58.2024 48.4783 58.0907 48.4783 58.0907C48.4783 57.8673 48.4783 57.7556 48.4783 57.5322C48.4783 57.3088 48.4783 57.0854 48.4783 56.862V55.8567C48.4783 55.6332 48.4783 55.5215 48.4783 55.4098C48.4783 55.2981 48.4783 55.1864 48.4783 55.1864C48.4783 55.1864 48.4783 55.0747 48.3666 55.0747H48.2549H48.0315V54.6279H47.3613Z" fill="white"/>
<path d="M51.2709 54.6279C51.4943 54.6279 51.606 54.6279 51.8294 54.6279C51.9411 54.6279 52.1645 54.6279 52.2762 54.6279C52.3879 54.6279 52.6113 54.6279 52.723 54.6279C52.8347 54.6279 53.0581 54.6279 53.1698 54.6279V54.8513H52.9464H52.8347C52.8347 54.8513 52.8347 54.8513 52.723 54.963C52.723 54.963 52.723 55.0747 52.723 55.1864C52.723 55.2981 52.723 55.4098 52.723 55.6333V56.9737C52.723 57.0854 52.723 57.1971 52.723 57.3088C52.723 57.4205 52.723 57.5322 52.723 57.7556H53.1698C53.2815 57.7556 53.3932 57.7556 53.5049 57.7556C53.6166 57.7556 53.7283 57.7556 53.84 57.6439C53.84 57.5322 53.84 57.5322 53.9517 57.4205C53.9517 57.3088 53.9517 57.3088 53.9517 57.1971H54.1751C54.1751 57.4205 54.1751 57.5322 54.0634 57.6439C54.0634 57.7556 54.0634 57.979 54.0634 58.0907C53.84 58.0907 53.6166 58.0907 53.3932 58.0907C53.1698 58.0907 52.9464 58.0907 52.723 58.0907C52.4996 58.0907 52.2762 58.0907 52.0528 58.0907C51.8294 58.0907 51.606 58.0907 51.3826 58.0907V58.2024H51.4943C51.606 58.2024 51.606 58.0907 51.606 58.0907C51.606 57.8673 51.606 57.7556 51.606 57.5322C51.606 57.3088 51.606 57.0854 51.606 56.862V55.8567C51.606 55.6333 51.606 55.5215 51.606 55.4098C51.606 55.2981 51.606 55.1864 51.606 55.1864C51.606 55.1864 51.606 55.0747 51.4943 55.0747H51.3826H51.1592V54.6279H51.2709Z" fill="white"/>
<path d="M55.0688 58.0909L55.404 57.9792H55.5157C55.5157 57.9792 55.5157 57.9792 55.6274 57.8675C55.6274 57.8675 55.6274 57.7558 55.6274 57.6441C55.6274 57.5324 55.6274 57.4207 55.6274 57.1973V55.8569C55.6274 55.6335 55.6274 55.5218 55.6274 55.4101C55.6274 55.2984 55.6274 55.1867 55.6274 55.1867C55.6274 55.1867 55.6274 55.075 55.5157 55.075H55.404H55.1806V54.8516C55.2923 54.8516 55.5157 54.8516 55.6274 54.8516C55.7391 54.8516 55.9625 54.8516 56.0742 54.8516C56.1859 54.8516 56.4093 54.8516 56.521 54.8516C56.6327 54.8516 56.8561 54.8516 56.9678 54.8516V55.075H56.7444H56.6327C56.6327 55.075 56.6327 55.075 56.521 55.1867C56.521 55.1867 56.521 55.2984 56.521 55.4101C56.521 55.5218 56.521 55.6335 56.521 55.8569V57.1973C56.521 57.4207 56.521 57.5324 56.521 57.6441C56.521 57.7558 56.521 57.8675 56.521 57.8675C56.521 57.8675 56.521 57.9792 56.6327 57.9792H56.7444H56.9678V58.2026C56.8561 58.2026 56.6327 58.2026 56.521 58.2026C56.4093 58.2026 56.1859 58.2026 56.0742 58.2026C55.9625 58.2026 55.7391 58.2026 55.6274 58.2026C55.5157 58.2026 55.2923 58.2026 55.1806 58.2026V58.0909H55.0688Z" fill="white"/>
<path d="M57.7495 54.6279C58.0846 54.6279 58.308 54.6279 58.5314 54.6279C58.7548 54.6279 58.9782 54.6279 59.3133 54.6279C59.5367 54.6279 59.8719 54.6279 60.0953 54.6279C60.3187 54.6279 60.5421 54.6279 60.8772 54.6279C60.8772 54.7396 60.8772 54.7396 60.8772 54.8513C60.8772 54.963 60.8772 54.963 60.8772 55.0747C60.8772 55.1864 60.8772 55.1864 60.8772 55.2981C60.8772 55.4098 60.8772 55.4098 60.8772 55.5215H60.6538C60.6538 55.5215 60.6538 55.5215 60.6538 55.4098V55.2981V55.1864C60.6538 55.1864 60.6538 55.1864 60.6538 55.0747H60.5421C60.4304 55.0747 60.4304 55.0747 60.3187 55.0747C60.207 55.0747 60.207 55.0747 60.0953 55.0747C59.9836 55.0747 59.9836 55.0747 59.9836 55.0747H59.8719C59.7602 55.0747 59.7602 55.0747 59.6485 55.0747C59.6485 55.1864 59.6485 55.1864 59.6485 55.2981C59.6485 55.4098 59.6485 55.4098 59.6485 55.5215V56.3035C59.7602 56.3035 59.8719 56.3035 59.9836 56.3035C60.0953 56.3035 60.207 56.3035 60.3187 56.3035C60.4304 56.3035 60.4304 56.3035 60.4304 56.3035L60.5421 56.1918C60.5421 56.1918 60.5421 56.0801 60.5421 55.9684H60.7655C60.7655 56.0801 60.7655 56.1918 60.7655 56.1918C60.7655 56.3035 60.7655 56.3035 60.7655 56.3035V56.4152V56.5269V56.6386C60.7655 56.7503 60.7655 56.7503 60.7655 56.862C60.7655 56.9737 60.7655 56.9737 60.7655 57.0854V57.1971H60.5421C60.5421 57.0854 60.5421 57.0854 60.5421 56.9737V56.862C60.5421 56.862 60.5421 56.862 60.5421 56.7503C60.5421 56.7503 60.5421 56.7503 60.4304 56.7503H60.3187H60.207H60.0953H59.9836H59.8719V57.3088C59.8719 57.4205 59.8719 57.5322 59.8719 57.6439C59.8719 57.7556 59.8719 57.8673 59.8719 58.0907H60.3187C60.4304 58.0907 60.5421 58.0907 60.6538 58.0907C60.7655 58.0907 60.8772 58.0907 60.9889 57.979C60.9889 57.8673 60.9889 57.8673 61.1006 57.7556C61.1006 57.6439 61.1006 57.6439 61.1006 57.5322H61.324C61.324 57.6439 61.324 57.6439 61.324 57.7556C61.324 57.8673 61.324 57.8673 61.324 57.979C61.324 58.0907 61.324 58.0907 61.324 58.2024C61.324 58.3141 61.324 58.3141 61.324 58.4258C61.1006 58.4258 60.8772 58.4258 60.6538 58.4258C60.4304 58.4258 60.207 58.4258 59.9836 58.4258C59.7602 58.4258 59.5367 58.4258 59.3133 58.4258C59.0899 58.4258 58.8665 58.4258 58.6431 58.4258V58.2024H58.7548C58.8665 58.2024 58.8665 58.0907 58.8665 58.0907C58.8665 57.8673 58.8665 57.7556 58.8665 57.5322C58.8665 57.3088 58.8665 57.0854 58.8665 56.862V55.8567C58.8665 55.6332 58.8665 55.5215 58.8665 55.4098C58.8665 55.2981 58.8665 55.1864 58.8665 55.1864C58.8665 55.1864 58.8665 55.0747 58.7548 55.0747H58.6431H58.4197V54.6279H57.7495Z" fill="white"/>
<path d="M61.6592 54.6283C61.8826 54.6283 61.9943 54.6283 62.2177 54.6283C62.3294 54.6283 62.5528 54.6283 62.6645 54.6283C62.8879 54.6283 63.1113 54.6283 63.223 54.6283C63.4464 54.6283 63.6698 54.6283 63.7815 54.6283C63.8932 54.6283 63.8932 54.6283 64.0049 54.6283C64.1166 54.6283 64.2283 54.6283 64.2283 54.6283C64.34 54.6283 64.4517 54.6283 64.4517 54.74C64.5634 54.74 64.6751 54.8517 64.6751 54.8517C64.7868 54.9634 64.7868 54.9634 64.8985 55.0751C64.8985 55.1868 65.0102 55.2985 65.0102 55.4102C65.0102 55.5219 65.0102 55.7453 64.8985 55.857C64.7868 55.9687 64.7868 56.0804 64.6751 56.0804C64.5634 56.1921 64.5634 56.1921 64.4517 56.1921C64.34 56.1921 64.34 56.3038 64.2283 56.3038C64.2283 56.3038 64.34 56.4155 64.34 56.5272C64.4517 56.6389 64.4517 56.7506 64.5634 56.8623C64.6751 56.974 64.6751 57.0857 64.7868 57.1975C64.8985 57.3092 64.8985 57.4209 64.8985 57.4209C64.8985 57.5326 65.0102 57.5326 65.0102 57.6443L65.1219 57.756H65.2336H65.3453V57.9794H65.2336C65.1219 57.9794 65.1219 57.9794 65.0102 57.9794C64.8985 57.9794 64.8985 57.9794 64.7868 57.9794C64.6751 57.9794 64.6751 57.9794 64.6751 57.9794H64.5634C64.4517 57.9794 64.4517 57.9794 64.34 57.9794C64.2283 57.9794 64.2283 57.9794 64.1166 57.9794C64.0049 57.9794 64.0049 57.9794 64.0049 57.9794L62.9996 56.0804L63.1113 55.9687H63.223H63.3347C63.3347 55.9687 63.4464 55.9687 63.5581 55.9687C63.6698 55.9687 63.6698 55.9687 63.7815 55.857C63.7815 55.857 63.8932 55.7453 63.8932 55.6336C63.8932 55.5219 63.8932 55.4102 63.8932 55.2985C63.8932 55.0751 63.8932 54.9634 63.7815 54.8517C63.7815 54.74 63.6698 54.74 63.6698 54.6283C63.5581 54.6283 63.5581 54.5166 63.4464 54.5166C63.3347 54.5166 63.223 54.5166 63.1113 54.5166C63.1113 54.6283 63.1113 54.74 63.1113 54.8517C63.1113 54.9634 63.1113 54.9634 63.1113 55.0751V55.1868V55.2985V56.6389C63.1113 56.8623 63.1113 56.974 63.1113 57.0857C63.1113 57.1975 63.1113 57.3092 63.1113 57.3092C63.1113 57.3092 63.1113 57.4209 63.223 57.4209H63.3347H63.5581V57.6443C63.4464 57.6443 63.223 57.6443 63.1113 57.6443C62.9996 57.6443 62.7762 57.6443 62.6645 57.6443C62.5528 57.6443 62.3294 57.6443 62.2177 57.6443C62.106 57.6443 61.8826 57.6443 61.7709 57.6443V57.4209H61.9943H62.106C62.106 57.4209 62.106 57.4209 62.2177 57.3092C62.2177 57.3092 62.2177 57.1975 62.2177 57.0857C62.2177 56.974 62.2177 56.8623 62.2177 56.6389V55.2985C62.2177 55.0751 62.2177 54.9634 62.2177 54.8517C62.2177 54.74 62.2177 54.6283 62.2177 54.6283C62.2177 54.6283 62.2177 54.5166 62.106 54.5166H61.9943H61.7709V54.6283H61.6592Z" fill="white"/>
<path d="M68.1377 54.6283C68.3611 54.6283 68.4728 54.6283 68.6962 54.6283C68.8079 54.6283 69.0313 54.6283 69.143 54.6283C69.3664 54.6283 69.5898 54.6283 69.7015 54.6283C69.9249 54.6283 70.1483 54.6283 70.26 54.6283C70.3717 54.6283 70.3717 54.6283 70.4834 54.6283C70.5951 54.6283 70.7068 54.6283 70.7068 54.6283C70.8185 54.6283 70.9302 54.6283 70.9302 54.74C71.0419 54.74 71.1537 54.8517 71.1537 54.8517C71.2654 54.9634 71.2654 54.9634 71.3771 55.0751C71.3771 55.1868 71.4888 55.2985 71.4888 55.4102C71.4888 55.5219 71.4888 55.7453 71.3771 55.857C71.2654 55.9687 71.2654 56.0804 71.1537 56.0804C71.0419 56.1921 71.0419 56.1921 70.9302 56.1921C70.8185 56.1921 70.8185 56.3038 70.7068 56.3038C70.7068 56.3038 70.8185 56.4155 70.8185 56.5272C70.9302 56.6389 70.9302 56.7506 71.0419 56.8623C71.1536 56.974 71.1536 57.0857 71.2654 57.1975C71.3771 57.3092 71.3771 57.4209 71.3771 57.4209C71.3771 57.5326 71.4888 57.5326 71.4888 57.6443L71.6005 57.756H71.7122H71.8239V57.9794H71.7122C71.6005 57.9794 71.6005 57.9794 71.4888 57.9794C71.3771 57.9794 71.3771 57.9794 71.2654 57.9794C71.1536 57.9794 71.1537 57.9794 71.1537 57.9794H71.0419C70.9302 57.9794 70.9302 57.9794 70.8185 57.9794C70.7068 57.9794 70.7068 57.9794 70.5951 57.9794C70.4834 57.9794 70.4834 57.9794 70.4834 57.9794L69.4781 56.0804L69.5898 55.9687H69.7015H69.8132C69.8132 55.9687 69.9249 55.9687 70.0366 55.9687C70.1483 55.9687 70.1483 55.9687 70.26 55.857C70.26 55.857 70.3717 55.7453 70.3717 55.6336C70.3717 55.5219 70.3717 55.4102 70.3717 55.2985C70.3717 55.0751 70.3717 54.9634 70.26 54.8517C70.26 54.74 70.1483 54.74 70.1483 54.6283C70.0366 54.6283 70.0366 54.5166 69.9249 54.5166C69.8132 54.5166 69.7015 54.5166 69.5898 54.5166C69.5898 54.6283 69.5898 54.74 69.5898 54.8517C69.5898 54.9634 69.5898 54.9634 69.5898 55.0751V55.1868V55.2985V56.6389C69.5898 56.8623 69.5898 56.974 69.5898 57.0857C69.5898 57.1975 69.5898 57.3092 69.5898 57.3092C69.5898 57.3092 69.5898 57.4209 69.7015 57.4209H69.8132H70.0366V57.6443C69.9249 57.6443 69.7015 57.6443 69.5898 57.6443C69.4781 57.6443 69.2547 57.6443 69.143 57.6443C69.0313 57.6443 68.8079 57.6443 68.6962 57.6443C68.5845 57.6443 68.3611 57.6443 68.2494 57.6443V57.4209H68.4728H68.5845C68.5845 57.4209 68.5845 57.4209 68.6962 57.3092C68.6962 57.3092 68.6962 57.1975 68.6962 57.0857C68.6962 56.974 68.6962 56.8623 68.6962 56.6389V55.2985C68.6962 55.0751 68.6962 54.9634 68.6962 54.8517C68.6962 54.74 68.6962 54.6283 68.6962 54.6283C68.6962 54.6283 68.6962 54.5166 68.5845 54.5166H68.4728H68.2494V54.6283H68.1377Z" fill="white"/>
<path d="M72.3823 58.0913C72.494 58.0913 72.494 58.0913 72.6057 58.0913H72.7174C72.7174 58.0913 72.7174 58.0913 72.8291 57.9796C72.8291 57.9796 72.8291 57.8679 72.9408 57.8679L74.2813 54.7402H74.7281L76.0685 57.8679C76.0685 57.9796 76.0685 57.9796 76.1802 57.9796C76.1802 57.9796 76.1802 58.0913 76.2919 58.0913H76.4036C76.4036 58.0913 76.5153 58.0913 76.627 58.0913V58.3147C76.5153 58.3147 76.2919 58.3147 76.1802 58.3147C76.0685 58.3147 75.8451 58.3147 75.7334 58.3147C75.51 58.3147 75.3983 58.3147 75.2866 58.3147C75.1749 58.3147 74.9515 58.3147 74.8398 58.3147V58.0913C74.8398 58.0913 74.8398 58.0913 74.9515 58.0913H75.0632H75.1749C75.1749 58.0913 75.1749 58.0913 75.1749 57.9796C75.1749 57.9796 75.1749 57.9796 75.1749 57.8679V57.7562L75.0632 57.4211H73.8344L73.7227 57.7562C73.7227 57.8679 73.7227 57.8679 73.7227 57.8679C73.7227 57.8679 73.7227 57.8679 73.7227 57.9796C73.7227 57.9796 73.7227 57.9796 73.7227 58.0913H73.8344C73.8344 58.0913 73.9462 58.0913 74.0579 58.0913V58.3147C73.9462 58.3147 73.8344 58.3147 73.7227 58.3147C73.611 58.3147 73.4993 58.3147 73.3876 58.3147C73.2759 58.3147 73.1642 58.3147 73.0525 58.3147C72.9408 58.3147 72.8291 58.3147 72.7174 58.3147V58.0913H72.3823ZM73.7227 57.086H74.6164L74.1696 55.969L73.7227 57.086Z" fill="white"/>
<path d="M77.0741 54.6279C77.2975 54.6279 77.4092 54.6279 77.6326 54.6279C77.7443 54.6279 77.9677 54.6279 78.0794 54.6279C78.1911 54.6279 78.4145 54.6279 78.5262 54.6279C78.6379 54.6279 78.8613 54.6279 78.973 54.6279V54.8513H78.7496H78.6379C78.6379 54.8513 78.6379 54.8513 78.5262 54.963C78.5262 54.963 78.5262 55.0747 78.5262 55.1864C78.5262 55.2981 78.5262 55.4098 78.5262 55.6333V56.9737C78.5262 57.0854 78.5262 57.1971 78.5262 57.3088C78.5262 57.4205 78.5262 57.5322 78.5262 57.7556H78.973C79.0847 57.7556 79.1964 57.7556 79.3081 57.7556C79.4198 57.7556 79.5316 57.7556 79.6433 57.6439C79.6433 57.5322 79.6433 57.5322 79.755 57.4205C79.755 57.3088 79.755 57.3088 79.755 57.1971H79.9784C79.9784 57.4205 79.9784 57.5322 79.8667 57.6439C79.8667 57.7556 79.8667 57.979 79.8667 58.0907C79.6433 58.0907 79.4198 58.0907 79.1964 58.0907C78.973 58.0907 78.7496 58.0907 78.5262 58.0907C78.3028 58.0907 78.0794 58.0907 77.856 58.0907C77.6326 58.0907 77.4092 58.0907 77.1858 58.0907V58.2024H77.2975C77.4092 58.2024 77.4092 58.0907 77.4092 58.0907C77.4092 57.8673 77.4092 57.7556 77.4092 57.5322C77.4092 57.3088 77.4092 57.0854 77.4092 56.862V55.8567C77.4092 55.6333 77.4092 55.5215 77.4092 55.4098C77.4092 55.2981 77.4092 55.1864 77.4092 55.1864C77.4092 55.1864 77.4092 55.0747 77.2975 55.0747H77.1858H76.9624V54.6279H77.0741Z" fill="white"/>
<path d="M81.3189 55.8569C81.3189 55.6335 81.3189 55.5218 81.3189 55.4101C81.3189 55.2984 81.3189 55.1867 81.3189 55.1867C81.3189 55.1867 81.3189 55.075 81.2072 55.075H81.0955H80.8721V54.8516C81.0955 54.8516 81.3189 54.8516 81.654 54.8516C81.8774 54.8516 82.1008 54.8516 82.4359 54.8516C82.6593 54.8516 82.8827 54.8516 83.2178 54.8516C83.4412 54.8516 83.6646 54.8516 83.9997 54.8516C83.9997 54.9633 83.9997 54.9633 83.9997 55.075C83.9997 55.1867 83.9997 55.1867 83.9997 55.2984C83.9997 55.4101 83.9997 55.4101 83.9997 55.5218C83.9997 55.6335 83.9997 55.6335 83.9997 55.7452H83.7763C83.7763 55.7452 83.7763 55.7452 83.7763 55.6335V55.5218V55.4101C83.7763 55.4101 83.7763 55.4101 83.7763 55.2984H83.6646C83.5529 55.2984 83.5529 55.2984 83.4412 55.2984C83.3295 55.2984 83.3295 55.2984 83.2178 55.2984C83.1061 55.2984 83.1061 55.2984 83.1061 55.2984H82.9944C82.9944 55.2984 82.8827 55.2984 82.771 55.2984C82.771 55.4101 82.771 55.4101 82.771 55.5218C82.771 55.6335 82.771 55.6335 82.771 55.7452V56.5271C82.8827 56.5271 82.9944 56.5271 83.1061 56.5271C83.2178 56.5271 83.3295 56.5271 83.4412 56.5271C83.5529 56.5271 83.5529 56.5271 83.5529 56.5271L83.6646 56.4154C83.6646 56.4154 83.6646 56.3037 83.6646 56.192H83.888C83.888 56.3037 83.888 56.4154 83.888 56.4154C83.888 56.5271 83.888 56.5271 83.888 56.5271V56.6388V56.7505V56.8622C83.888 56.9739 83.888 56.9739 83.888 57.0856C83.888 57.1973 83.888 57.1973 83.888 57.309V57.4207H83.6646C83.6646 57.309 83.6646 57.309 83.6646 57.1973V57.0856C83.6646 57.0856 83.6646 57.0856 83.6646 56.9739C83.6646 56.9739 83.6646 56.9739 83.5529 56.9739H83.4412H83.3295H83.2178H83.1061H82.9944V57.5324C82.9944 57.7558 82.9944 57.8675 82.9944 57.9792C82.9944 58.0909 82.9944 58.2026 82.9944 58.2026C82.9944 58.2026 82.9944 58.3143 83.1061 58.3143H83.2178H83.5529V58.5377C83.3295 58.5377 83.2178 58.5377 82.9944 58.5377C82.8827 58.5377 82.6593 58.5377 82.5476 58.5377C82.4359 58.5377 82.2125 58.5377 82.1008 58.5377C81.9891 58.5377 81.7657 58.5377 81.654 58.5377V58.3143H81.8774H81.9891C81.9891 58.3143 81.9891 58.3143 82.1008 58.2026C82.1008 58.2026 82.1008 58.0909 82.1008 57.9792C82.1008 57.8675 82.1008 57.7558 82.1008 57.5324V55.8569H81.3189Z" fill="white"/>
<path d="M89.2493 56.3037V55.8569C89.2493 55.6335 89.2493 55.5218 89.2493 55.4101C89.2493 55.2984 89.2493 55.1867 89.2493 55.1867C89.2493 55.1867 89.2493 55.075 89.1376 55.075H89.0259H88.8025V54.8516C88.9142 54.8516 89.1376 54.8516 89.2493 54.8516C89.361 54.8516 89.5844 54.8516 89.6961 54.8516C89.8078 54.8516 90.0312 54.8516 90.1429 54.8516C90.2546 54.8516 90.478 54.8516 90.5897 54.8516V55.075H90.3663H90.2546C90.2546 55.075 90.2546 55.075 90.1429 55.1867C90.1429 55.1867 90.1429 55.2984 90.1429 55.4101C90.1429 55.5218 90.1429 55.6335 90.1429 55.8569V57.1973C90.1429 57.4207 90.1429 57.5324 90.1429 57.6441C90.1429 57.7558 90.1429 57.8675 90.1429 57.8675C90.1429 57.8675 90.1429 57.9792 90.2546 57.9792H90.3663H90.5897V58.2026C90.478 58.2026 90.2546 58.2026 90.1429 58.2026C90.0312 58.2026 89.8078 58.2026 89.6961 58.2026C89.4727 58.2026 89.361 58.2026 89.2493 58.2026C89.1376 58.2026 88.9142 58.2026 88.8025 58.2026V57.9792H89.0259H89.1376C89.1376 57.9792 89.1376 57.9792 89.2493 57.8675C89.2493 57.8675 89.2493 57.7558 89.2493 57.6441C89.2493 57.5324 89.2493 57.4207 89.2493 57.1973V56.6388H88.0206V57.1973C88.0206 57.4207 88.0206 57.5324 88.0206 57.6441C88.0206 57.7558 88.0206 57.8675 88.0206 57.8675C88.0206 57.8675 88.0206 57.9792 88.1323 57.9792H88.244H88.4674V58.2026C88.3557 58.2026 88.1323 58.2026 88.0206 58.2026C87.9089 58.2026 87.6855 58.2026 87.5738 58.2026C87.4621 58.2026 87.2387 58.2026 87.127 58.2026C87.0153 58.2026 86.7919 58.2026 86.6802 58.2026V57.9792H86.9036H87.0153C87.0153 57.9792 87.0153 57.9792 87.127 57.8675C87.127 57.8675 87.127 57.7558 87.127 57.6441C87.127 57.5324 87.127 57.4207 87.127 57.1973V55.8569C87.127 55.6335 87.127 55.5218 87.127 55.4101C87.127 55.2984 87.127 55.1867 87.127 55.1867C87.127 55.1867 87.127 55.075 87.0153 55.075H86.9036H86.6802V54.8516C86.7919 54.8516 87.0153 54.8516 87.127 54.8516C87.2387 54.8516 87.4621 54.8516 87.5738 54.8516C87.6855 54.8516 87.9089 54.8516 88.0206 54.8516C88.1323 54.8516 88.3557 54.8516 88.4674 54.8516V55.075H88.244H88.1323C88.1323 55.075 88.1323 55.075 88.0206 55.1867C88.0206 55.1867 88.0206 55.2984 88.0206 55.4101C88.0206 55.5218 88.0206 55.6335 88.0206 55.8569V56.3037H89.2493Z" fill="white"/>
<path d="M91.2603 58.0915C91.372 58.0915 91.372 58.0915 91.4837 58.0915H91.5954C91.5954 58.0915 91.5954 58.0915 91.7071 57.9798C91.7071 57.9798 91.7071 57.8681 91.8188 57.8681L93.1592 54.7404H93.606L94.9464 57.8681C94.9464 57.9798 94.9464 57.9798 95.0581 57.9798C95.0581 57.9798 95.0581 58.0915 95.1698 58.0915H95.2815C95.2815 58.0915 95.3932 58.0915 95.5049 58.0915V58.3149C95.3932 58.3149 95.1698 58.3149 95.0581 58.3149C94.9464 58.3149 94.723 58.3149 94.6113 58.3149C94.3879 58.3149 94.2762 58.3149 94.1645 58.3149C94.0528 58.3149 93.8294 58.3149 93.7177 58.3149V58.0915C93.7177 58.0915 93.7177 58.0915 93.8294 58.0915H93.9411H94.0528C94.0528 58.0915 94.0528 58.0915 94.0528 57.9798C94.0528 57.9798 94.0528 57.9798 94.0528 57.8681V57.7564L93.9411 57.4213H92.7124L92.6007 57.7564C92.6007 57.8681 92.6007 57.8681 92.6007 57.8681C92.6007 57.8681 92.6007 57.8681 92.6007 57.9798C92.6007 57.9798 92.6007 57.9798 92.6007 58.0915H92.7124C92.7124 58.0915 92.8241 58.0915 92.9358 58.0915V58.3149C92.8241 58.3149 92.7124 58.3149 92.6007 58.3149C92.489 58.3149 92.3773 58.3149 92.2656 58.3149C92.1539 58.3149 92.0422 58.3149 91.9305 58.3149C91.8188 58.3149 91.7071 58.3149 91.5954 58.3149V58.0915H91.2603ZM92.2656 53.9585C92.2656 53.8468 92.2656 53.7351 92.3773 53.6234C92.489 53.5117 92.6007 53.5117 92.7124 53.5117C92.8241 53.5117 92.9358 53.5117 93.0475 53.6234C93.1592 53.7351 93.1592 53.8468 93.1592 53.9585C93.1592 54.0702 93.1592 54.1819 93.0475 54.2936C92.9358 54.4053 92.8241 54.4053 92.7124 54.4053C92.6007 54.4053 92.489 54.4053 92.3773 54.2936C92.3773 54.1819 92.2656 54.0702 92.2656 53.9585ZM92.489 57.0862H93.3826L92.9358 55.9692L92.489 57.0862ZM93.4943 53.9585C93.4943 53.8468 93.4943 53.7351 93.606 53.6234C93.7177 53.5117 93.8294 53.5117 93.9411 53.5117C94.0528 53.5117 94.1645 53.5117 94.2762 53.6234C94.3879 53.7351 94.3879 53.8468 94.3879 53.9585C94.3879 54.0702 94.3879 54.1819 94.2762 54.2936C94.1645 54.4053 94.0528 54.4053 93.9411 54.4053C93.8294 54.4053 93.7177 54.4053 93.606 54.2936C93.4943 54.1819 93.4943 54.0702 93.4943 53.9585Z" fill="white"/>
<path d="M96.3985 55.8569C96.3985 55.6335 96.3985 55.5218 96.3985 55.4101C96.3985 55.2984 96.3985 55.1867 96.3985 55.1867C96.3985 55.1867 96.3985 55.075 96.2868 55.075H96.1751H95.9517V54.8516C96.1751 54.8516 96.3985 54.8516 96.7336 54.8516C96.957 54.8516 97.1804 54.8516 97.5155 54.8516C97.7389 54.8516 97.9623 54.8516 98.2974 54.8516C98.5208 54.8516 98.7442 54.8516 99.0793 54.8516C99.0793 54.9633 99.0793 54.9633 99.0793 55.075C99.0793 55.1867 99.0793 55.1867 99.0793 55.2984C99.0793 55.4101 99.0793 55.4101 99.0793 55.5218C99.0793 55.6335 99.0793 55.6335 99.0793 55.7452H98.8559C98.8559 55.7452 98.8559 55.7452 98.8559 55.6335V55.5218V55.4101C98.8559 55.4101 98.8559 55.4101 98.8559 55.2984H98.7442C98.6325 55.2984 98.6325 55.2984 98.5208 55.2984C98.4091 55.2984 98.4091 55.2984 98.2974 55.2984C98.1857 55.2984 98.1857 55.2984 98.1857 55.2984H98.074C98.074 55.2984 97.9623 55.2984 97.8506 55.2984C97.8506 55.4101 97.8506 55.4101 97.8506 55.5218C97.8506 55.6335 97.8506 55.6335 97.8506 55.7452V56.5271C97.9623 56.5271 98.074 56.5271 98.1857 56.5271C98.2974 56.5271 98.4091 56.5271 98.5208 56.5271C98.6325 56.5271 98.6325 56.5271 98.6325 56.5271L98.7442 56.4154C98.7442 56.4154 98.7442 56.3037 98.7442 56.192H98.9676C98.9676 56.3037 98.9676 56.4154 98.9676 56.4154C98.9676 56.5271 98.9676 56.5271 98.9676 56.5271V56.6388V56.7505V56.8622C98.9676 56.9739 98.9676 56.9739 98.9676 57.0856C98.9676 57.1973 98.9676 57.1973 98.9676 57.309V57.4207H98.2974C98.2974 57.309 98.2974 57.309 98.2974 57.1973V57.0856C98.2974 57.0856 98.2974 57.0856 98.2974 56.9739C98.2974 56.9739 98.2974 56.9739 98.1857 56.9739H98.074H97.9623H97.8506H97.7389H97.6272V57.5324C97.6272 57.7558 97.6272 57.8675 97.6272 57.9792C97.6272 58.0909 97.6272 58.2026 97.6272 58.2026C97.6272 58.2026 97.6272 58.3143 97.7389 58.3143H97.8506H98.1857V58.5377C97.9623 58.5377 97.8506 58.5377 97.6272 58.5377C97.5155 58.5377 97.2921 58.5377 97.1804 58.5377C97.0687 58.5377 96.8453 58.5377 96.7336 58.5377C96.6219 58.5377 96.3985 58.5377 96.2868 58.5377V58.3143H96.5102H96.6219C96.6219 58.3143 96.6219 58.3143 96.7336 58.2026C96.7336 58.2026 96.7336 58.0909 96.7336 57.9792C96.7336 57.8675 96.7336 57.7558 96.7336 57.5324V55.8569H96.3985Z" fill="white"/>
<path d="M99.9727 55.8569C99.9727 55.6335 99.9727 55.5218 99.9727 55.4101C99.9727 55.2984 99.9727 55.1867 99.9727 55.1867C99.9727 55.1867 99.9727 55.075 99.861 55.075H99.7493H99.5259V54.8516C99.7493 54.8516 99.9727 54.8516 100.308 54.8516C100.531 54.8516 100.755 54.8516 101.09 54.8516C101.313 54.8516 101.537 54.8516 101.872 54.8516C102.095 54.8516 102.318 54.8516 102.654 54.8516C102.654 54.9633 102.654 54.9633 102.654 55.075C102.654 55.1867 102.654 55.1867 102.654 55.2984C102.654 55.4101 102.654 55.4101 102.654 55.5218C102.654 55.6335 102.654 55.6335 102.654 55.7452H102.43C102.43 55.7452 102.43 55.7452 102.43 55.6335V55.5218V55.4101C102.43 55.4101 102.43 55.4101 102.43 55.2984H102.318C102.207 55.2984 102.207 55.2984 102.095 55.2984C101.983 55.2984 101.983 55.2984 101.872 55.2984C101.76 55.2984 101.76 55.2984 101.76 55.2984H101.648C101.648 55.2984 101.537 55.2984 101.425 55.2984C101.425 55.4101 101.425 55.4101 101.425 55.5218C101.425 55.6335 101.425 55.6335 101.425 55.7452V56.5271C101.537 56.5271 101.648 56.5271 101.76 56.5271C101.872 56.5271 101.983 56.5271 102.095 56.5271C102.207 56.5271 102.207 56.5271 102.207 56.5271L102.318 56.4154C102.318 56.4154 102.318 56.3037 102.318 56.192H102.542C102.542 56.3037 102.542 56.4154 102.542 56.4154C102.542 56.5271 102.542 56.5271 102.542 56.5271V56.6388V56.7505V56.8622C102.542 56.9739 102.542 56.9739 102.542 57.0856C102.542 57.1973 102.542 57.1973 102.542 57.309V57.4207H102.318C102.318 57.309 102.318 57.309 102.318 57.1973V57.0856C102.318 57.0856 102.318 57.0856 102.318 56.9739C102.318 56.9739 102.318 56.9739 102.207 56.9739H102.095H101.983H101.872H101.76H101.648V57.5324C101.648 57.7558 101.648 57.8675 101.648 57.9792C101.648 58.0909 101.648 58.2026 101.648 58.2026C101.648 58.2026 101.648 58.3143 101.76 58.3143H101.872H102.207V58.5377C101.983 58.5377 101.872 58.5377 101.648 58.5377C101.537 58.5377 101.313 58.5377 101.201 58.5377C101.09 58.5377 100.866 58.5377 100.755 58.5377C100.643 58.5377 100.419 58.5377 100.308 58.5377V58.3143H100.531H100.643C100.643 58.3143 100.643 58.3143 100.755 58.2026C100.755 58.2026 100.755 58.0909 100.755 57.9792C100.755 57.8675 100.755 57.7558 100.755 57.5324V55.8569H99.9727Z" fill="white"/>
<path d="M103.547 55.8569C103.547 55.6335 103.547 55.5218 103.547 55.4101C103.547 55.2984 103.547 55.1867 103.547 55.1867C103.547 55.1867 103.547 55.075 103.436 55.075H103.324H103.101V54.8516H103.212C103.324 54.8516 103.324 54.8516 103.436 54.8516C103.547 54.8516 103.547 54.8516 103.659 54.8516C103.771 54.8516 103.771 54.8516 103.771 54.8516H103.882C103.994 54.8516 103.994 54.8516 104.106 54.8516C104.218 54.8516 104.218 54.8516 104.329 54.8516C104.441 54.8516 104.441 54.8516 104.441 54.8516C104.553 55.075 104.664 55.1867 104.888 55.4101C105 55.6335 105.223 55.8569 105.446 56.0803C105.67 56.3037 105.781 56.5271 106.005 56.7505C106.228 56.9739 106.34 57.1973 106.563 57.309V56.7505V56.192C106.563 56.0803 106.563 55.9686 106.563 55.8569C106.563 55.7452 106.563 55.7452 106.563 55.6335C106.563 55.6335 106.563 55.5218 106.563 55.4101V55.2984H106.452C106.452 55.2984 106.34 55.2984 106.228 55.2984V55.075H106.34C106.452 55.075 106.452 55.075 106.563 55.075C106.675 55.075 106.675 55.075 106.787 55.075C106.898 55.075 106.898 55.075 106.898 55.075H107.01C107.122 55.075 107.122 55.075 107.234 55.075C107.345 55.075 107.345 55.075 107.457 55.075C107.569 55.075 107.569 55.075 107.569 55.075V55.2984C107.457 55.2984 107.457 55.2984 107.345 55.2984H107.234C107.234 55.2984 107.234 55.2984 107.234 55.4101V55.5218C107.234 55.6335 107.234 55.7452 107.234 55.8569C107.234 55.9686 107.234 56.0803 107.234 56.3037C107.234 56.4154 107.234 56.6388 107.234 56.7505V57.1973C107.234 57.309 107.234 57.4207 107.234 57.5324C107.234 57.6441 107.234 57.7558 107.234 57.9792C107.234 58.0909 107.234 58.2026 107.234 58.426C107.234 58.5377 107.234 58.6494 107.234 58.7611C107.122 58.7611 107.01 58.7611 106.898 58.7611C106.787 58.7611 106.675 58.7611 106.563 58.7611C106.563 58.7611 106.563 58.7611 106.452 58.6494C106.452 58.6494 106.34 58.5377 106.34 58.426C106.228 58.3143 106.228 58.3143 106.117 58.2026C106.005 58.0909 106.005 57.9792 105.893 57.9792C105.781 57.8675 105.781 57.7558 105.67 57.7558C105.558 57.6441 105.558 57.6441 105.446 57.5324L105.335 57.4207C105.223 57.309 105.223 57.309 105.111 57.1973C105 57.0856 105 56.9739 104.888 56.9739C104.776 56.8622 104.776 56.7505 104.664 56.7505C104.553 56.6388 104.553 56.6388 104.441 56.5271C104.329 56.4154 104.329 56.4154 104.329 56.4154C104.329 56.5271 104.329 56.6388 104.329 56.7505C104.329 56.8622 104.329 57.0856 104.329 57.1973C104.329 57.309 104.329 57.5324 104.329 57.6441C104.329 57.7558 104.329 57.8675 104.329 57.9792C104.329 58.0909 104.329 58.2026 104.329 58.2026C104.329 58.3143 104.329 58.3143 104.329 58.3143V58.426C104.329 58.426 104.329 58.426 104.441 58.5377H104.553C104.553 58.5377 104.664 58.5377 104.776 58.5377V58.7611H104.664C104.553 58.7611 104.553 58.7611 104.441 58.7611C104.329 58.7611 104.329 58.7611 104.218 58.7611C104.106 58.7611 104.106 58.7611 104.106 58.7611H103.994C103.882 58.7611 103.882 58.7611 103.771 58.7611C103.659 58.7611 103.659 58.7611 103.547 58.7611C103.436 58.7611 103.436 58.7611 103.436 58.7611V58.5377H103.659H103.771C103.771 58.5377 103.771 58.5377 103.882 58.426C103.882 58.426 103.882 58.3143 103.882 58.2026C103.882 58.0909 103.882 57.9792 103.882 57.7558V55.8569H103.547Z" fill="white"/>
<path d="M108.016 54.6279C108.351 54.6279 108.574 54.6279 108.798 54.6279C109.021 54.6279 109.244 54.6279 109.579 54.6279C109.803 54.6279 110.138 54.6279 110.361 54.6279C110.585 54.6279 110.808 54.6279 111.143 54.6279C111.143 54.7396 111.143 54.7396 111.143 54.8513C111.143 54.963 111.143 54.963 111.143 55.0747C111.143 55.1864 111.143 55.1864 111.143 55.2981C111.143 55.4098 111.143 55.4098 111.143 55.5215H110.92C110.92 55.5215 110.92 55.5215 110.92 55.4098V55.2981V55.1864C110.92 55.1864 110.92 55.1864 110.92 55.0747H110.808C110.696 55.0747 110.696 55.0747 110.585 55.0747C110.473 55.0747 110.473 55.0747 110.361 55.0747C110.25 55.0747 110.25 55.0747 110.25 55.0747H110.138C110.026 55.0747 110.026 55.0747 109.915 55.0747C109.915 55.1864 109.915 55.1864 109.915 55.2981C109.915 55.4098 109.915 55.4098 109.915 55.5215V56.3035C110.026 56.3035 110.138 56.3035 110.25 56.3035C110.361 56.3035 110.473 56.3035 110.585 56.3035C110.696 56.3035 110.696 56.3035 110.696 56.3035L110.808 56.1918C110.808 56.1918 110.808 56.0801 110.808 55.9684H111.032C111.032 56.0801 111.032 56.1918 111.032 56.1918C111.032 56.3035 111.032 56.3035 111.032 56.3035V56.4152V56.5269V56.6386C111.032 56.7503 111.032 56.7503 111.032 56.862C111.032 56.9737 111.032 56.9737 111.032 57.0854V57.1971H110.808C110.808 57.0854 110.808 57.0854 110.808 56.9737V56.862C110.808 56.862 110.808 56.862 110.808 56.7503C110.808 56.7503 110.808 56.7503 110.696 56.7503H110.585H110.473H110.361H110.25H110.138V57.3088C110.138 57.4205 110.138 57.5322 110.138 57.6439C110.138 57.7556 110.138 57.8673 110.138 58.0907H110.585C110.696 58.0907 110.808 58.0907 110.92 58.0907C111.032 58.0907 111.143 58.0907 111.255 57.979C111.255 57.8673 111.255 57.8673 111.367 57.7556C111.367 57.6439 111.367 57.6439 111.367 57.5322H111.59C111.59 57.6439 111.59 57.6439 111.59 57.7556C111.59 57.8673 111.59 57.8673 111.59 57.979C111.59 58.0907 111.59 58.0907 111.59 58.2024C111.59 58.3141 111.59 58.3141 111.59 58.4258C111.367 58.4258 111.143 58.4258 110.92 58.4258C110.696 58.4258 110.473 58.4258 110.25 58.4258C110.026 58.4258 109.803 58.4258 109.579 58.4258C109.356 58.4258 109.133 58.4258 108.909 58.4258V58.2024H109.021C109.133 58.2024 109.133 58.0907 109.133 58.0907C109.133 57.8673 109.133 57.7556 109.133 57.5322C109.133 57.3088 109.133 57.0854 109.133 56.862V55.8567C109.133 55.6332 109.133 55.5215 109.133 55.4098C109.133 55.2981 109.133 55.1864 109.133 55.1864C109.133 55.1864 109.133 55.0747 109.021 55.0747H108.909H108.686V54.6279H108.016Z" fill="white"/>
<path d="M111.925 54.6283C112.148 54.6283 112.26 54.6283 112.483 54.6283C112.595 54.6283 112.818 54.6283 112.93 54.6283C113.154 54.6283 113.377 54.6283 113.489 54.6283C113.712 54.6283 113.935 54.6283 114.047 54.6283C114.159 54.6283 114.159 54.6283 114.271 54.6283C114.382 54.6283 114.494 54.6283 114.494 54.6283C114.606 54.6283 114.717 54.6283 114.717 54.74C114.829 54.74 114.941 54.8517 114.941 54.8517C115.052 54.9634 115.052 54.9634 115.164 55.0751C115.164 55.1868 115.276 55.2985 115.276 55.4102C115.276 55.5219 115.276 55.7453 115.164 55.857C115.052 55.9687 115.052 56.0804 114.941 56.0804C114.829 56.1921 114.829 56.1921 114.717 56.1921C114.606 56.1921 114.606 56.3038 114.494 56.3038C114.494 56.3038 114.606 56.4155 114.606 56.5272C114.717 56.6389 114.717 56.7506 114.829 56.8623C114.941 56.974 114.941 57.0857 115.052 57.1975C115.164 57.3092 115.164 57.4209 115.164 57.4209C115.164 57.5326 115.276 57.5326 115.276 57.6443L115.388 57.756H115.499H115.611V57.9794H115.499C115.388 57.9794 115.388 57.9794 115.276 57.9794C115.164 57.9794 115.164 57.9794 115.052 57.9794C114.941 57.9794 114.941 57.9794 114.941 57.9794H114.829C114.717 57.9794 114.717 57.9794 114.606 57.9794C114.494 57.9794 114.494 57.9794 114.382 57.9794C114.271 57.9794 114.271 57.9794 114.271 57.9794L113.265 56.0804L113.377 55.9687H113.489H113.6C113.6 55.9687 113.712 55.9687 113.824 55.9687C113.935 55.9687 113.935 55.9687 114.047 55.857C114.047 55.857 114.159 55.7453 114.159 55.6336C114.159 55.5219 114.159 55.4102 114.159 55.2985C114.159 55.0751 114.159 54.9634 114.047 54.8517C114.047 54.74 113.935 54.74 113.935 54.6283C113.824 54.6283 113.824 54.5166 113.712 54.5166C113.6 54.5166 113.489 54.5166 113.377 54.5166C113.377 54.6283 113.377 54.74 113.377 54.8517C113.377 54.9634 113.377 54.9634 113.377 55.0751V55.1868V55.2985V56.6389C113.377 56.8623 113.377 56.974 113.377 57.0857C113.377 57.1975 113.377 57.3092 113.377 57.3092V57.4209H113.489H113.712V57.6443C113.6 57.6443 113.377 57.6443 113.265 57.6443C113.154 57.6443 112.93 57.6443 112.818 57.6443C112.707 57.6443 112.483 57.6443 112.372 57.6443C112.26 57.6443 112.037 57.6443 111.925 57.6443V57.4209H112.148H112.26C112.26 57.4209 112.26 57.4209 112.372 57.3092C112.372 57.3092 112.372 57.1975 112.372 57.0857C112.372 56.974 112.372 56.8623 112.372 56.6389V55.2985C112.372 55.0751 112.372 54.9634 112.372 54.8517C112.372 54.74 112.372 54.6283 112.372 54.6283C112.372 54.6283 112.372 54.5166 112.26 54.5166H112.148H111.925V54.6283Z" fill="white"/>
<path d="M121.42 26.1437C121.755 26.1437 121.978 26.032 121.978 25.6969C121.978 25.3618 121.755 25.2501 121.42 25.2501H120.638C120.638 25.2501 120.526 25.2501 120.526 25.3618V26.1437C120.526 26.1437 120.526 26.2554 120.638 26.2554H121.42V26.1437ZM120.191 27.931C120.079 27.931 120.079 27.8193 120.191 27.931L120.079 24.8033C120.079 24.6916 120.079 24.6916 120.191 24.6916H121.42C121.755 24.6916 122.09 24.8033 122.202 24.915C122.425 25.0267 122.537 25.3618 122.537 25.5852C122.537 25.8086 122.425 26.032 122.425 26.1437C122.313 26.2554 122.202 26.3671 121.978 26.4788L122.648 27.7076C122.648 27.8193 122.648 27.8193 122.537 27.8193H122.09C121.978 27.8193 121.978 27.8193 121.978 27.7076L121.42 26.4788H120.638C120.638 26.4788 120.526 26.4788 120.526 26.5906V27.7076C120.526 27.8193 120.526 27.8193 120.414 27.8193H120.191V27.931ZM121.196 28.7129C121.531 28.7129 121.866 28.6012 122.09 28.4895C122.425 28.3778 122.648 28.1544 122.872 27.931C123.095 27.7076 123.207 27.4842 123.319 27.1491C123.43 26.814 123.542 26.5905 123.542 26.1437C123.542 25.8086 123.43 25.4735 123.319 25.1384C123.207 24.8033 122.983 24.5799 122.872 24.3565C122.648 24.1331 122.425 24.0214 122.09 23.9097C121.755 23.798 121.531 23.6863 121.196 23.6863C120.861 23.6863 120.526 23.798 120.303 23.9097C119.968 24.0214 119.744 24.2448 119.521 24.3565C119.297 24.5799 119.186 24.8033 119.074 25.1384C118.962 25.4735 118.851 25.6969 118.851 26.1437C118.851 26.4788 118.962 26.814 119.074 27.1491C119.186 27.4842 119.409 27.7076 119.521 27.931C119.744 28.1544 119.968 28.2661 120.303 28.4895C120.526 28.7129 120.861 28.7129 121.196 28.7129ZM121.196 29.2714C120.749 29.2714 120.414 29.1597 120.079 29.048C119.744 28.9363 119.409 28.7129 119.186 28.3778C118.962 28.1544 118.739 27.8193 118.515 27.4842C118.404 27.1491 118.292 26.7023 118.292 26.3671C118.292 25.9203 118.404 25.5852 118.515 25.2501C118.627 24.915 118.85 24.5799 119.186 24.3565C119.409 24.1331 119.744 23.9097 120.079 23.6863C120.414 23.5746 120.861 23.4629 121.196 23.4629C121.643 23.4629 121.978 23.5746 122.313 23.6863C122.648 23.798 122.983 24.0214 123.207 24.3565C123.43 24.5799 123.654 24.915 123.765 25.2501C123.877 25.5852 123.989 26.032 123.989 26.3671C123.989 26.814 123.877 27.1491 123.765 27.4842C123.654 27.8193 123.43 28.1544 123.207 28.3778C122.983 28.6012 122.648 28.8246 122.313 29.048C121.978 29.1597 121.643 29.2714 121.196 29.2714Z" fill="white"/>
<path d="M56.8557 65.2395C56.8557 65.3512 56.8557 65.3512 56.8557 65.5747C56.8557 65.7981 56.8557 65.9098 56.8557 66.0215V66.1332H56.6323C56.5206 65.9098 56.4089 65.6864 56.4089 65.5747C56.2972 65.463 56.0738 65.3513 55.8504 65.3513C55.627 65.3513 55.5153 65.3513 55.4036 65.463C55.2919 65.5747 55.2919 65.6864 55.2919 65.7981C55.2919 65.9098 55.2919 66.0215 55.4036 66.1332C55.5153 66.2449 55.7387 66.3566 56.0738 66.4683C56.1855 66.4683 56.2972 66.58 56.5206 66.58C56.6323 66.6917 56.8557 66.6917 56.8557 66.8034C56.9674 66.9151 57.0791 67.0268 57.0791 67.1385C57.0791 67.2502 57.1909 67.3619 57.1909 67.5853C57.1909 67.8087 57.1908 67.9204 57.0791 68.1438C57.0791 68.2555 56.9674 68.3672 56.8557 68.3672C56.744 68.4789 56.744 68.4789 56.6323 68.5906C56.5206 68.7023 56.4089 68.7023 56.2972 68.7023C56.1855 68.7023 55.9621 68.7023 55.8504 68.7023C55.7387 68.7023 55.5153 68.7023 55.4036 68.5906L55.0685 68.4789C54.9568 68.4789 54.9568 68.4789 54.8451 68.3672C54.8451 68.3672 54.8451 68.2555 54.8451 67.9204C54.8451 67.8087 54.8451 67.697 54.8451 67.697V67.5853H55.0685C55.1802 67.8087 55.1802 67.9204 55.2919 67.9204C55.4036 68.0321 55.4036 68.1438 55.5153 68.1438C55.627 68.2555 55.627 68.2555 55.7387 68.2555C55.8504 68.2555 55.9621 68.2555 56.0738 68.2555C56.1855 68.2555 56.2972 68.2555 56.4089 68.1438C56.5206 68.1438 56.6323 68.0321 56.744 67.9204C56.8557 67.8087 56.8557 67.697 56.8557 67.5853C56.8557 67.4736 56.744 67.3619 56.6323 67.1385C56.5206 67.0268 56.2972 66.9151 55.9621 66.8034C55.627 66.6917 55.4036 66.58 55.1802 66.4683C55.0685 66.3566 54.9568 66.2449 54.8451 66.1332C54.7334 66.0215 54.7334 65.7981 54.7334 65.6864C54.7334 65.3513 54.8451 65.1278 55.0685 64.9044C55.2919 64.681 55.627 64.5693 56.0738 64.5693C56.1855 64.5693 56.2972 64.5693 56.5206 64.5693C56.5206 65.1278 56.744 65.1278 56.8557 65.2395Z" fill="white"/>
<path d="M57.6377 68.8147V68.5913C57.6377 68.5913 57.7494 68.5913 57.8611 68.5913C57.9728 68.5913 58.0845 68.4796 58.0845 68.4796C58.0845 68.3679 58.0845 68.3679 58.0845 68.2562V67.9211V67.2509V67.1392C58.0845 66.8041 58.0845 66.5807 58.0845 66.5807V66.2456V66.1338V65.7987V65.687C58.0845 65.687 58.0845 65.687 58.0845 65.5753C57.9728 65.5753 57.8611 65.4636 57.7494 65.4636H57.6377V65.2402H58.4196C58.5313 65.2402 58.5313 65.2402 58.643 65.2402C58.7547 65.2402 58.9781 65.2402 59.2015 65.2402C59.3132 65.2402 59.4249 65.2402 59.4249 65.2402V65.3519V65.4636C59.3132 65.4636 59.3132 65.4636 59.2015 65.5753C59.0898 65.5753 58.9781 65.5753 58.9781 65.687C58.9781 65.687 58.9781 65.7987 58.9781 65.9104C58.9781 66.0222 58.9781 66.0221 58.9781 66.1338C58.9781 66.469 58.9781 66.6924 58.9781 66.9158V67.6977V68.0328V68.5913V68.703C58.9781 68.703 58.9781 68.703 58.9781 68.8147C59.0898 68.8147 59.2015 68.8147 59.3132 68.8147C59.3132 68.8147 59.4249 68.8147 59.5366 68.8147C59.5366 68.9264 59.5366 68.9264 59.5366 68.9264C59.5366 68.9264 59.5366 68.9264 59.5366 69.0381C59.5366 69.0381 59.5366 69.0381 59.4249 69.0381C59.3132 69.0381 59.3132 69.0381 59.3132 69.0381C59.3132 69.0381 59.3132 69.0381 59.2015 69.0381C59.2015 69.0381 59.0898 69.0381 58.8664 69.0381H58.3079C58.1962 69.0381 58.0845 69.0381 57.8611 69.0381C57.8611 68.8147 57.7494 68.8147 57.6377 68.8147Z" fill="white"/>
<path d="M59.7603 65.3511V65.1277H59.9837H60.0954C60.2071 65.1277 60.3188 65.1277 60.3188 65.1277C60.3188 65.1277 60.4305 65.1277 60.5422 65.1277C60.5422 65.1277 60.5422 65.1277 60.6539 65.1277C60.6539 65.1277 60.7656 65.1277 60.8773 65.1277C60.989 65.1277 60.989 65.1277 61.1007 65.1277C61.1007 65.1277 61.1007 65.1277 61.2124 65.1277C61.5475 65.3511 61.7709 65.5745 61.8826 65.7979C62.106 66.0213 62.7762 66.6915 63.8932 67.8086V67.6969V67.3617C63.8932 67.1383 63.8932 67.0266 63.8932 66.9149C63.8932 66.8032 63.8932 66.6915 63.8932 66.4681C63.8932 66.3564 63.8932 66.133 63.8932 66.0213C63.8932 65.7979 63.8932 65.5745 63.8932 65.5745C63.8932 65.4628 63.8932 65.3511 63.8932 65.3511C63.8932 65.3511 63.7815 65.2394 63.6698 65.2394C63.5581 65.2394 63.4464 65.2394 63.4464 65.1277V64.9043H63.5581H64.1166H64.7869H64.8986V65.1277H64.7869C64.6752 65.1277 64.5634 65.1277 64.5634 65.2394C64.4517 65.2394 64.4517 65.3511 64.4517 65.3511V65.4628C64.4517 65.4628 64.4517 65.4628 64.4517 65.5745C64.4517 65.5745 64.4517 65.6862 64.4517 65.7979C64.4517 66.0213 64.4517 66.2447 64.4517 66.4681C64.4517 66.4681 64.4517 66.5798 64.4517 66.6915V67.6969C64.4517 67.8086 64.4517 67.8086 64.4517 67.8086V68.1437V68.2554V68.3671C64.4517 68.4788 64.4517 68.4788 64.4517 68.4788V68.5905H64.1166L63.7815 68.2554L63.1113 67.5852L62.6645 67.1383L62.3294 66.8032C62.106 66.5798 61.8826 66.3564 61.6592 66.2447L60.7656 66.0213V67.1383C60.7656 67.25 60.7656 67.25 60.7656 67.3617V67.5852V67.9203C60.7656 68.032 60.7656 68.2554 60.7656 68.4788V68.5905C60.7656 68.5905 60.7656 68.5905 60.7656 68.7022C60.8773 68.7022 60.989 68.7022 61.2124 68.8139C61.2124 68.8139 61.2124 68.8139 61.3241 68.8139V69.0373H61.2124C61.1007 69.0373 60.989 69.0373 60.6539 69.0373C60.3188 69.0373 60.0954 69.0373 60.0954 69.0373C59.9837 69.0373 59.9837 69.0373 59.9837 69.0373C59.9837 69.0373 59.9837 69.0373 59.872 69.0373V68.9256C59.872 68.9256 59.872 68.9256 59.872 68.8139H59.9837C59.9837 68.8139 59.9837 68.8139 60.0954 68.8139C60.2071 68.8139 60.3188 68.8139 60.4305 68.8139C60.4305 68.8139 60.4305 68.7022 60.4305 68.5905C60.4305 68.2554 60.4305 68.1437 60.4305 68.032V67.9203V67.0266V66.4681C60.4305 66.2447 60.4305 66.133 60.4305 66.0213C60.4305 66.0213 60.4305 65.9096 60.3188 65.9096C60.2071 65.7979 60.2071 65.7979 60.0954 65.7979C60.0954 65.4628 59.9837 65.3511 59.7603 65.3511Z" fill="white"/>
<path d="M68.2496 65.1277C68.2496 65.2394 68.3613 65.3511 68.3613 65.5745C68.3613 65.6862 68.3613 65.7979 68.3613 65.9096H68.1379C67.9145 65.6862 67.8028 65.4628 67.5794 65.3511C67.356 65.2394 67.1326 65.1277 66.9092 65.1277C66.5741 65.1277 66.3507 65.2394 66.239 65.4628C66.0156 66.0213 65.9039 66.4681 65.9039 67.0266C65.9039 67.3617 65.9039 67.5851 66.0156 67.6968C66.1273 67.9203 66.1273 68.1437 66.239 68.2554C66.3507 68.3671 66.4624 68.4788 66.5741 68.4788C66.7975 68.5905 66.9092 68.5905 67.1326 68.5905C67.356 68.5905 67.5794 68.4788 67.6911 68.3671C67.9145 68.2554 68.0262 68.032 68.2496 67.8085C68.3613 67.8085 68.3613 67.8085 68.473 67.8085C68.473 67.9202 68.473 67.9203 68.473 68.032C68.473 68.032 68.473 68.1437 68.3613 68.3671V68.4788V68.5905C68.2496 68.7022 68.0262 68.7022 67.9145 68.8139C67.6911 68.8139 67.4677 68.9256 67.1326 68.9256C66.9092 68.9256 66.6858 68.9256 66.4624 68.8139C66.239 68.8139 66.1273 68.7022 65.9039 68.5905C65.6805 68.4788 65.5688 68.2554 65.3454 68.1437C65.2337 68.032 65.122 67.8086 65.122 67.5851C65.0103 67.3617 65.0103 67.1383 65.0103 66.9149C65.0103 66.3564 65.2337 65.9096 65.5688 65.4628C65.9039 65.1277 66.4624 64.9043 67.0209 64.9043C67.2443 64.9043 67.4677 64.9043 67.6911 64.9043C67.8028 65.1277 68.0262 65.1277 68.2496 65.1277Z" fill="white"/>
<path d="M68.8078 65.1279C68.9195 65.1279 69.0312 65.1279 69.1429 65.1279C69.2546 65.1279 69.478 65.1279 69.7014 65.1279C69.8131 65.1279 69.9248 65.1279 70.2599 65.1279C70.7067 65.1279 71.0418 65.1279 71.3769 65.1279H71.9354C72.0471 65.1279 72.2705 65.1279 72.4939 65.1279V65.2396V65.7981V65.9098H72.3822C72.3822 65.9098 72.3822 65.9098 72.2705 65.9098C72.2705 65.9098 72.2705 65.7981 72.1588 65.6864L72.0471 65.463C72.0471 65.3513 71.9354 65.2396 71.8237 65.2396C71.8237 65.2396 71.712 65.2396 71.6003 65.2396C71.6003 65.2396 71.4886 65.2396 71.3769 65.2396C71.1535 65.2396 71.0418 65.2396 70.8184 65.2396C70.595 65.2396 70.3716 65.2396 70.1482 65.2396C70.1482 65.2396 70.1482 65.463 70.1482 65.7981V66.245V66.5801H70.2599C70.595 66.5801 70.8184 66.5801 71.0418 66.5801C71.1535 66.5801 71.2652 66.5801 71.2652 66.5801L71.3769 66.4684C71.3769 66.4684 71.3769 66.245 71.4886 66.0215H71.6003C71.6003 66.245 71.6003 66.3567 71.6003 66.3567C71.6003 66.5801 71.6003 66.6918 71.6003 66.6918V66.8035C71.6003 66.8035 71.6003 66.9152 71.6003 67.0269C71.6003 67.1386 71.6003 67.2503 71.6003 67.2503V67.362H71.3769C71.3769 67.362 71.3769 67.2503 71.3769 67.1386C71.3769 66.9152 71.2652 66.8035 71.2652 66.8035L71.1535 66.6918C71.1535 66.6918 70.9301 66.6918 70.7067 66.6918C70.3716 66.6918 70.1482 66.6918 70.0365 66.6918V67.1386C70.0365 67.362 70.0365 67.5854 70.0365 67.6971V68.3673C70.0365 68.479 70.0365 68.479 70.1482 68.479C70.2599 68.479 70.4833 68.5907 70.8184 68.5907C71.0418 68.5907 71.2652 68.5907 71.4886 68.479C71.6003 68.479 71.712 68.3673 71.8237 68.2556C71.9354 68.1439 72.0471 67.9205 72.1588 67.6971C72.2705 67.6971 72.2705 67.6971 72.2705 67.6971C72.2705 67.6971 72.2705 67.6971 72.3822 67.6971V67.8088V67.9205L72.2705 68.479V68.8141C72.1588 68.8141 72.0471 68.8141 71.9354 68.8141C71.8237 68.8141 71.4886 68.8141 71.0418 68.8141C70.7067 68.8141 70.3716 68.8141 69.8131 68.8141C69.5897 68.8141 69.2546 68.8141 68.9195 68.8141H68.8078H68.4727V68.5907C68.4727 68.5907 68.5844 68.5907 68.6961 68.5907C68.9195 68.5907 69.0312 68.5907 69.1429 68.479C69.1429 68.479 69.1429 68.3673 69.1429 68.2556V68.1439V68.0322V66.9152V66.5801V66.1332V65.7981V65.463C69.1429 65.463 69.1429 65.463 69.1429 65.3513C69.1429 65.3513 69.1429 65.3513 69.0312 65.3513C69.0312 65.3513 69.0312 65.3513 68.9195 65.3513C68.8078 65.3513 68.6961 65.3513 68.5844 65.3513H68.4727L68.8078 65.1279Z" fill="white"/>
<path d="M75.5101 65.1283C75.5101 65.1283 75.6218 65.1283 75.7335 65.1283H75.8452H76.0686C76.0686 65.24 76.0686 65.24 76.0686 65.24C76.0686 65.24 76.0686 65.24 76.0686 65.3517C76.0686 65.3517 76.0686 65.4634 76.0686 65.6868V66.1336V66.357V68.256V68.3677C76.0686 68.4794 76.0686 68.4794 76.0686 68.4794C76.0686 68.4794 76.1803 68.4794 76.292 68.5911C76.292 68.5911 76.4037 68.5911 76.5154 68.5911V68.7028H76.4037C76.292 68.7028 76.1803 68.7028 76.0686 68.7028C75.9569 68.7028 75.9569 68.7028 75.8452 68.7028C75.8452 68.7028 75.6218 68.7028 75.2867 68.7028H75.175H75.0633H74.9516H74.8399H74.7282V68.5911C74.7282 68.5911 74.7282 68.5911 74.7282 68.4794C74.8399 68.4794 74.8399 68.4794 74.9516 68.3677C75.0633 68.3677 75.175 68.256 75.175 68.256V68.1443V67.9209V67.6975V67.2506V67.1389C75.175 67.1389 75.175 67.0272 75.175 66.9155V66.8038C75.175 66.8038 75.175 66.6921 75.175 66.5804V66.4687C75.175 66.357 75.175 66.2453 75.175 66.2453V66.1336V66.0219V65.7985V65.6868V65.5751C75.175 65.4634 75.175 65.4634 75.175 65.3517C75.0633 65.4634 74.8399 65.5751 74.7282 65.6868C74.7282 65.6868 74.6165 65.6868 74.5048 65.7985C74.3931 65.6868 74.3931 65.6868 74.3931 65.5751C74.6165 65.4634 74.7282 65.3517 74.8399 65.3517C74.9516 65.24 75.0633 65.1283 75.175 65.0166C75.2867 65.24 75.3984 65.24 75.5101 65.1283Z" fill="white"/>
<path d="M77.1857 68.9262C77.074 68.9262 77.074 68.8145 77.1857 68.9262C77.1857 68.8145 77.1857 68.8145 77.1857 68.7028C77.1857 68.7028 77.2974 68.7028 77.2974 68.5911C77.5208 68.4794 77.6325 68.3677 77.8559 68.3677C77.9676 68.256 78.0793 68.1443 78.191 67.9209C78.3027 67.8092 78.3027 67.5858 78.4144 67.4741C78.4144 67.2506 78.5261 67.1389 78.5261 67.0272C78.5261 67.0272 78.5261 66.9155 78.5261 66.8038C78.5261 66.6921 78.5261 66.5804 78.5261 66.4687C78.5261 66.0219 78.4144 65.6868 78.3027 65.4634C78.191 65.3517 78.0793 65.24 77.9676 65.24C77.8559 65.24 77.7442 65.3517 77.6325 65.4634C77.5208 65.5751 77.4091 65.7985 77.4091 66.1336C77.4091 66.357 77.4091 66.4687 77.4091 66.6921C77.4091 66.8038 77.4091 66.9155 77.5208 67.0272C77.5208 67.1389 77.6325 67.1389 77.6325 67.1389C77.7442 67.1389 77.7442 67.1389 77.8559 67.1389H77.9676C77.9676 67.1389 77.9676 67.1389 78.0793 67.1389C78.0793 67.1389 78.0793 67.1389 78.0793 67.2506C78.0793 67.3624 78.0793 67.3624 77.9676 67.3624C77.8559 67.3624 77.7442 67.4741 77.5208 67.4741C77.4091 67.4741 77.4091 67.4741 77.2974 67.4741C77.074 67.3624 76.9623 67.3624 76.9623 67.3624C77.074 67.1389 77.074 67.0272 76.9623 67.0272C76.8506 66.9155 76.8506 66.8038 76.8506 66.6921C76.8506 66.5804 76.8506 66.357 76.8506 66.2453C76.8506 66.0219 76.8506 65.7985 76.9623 65.5751C77.074 65.3517 77.1857 65.24 77.4091 65.1283C77.6325 65.0166 77.7442 65.0166 77.9676 65.0166C78.3027 65.0166 78.6378 65.1283 78.8612 65.4634C79.0846 65.6868 79.1963 66.1336 79.1963 66.6921C79.1963 66.9155 79.1963 67.2506 79.0846 67.4741C79.0846 67.5858 78.9729 67.6975 78.8612 67.9209C78.7495 68.1443 78.6378 68.256 78.4144 68.4794C78.191 68.5911 77.9676 68.8145 77.7442 68.8145C77.5208 68.9262 77.4091 68.9262 77.1857 68.9262Z" fill="white"/>
<path d="M79.643 65.1279C79.7547 65.1279 79.8664 65.1279 79.9781 65.1279H80.6483H81.2068H81.5419H81.6536H81.7653C81.7653 65.2396 81.7653 65.2396 81.7653 65.3513C81.7653 65.3513 81.7653 65.5747 81.6536 65.7981C81.6536 65.9098 81.5419 66.1332 81.5419 66.2449C81.5419 66.3567 81.4302 66.4684 81.4302 66.5801C81.4302 66.6918 81.3185 66.8035 81.3185 66.9152C81.3185 67.0269 81.2068 67.1386 81.2068 67.2503L81.0951 67.6971C81.0951 67.8088 80.9834 67.9205 80.9834 68.0322L80.76 68.7024V68.8141C80.76 68.8141 80.76 68.9258 80.8717 68.9258L80.9834 69.0375V69.1492H80.8717H80.6483C80.6483 69.1492 80.6483 69.1492 80.5366 69.1492H80.4249H80.3132C80.3132 69.0375 80.3132 69.0375 80.4249 68.8141C80.4249 68.7024 80.5366 68.479 80.6483 68.1439L81.2068 66.8035L81.3185 66.4684C81.3185 66.4684 81.3185 66.3567 81.4302 66.2449V66.1332C81.2068 66.1332 81.0951 66.1332 80.9834 66.1332H80.5366H80.2015C80.0898 66.1332 79.9781 66.1332 79.9781 66.1332L79.8664 66.2449C79.8664 66.3567 79.8664 66.3567 79.7547 66.3567H79.643H79.5312C79.5312 66.3567 79.5312 66.3567 79.5312 66.2449C79.5312 66.1332 79.5312 66.0215 79.5312 65.7981C79.5312 65.6864 79.5312 65.5747 79.5312 65.5747C79.643 65.3513 79.643 65.2396 79.643 65.1279Z" fill="white"/>
<path d="M83.1059 67.0269C82.8825 66.9152 82.7708 66.8035 82.6591 66.5801C82.5474 66.3567 82.5474 66.2449 82.5474 66.1332C82.5474 66.0215 82.5474 65.9098 82.5474 65.7981C82.5474 65.6864 82.6591 65.5747 82.7708 65.463C82.8825 65.3513 82.9942 65.2396 83.1059 65.2396C83.2176 65.1279 83.441 65.1279 83.5527 65.1279C83.8878 65.1279 84.1112 65.2396 84.3346 65.3513C84.558 65.5747 84.6697 65.6864 84.6697 66.0215C84.6697 66.1332 84.6697 66.2449 84.558 66.3567C84.4463 66.4684 84.4463 66.5801 84.3346 66.5801L84.1112 66.6918C84.1112 66.6918 84.1112 66.6918 84.2229 66.8035C84.3346 66.9152 84.4463 66.9152 84.558 67.1386C84.6697 67.2503 84.6697 67.362 84.7814 67.4737C84.7814 67.5854 84.7814 67.6971 84.7814 67.8088C84.7814 68.0322 84.7814 68.1439 84.7814 68.2556C84.7814 68.2556 84.6697 68.3673 84.6697 68.479C84.558 68.5907 84.558 68.7024 84.4463 68.7024C84.3346 68.8141 84.2229 68.8141 83.9995 68.9258C83.8878 68.9258 83.7761 69.0375 83.6644 69.0375C83.5527 69.0375 83.3293 69.0375 83.2176 69.0375C83.1059 69.0375 82.9942 68.9258 82.9942 68.9258C82.8825 68.8141 82.7708 68.8141 82.7708 68.7024C82.7708 68.5907 82.6591 68.5907 82.6591 68.479C82.6591 68.3673 82.5474 68.2556 82.5474 68.1439C82.5474 67.9205 82.6591 67.6971 82.7708 67.5854C82.6591 67.2503 82.8825 67.1386 83.1059 67.0269ZM83.3293 67.2503C83.3293 67.2503 83.2176 67.2503 83.1059 67.362C82.9942 67.4737 82.8825 67.6971 82.8825 67.9205C82.8825 68.1439 82.9942 68.3673 83.1059 68.479C83.2176 68.5907 83.3293 68.7024 83.5527 68.7024C83.7761 68.7024 83.8878 68.7024 83.9995 68.5907C84.1112 68.479 84.1112 68.3673 84.1112 68.1439C84.1112 68.0322 84.1112 67.9205 83.9995 67.8088C83.8878 67.6971 83.7761 67.5854 83.5527 67.4737C83.441 67.2503 83.3293 67.2503 83.3293 67.2503ZM83.7761 66.6918C83.8878 66.5801 83.9995 66.4684 83.9995 66.3567C83.9995 66.2449 84.1112 66.1332 84.1112 66.0215C84.1112 65.7981 84.1112 65.6864 83.9995 65.5747C83.8878 65.463 83.7761 65.463 83.6644 65.463C83.5527 65.463 83.441 65.463 83.3293 65.5747C83.2176 65.6864 83.2176 65.7981 83.2176 65.9098C83.2176 66.0215 83.2176 66.1332 83.3293 66.1332C83.3293 66.2449 83.441 66.2449 83.5527 66.3567C83.3293 66.4684 83.441 66.4684 83.7761 66.6918Z" fill="white"/>
</svg>
