<svg width="112" height="104" viewBox="0 0 112 104" fill="none" xmlns="http://www.w3.org/2000/svg">
<rect width="80" height="80" fill="#F7F3F4"/>
<path d="M68 82C80.1503 82 90 72.1503 90 60C90 47.8497 80.1503 38 68 38C55.8497 38 46 47.8497 46 60C46 72.1503 55.8497 82 68 82Z" fill="#0094D3"/>
<path d="M80.7 29.5C78.5 28.6 76.2 27.9 73.8 27.5L71.7 20H64.2L62.2 27.5C57.5 28.3 53 30.2 49.1 32.9L42.3 29L37 34.3L40.9 41.1C38.2 45 36.4 49.5 35.5 54.2L28 56.3V63.8L35.5 65.8C36.3 70.5 38.2 75 40.9 78.9L37 85.7L42.3 91L49.1 87.1C53 89.8 57.5 91.7 62.2 92.5L64.2 100H71.7L73.7 92.5C78.4 91.7 82.9 89.8 86.8 87.1L93.6 91L98.9 85.7L95 78.9C97.7 75 99.6 70.5 100.4 65.8L107.9 63.7V56.2L100.4 54.2C99.6 49.5 97.7 45 95 41.1L98.9 34.3L93.6 29" stroke="#0094D3" stroke-width="3" stroke-miterlimit="10"/>
<path d="M56 72L68 60L56 48" stroke="white" stroke-width="3" stroke-miterlimit="10"/>
<path d="M66 72H82" stroke="white" stroke-width="3" stroke-miterlimit="10"/>
</svg>
