<svg width="112" height="104" viewBox="0 0 112 104" fill="none" xmlns="http://www.w3.org/2000/svg">
<rect width="80" height="80" fill="#F7F3F4"/>
<path d="M98 20H108V100H28V20H80.8" stroke="#0081C6" stroke-width="3" stroke-miterlimit="10"/>
<path d="M76 89.5H60C48.0761 89.5 38.5 79.9239 38.5 68C38.5 56.0761 48.0761 46.5 60 46.5H76C87.9239 46.5 97.5 56.0761 97.5 68C97.5 79.9239 87.9239 89.5 76 89.5Z" fill="#0081C6" stroke="#0081C6"/>
<path d="M28 36H108" stroke="#0081C6" stroke-width="3" stroke-miterlimit="10"/>
<path d="M58 80L46 68L58 56" stroke="white" stroke-width="3" stroke-miterlimit="10"/>
<path d="M78 80L90 68L78 56" stroke="white" stroke-width="3" stroke-miterlimit="10"/>
<path d="M72 56L64 80" stroke="white" stroke-width="3" stroke-miterlimit="10"/>
<path d="M34.1001 28H37.1001" stroke="#0081C6" stroke-width="3" stroke-miterlimit="10"/>
<path d="M41 28H44" stroke="#0081C6" stroke-width="3" stroke-miterlimit="10"/>
<path d="M48 28H51" stroke="#0081C6" stroke-width="3" stroke-miterlimit="10"/>
</svg>
