<svg width="227" height="48" viewBox="0 0 227 48" fill="none" xmlns="http://www.w3.org/2000/svg">
<path d="M51.0519 11.1265C51.0519 10.6952 50.8363 10.609 49.6719 10.4365V9.91895H54.5021C57.9522 9.91895 60.0654 12.0753 60.0654 15.4823C60.0654 18.8893 57.9091 21.0456 54.5021 21.0456H49.6719V20.5281C50.8363 20.3987 51.0519 20.2693 51.0519 19.8381V11.1265ZM52.9926 19.8812C52.9926 20.3125 53.3376 20.4419 54.3296 20.4419C56.9172 20.4419 57.9953 19.0187 57.9953 15.4823C57.9953 11.989 56.9172 10.5227 54.3727 10.5227H52.9926V19.8812Z" fill="white"/>
<path d="M64.4647 12.6791V20.0538C64.4647 20.4419 64.594 20.4851 65.5428 20.6144V21.0888H61.532V20.6144C62.5671 20.4851 62.6533 20.4419 62.6533 20.0538V14.7061C62.6533 14.1454 62.3514 13.9729 61.3164 13.9729V13.4985L63.8609 12.6791H64.4647ZM64.6372 10.2209C64.6372 10.8247 64.1628 11.2991 63.5159 11.2991C62.9121 11.2991 62.4377 10.8247 62.4377 10.2209C62.4377 9.61713 62.9121 9.09961 63.559 9.09961C64.1196 9.14274 64.6372 9.61713 64.6372 10.2209Z" fill="white"/>
<path d="M74.2109 19.3635C73.564 20.6142 72.3996 21.3042 70.9333 21.3042C68.4751 21.3042 66.75 19.536 66.75 16.9915C66.75 14.4471 68.3888 12.6357 70.7608 12.6357C71.8389 12.6357 72.7015 13.0239 73.3484 13.757C73.9522 14.4902 74.1678 15.2233 74.2109 16.6465H68.6044V16.9915C68.6044 19.2773 69.5532 20.4848 71.3214 20.4848C72.3565 20.4848 73.0034 20.0967 73.6934 19.1047L74.2109 19.3635ZM72.2702 15.6115C72.2702 14.0589 71.7096 13.1964 70.6745 13.1964C69.5101 13.1964 68.9063 14.0589 68.6476 15.9565H72.2271V15.6115H72.2702Z" fill="white"/>
<path d="M80.1627 4.39902C80.1627 3.709 79.7745 3.49336 77.877 3.2346V2.37207H85.8985C91.6344 2.37207 95.1708 5.95158 95.1708 11.6443C95.1708 17.2939 91.5481 20.9165 85.8985 20.9165H77.877V20.054C79.7745 19.7952 80.1627 19.6227 80.1627 18.8896V4.39902ZM83.3972 18.9758C83.3972 19.6659 83.9578 19.9246 85.5966 19.9246C89.9093 19.9246 91.6775 17.5095 91.6775 11.6874C91.6775 5.86533 89.9093 3.40711 85.6398 3.40711H83.3541V18.9758H83.3972Z" fill="white"/>
<path d="M110.265 18.0705C109.144 20.1837 107.289 21.2619 104.831 21.2619C100.734 21.2619 97.8877 18.2861 97.8877 14.0597C97.8877 9.83332 100.648 6.81445 104.572 6.81445C106.341 6.81445 107.85 7.50448 108.885 8.71203C109.877 9.91957 110.265 11.1271 110.351 13.4991H101.036V14.0597C101.036 17.8549 102.632 19.8818 105.564 19.8818C107.332 19.8818 108.367 19.2781 109.489 17.5961L110.265 18.0705ZM107.031 11.8603C107.031 9.22955 106.125 7.84949 104.4 7.84949C102.459 7.84949 101.424 9.27267 101.036 12.464H107.031V11.8603Z" fill="white"/>
<path d="M122.858 18.4584C121.521 20.4422 120.098 21.2616 118.071 21.2616C115.527 21.2616 114.017 19.7953 114.017 17.2939V8.88425C114.017 8.3236 113.758 8.15109 112.68 8.02171L112.249 7.97859V7.15918H117.036V16.9921C117.036 18.6309 117.899 19.5365 119.451 19.5365C121.219 19.5365 122.599 18.2427 122.599 16.5608V8.88425C122.599 8.3236 122.341 8.15109 121.349 8.02171L120.961 7.97859V7.15918H125.618V18.1565C125.618 18.8465 126.093 19.0621 127.732 19.0621V19.8384L124.109 20.9166H123.074L122.858 18.4584Z" fill="white"/>
<path d="M137.995 18.5449C137.305 20.3993 136.141 21.2618 134.33 21.2618C132.13 21.2618 130.88 19.9249 130.88 17.6823V8.41008H128.982V7.28879L129.672 7.15941C131.526 6.90065 132.389 5.82248 132.82 3.36426H133.812V7.11628H137.305V8.36695H133.812V17.9842C133.812 19.1918 134.33 19.8387 135.278 19.8387C136.055 19.8387 136.572 19.4074 137.176 18.1998L137.995 18.5449Z" fill="white"/>
<path d="M148.26 10.8249C147.44 8.49608 146.793 7.8923 145.025 7.8923C143.386 7.8923 142.437 8.62546 142.437 9.91926C142.437 10.7387 142.826 11.3424 143.688 11.7737C144.292 12.0756 144.378 12.1187 146.233 12.7225C149.165 13.7144 150.243 14.8357 150.243 16.8627C150.243 19.5796 148.13 21.3047 144.853 21.3047C143.3 21.3047 141.92 21.0028 140.195 20.3128V16.8195H141.316C142.265 19.5796 142.998 20.2697 144.939 20.2697C146.793 20.2697 147.871 19.4503 147.871 17.9839C147.871 17.1214 147.483 16.5176 146.621 16.0864C146.189 15.8276 145.801 15.6982 144.206 15.1376C141.273 14.1025 140.195 12.9813 140.195 10.9112C140.195 8.40982 142.092 6.90039 145.284 6.90039C146.621 6.90039 147.915 7.15915 149.338 7.67667V10.9112H148.26V10.8249Z" fill="white"/>
<path d="M164.864 17.6393C163.829 20.0543 162.017 21.2619 159.43 21.2619C155.505 21.2619 152.788 18.3293 152.788 14.0597C152.788 9.74707 155.634 6.81445 159.775 6.81445C162.664 6.81445 164.605 7.93575 164.605 9.57456C164.605 10.4371 164.001 10.9977 163.009 10.9977H161.543V8.45327C161.025 8.022 160.422 7.84949 159.559 7.84949C157.187 7.84949 155.979 9.91958 155.979 13.9735C155.979 17.898 157.316 19.8818 159.99 19.8818C161.888 19.8818 162.966 19.1487 163.958 17.2511L164.864 17.6393Z" fill="white"/>
<path d="M171.591 9.35849C172.928 7.63342 174.438 6.81402 176.378 6.81402C178.88 6.81402 180.432 8.32345 180.432 10.7385V19.2345C180.432 19.7951 180.691 19.9677 181.769 20.097L182.201 20.1402V20.9596H175.732V20.1402C177.155 19.9677 177.37 19.8383 177.37 19.2345V11.0404C177.37 9.531 176.465 8.58221 174.998 8.58221C173.144 8.58221 171.591 9.91914 171.591 11.5148V19.1914C171.591 19.7951 171.764 19.9245 173.23 20.097V20.9164H166.761V20.097C168.4 19.9245 168.529 19.8383 168.529 19.1914V3.40701C168.529 2.50135 168.055 2.19946 166.373 2.15633V1.33693L170.513 0H171.548V9.35849H171.591Z" fill="white"/>
<path d="M196.518 18.0705C195.397 20.1837 193.5 21.2619 191.085 21.2619C186.987 21.2619 184.141 18.2861 184.141 14.0597C184.141 9.83332 186.901 6.81445 190.826 6.81445C192.594 6.81445 194.103 7.50448 195.138 8.71203C196.13 9.91957 196.518 11.1271 196.605 13.4991H187.289V14.0597C187.289 17.8549 188.885 19.8818 191.818 19.8818C193.586 19.8818 194.621 19.2781 195.742 17.5961L196.518 18.0705ZM193.327 11.8603C193.327 9.22955 192.421 7.84949 190.696 7.84949C188.756 7.84949 187.721 9.27267 187.333 12.464H193.327V11.8603Z" fill="white"/>
<path d="M10.4268 33.2501C9.30547 30.3175 8.65857 29.7569 6.41598 29.7569C4.08714 29.7569 2.75021 30.8782 2.75021 32.8189C2.75021 33.9833 3.22461 34.8027 4.30277 35.4496C5.07905 35.924 5.12218 35.9671 7.70978 36.7865C11.4618 38.0372 12.7987 39.5035 12.7987 42.393C12.7987 45.7569 10.2543 47.8701 6.20035 47.8701C4.3459 47.8701 3.0521 47.6113 0.291992 46.7488V42.1342H1.41329C2.87959 46.1019 3.65587 46.7919 6.32973 46.7919C8.91733 46.7919 10.2974 45.6706 10.2974 43.6005C10.2974 42.2205 9.77986 41.3148 8.61544 40.5817C7.92542 40.1935 7.49415 40.021 5.51032 39.331C1.84455 38.1235 0.378246 36.614 0.378246 33.9833C0.378246 30.7488 2.75021 28.6787 6.54536 28.6787C8.18418 28.6787 9.43485 28.8943 11.5049 29.4981V33.2933H10.4268V33.2501Z" fill="white"/>
<path d="M27.7639 44.2475C26.7289 46.6626 24.9176 47.8701 22.33 47.8701C18.4055 47.8701 15.6885 44.9375 15.6885 40.7111C15.6885 36.3984 18.5348 33.4658 22.675 33.4658C25.5645 33.4658 27.5052 34.5871 27.5052 36.2259C27.5052 37.0885 26.9014 37.6491 25.9095 37.6491H24.4432V35.1046C23.8825 34.6734 23.3219 34.5009 22.4594 34.5009C20.0874 34.5009 18.8798 36.5709 18.8798 40.6248C18.8798 44.5494 20.2168 46.5332 22.8906 46.5332C24.7882 46.5332 25.8664 45.8001 26.8583 43.9025L27.7639 44.2475Z" fill="white"/>
<path d="M34.4913 35.9679C35.8282 34.2428 37.3376 33.4234 39.2783 33.4234C41.7797 33.4234 43.3754 34.9328 43.3754 37.3479V45.8439C43.3754 46.4045 43.6341 46.577 44.7123 46.7064L45.1436 46.7495V47.5689H38.6746V46.7495C40.0978 46.577 40.3134 46.4476 40.3134 45.8439V37.6498C40.3134 36.1404 39.4077 35.1916 37.9414 35.1916C36.087 35.1916 34.4913 36.5285 34.4913 38.1242V45.8007C34.4913 46.4045 34.6638 46.5339 36.1301 46.7064V47.5258H29.6611V46.7064C31.2999 46.5339 31.4293 46.4476 31.4293 45.8007V30.0164C31.4293 29.1107 30.9549 28.8088 29.2729 28.7657V27.9463L33.4131 26.6094H34.4482V35.9679H34.4913Z" fill="white"/>
<path d="M56.9173 45.0677C55.5803 47.0516 54.1572 47.871 52.1302 47.871C49.5857 47.871 48.0763 46.4047 48.0763 43.9033V35.4936C48.0763 34.933 47.8175 34.7605 46.7394 34.6311L46.3081 34.588V33.7686H51.0952V43.6014C51.0952 45.2403 51.9577 46.1459 53.5103 46.1459C55.2785 46.1459 56.6585 44.8521 56.6585 43.1702V35.4936C56.6585 34.933 56.3998 34.7605 55.4078 34.6311L55.0197 34.588V33.7686H59.6774V44.7659C59.6774 45.4559 60.1518 45.6715 61.7906 45.6715V46.4478L58.1679 47.526H57.2192L56.9173 45.0677Z" fill="white"/>
<path d="M63.214 27.9463L67.4404 26.6094H68.4755V45.8439C68.4755 46.4476 68.6911 46.577 70.2437 46.7495V47.5689H63.5159V46.7495L63.9903 46.7064C65.1978 46.577 65.4135 46.4476 65.4135 45.8439V30.0164C65.4135 29.1107 64.9391 28.8088 63.1709 28.7657V27.9463H63.214Z" fill="white"/>
<path d="M85.5965 45.4557C85.1221 47.0083 84.2596 47.7414 82.7501 47.7414C81.2838 47.7414 80.3782 47.0945 79.99 45.6713C78.955 47.0945 77.7043 47.7845 76.0655 47.7845C73.7798 47.7845 72.1841 46.3614 72.1841 44.2913C72.1841 42.6525 73.1329 41.488 75.0304 40.7118C76.3242 40.1942 77.5318 39.9786 79.9038 39.8924V37.9517C79.9038 35.5366 79.2137 34.5446 77.5318 34.5446C76.7124 34.5446 76.0224 34.8034 75.6773 35.2347V37.4341H74.4698C73.3916 37.4341 72.831 37.046 72.831 36.2266C72.831 34.674 74.9442 33.5527 78.0062 33.5527C81.3269 33.5527 82.8795 34.8897 82.8795 37.8654V45.4557C82.8795 46.0595 83.1814 46.4476 83.6558 46.4476C84.1302 46.4476 84.3458 46.2751 84.734 45.3263L85.5965 45.4557ZM79.9469 40.7549C76.4536 40.9274 75.3323 41.6605 75.3323 43.8169C75.3323 45.3694 76.1086 46.232 77.4455 46.232C78.7825 46.232 79.9469 45.0676 79.9469 43.7306V40.7549Z" fill="white"/>
<path d="M86.4591 27.9463L90.5993 26.6094H91.6343V40.9706L96.5939 35.9679C96.8958 35.666 97.0683 35.4072 97.0683 35.2347C97.0683 34.9328 96.6802 34.7172 95.6883 34.5878V33.7684H100.863V34.5878C99.7422 34.7603 99.2678 34.9328 98.7503 35.4503L95.3001 38.8574L100.087 45.8007C100.562 46.4476 100.863 46.6202 101.899 46.7927V47.6121H95.5158V46.7927C96.5508 46.6202 96.7664 46.5339 96.7664 46.2751C96.7664 46.1458 96.6802 45.9301 96.5508 45.7145L93.2732 40.8412L91.6343 42.4369V45.8439C91.6343 46.4477 91.8069 46.577 93.2732 46.7495V47.5689H86.8042V46.7495C88.443 46.577 88.5724 46.4908 88.5724 45.8439V30.0164C88.5724 29.1107 88.098 28.8088 86.416 28.7657V27.9463H86.4591Z" fill="white"/>
<path d="M117.036 45.4557C116.562 47.0083 115.699 47.7414 114.19 47.7414C112.723 47.7414 111.818 47.0945 111.429 45.6713C110.394 47.0945 109.144 47.7845 107.505 47.7845C105.219 47.7845 103.624 46.3614 103.624 44.2913C103.624 42.6525 104.572 41.488 106.47 40.7118C107.764 40.1942 108.971 39.9786 111.343 39.8924V37.9517C111.343 35.5366 110.653 34.5446 108.971 34.5446C108.152 34.5446 107.462 34.8034 107.117 35.2347V37.4341H105.866C104.788 37.4341 104.227 37.046 104.227 36.2266C104.227 34.674 106.341 33.5527 109.403 33.5527C112.723 33.5527 114.276 34.8897 114.276 37.8654V45.4557C114.276 46.0595 114.578 46.4476 115.052 46.4476C115.527 46.4476 115.742 46.2751 116.13 45.3263L117.036 45.4557ZM111.386 40.7549C107.893 40.9274 106.772 41.6605 106.772 43.8169C106.772 45.3694 107.548 46.232 108.885 46.232C110.222 46.232 111.386 45.0676 111.386 43.7306V40.7549Z" fill="white"/>
<path d="M129.068 45.0245C127.818 46.9652 126.308 47.8708 124.41 47.8708C120.831 47.8708 118.588 45.1107 118.588 40.7549C118.588 36.3991 121.133 33.4234 124.885 33.4234C126.394 33.4234 127.559 33.9409 128.809 35.1053V29.9301C128.809 29.0245 128.335 28.7657 126.653 28.6795V27.86L130.793 26.6094H131.828V44.9813C131.828 45.6282 132.216 45.7576 133.985 45.8007V46.6202L130.362 47.6121H129.37L129.068 45.0245ZM128.809 39.1161C128.809 36.2697 127.645 34.8034 125.359 34.8034C122.901 34.8034 121.694 36.701 121.694 40.5824C121.694 44.2913 122.944 46.3614 125.273 46.3614C127.214 46.3614 128.766 44.6363 128.766 42.48V39.1161H128.809Z" fill="white"/>
<path d="M148.26 44.6789C147.138 46.7921 145.284 47.8703 142.826 47.8703C138.729 47.8703 135.882 44.8946 135.882 40.6681C135.882 36.4417 138.642 33.4229 142.567 33.4229C144.335 33.4229 145.845 34.1129 146.88 35.3204C147.872 36.528 148.26 37.7355 148.346 40.1075H139.031V40.6681C139.031 44.4633 140.626 46.4902 143.559 46.4902C145.327 46.4902 146.362 45.8865 147.483 44.2045L148.26 44.6789ZM145.068 38.4687C145.068 35.8379 144.163 34.4579 142.438 34.4579C140.497 34.4579 139.462 35.8811 139.074 39.0724H145.068V38.4687Z" fill="white"/>
<path d="M155.246 36.2692C156.453 34.3285 157.92 33.4229 159.947 33.4229C161.931 33.4229 163.009 34.2423 163.483 36.183C164.734 34.2854 166.2 33.4229 168.227 33.4229C170.642 33.4229 171.979 34.846 171.979 37.3474V45.8002C171.979 46.3609 172.238 46.5334 173.316 46.6627L173.747 46.7059V47.5253H167.364V46.7059C168.788 46.5334 169.003 46.404 169.003 45.8002V37.6924C169.003 36.1398 168.184 35.191 166.761 35.191C165.079 35.191 163.828 36.4417 163.828 38.1237V45.8433C163.828 46.4902 164.001 46.5765 165.467 46.749V47.5684H159.17V46.749C160.594 46.5765 160.809 46.4471 160.809 45.8433V37.6924C160.809 36.1398 159.99 35.191 158.567 35.191C156.885 35.191 155.634 36.4417 155.634 38.1237V45.8433C155.634 46.4471 155.807 46.5765 157.273 46.749V47.5684H150.847V46.749C152.4 46.5765 152.615 46.4471 152.615 45.8433V36.9592C152.615 36.0536 152.098 35.7517 150.502 35.7517V34.9323L154.254 33.5954H155.16L155.246 36.2692Z" fill="white"/>
<path d="M180.303 33.5529V45.8009C180.303 46.4046 180.519 46.534 182.071 46.7065V47.5259H175.387V46.7065C177.068 46.534 177.241 46.4478 177.241 45.8009V36.9599C177.241 36.0542 176.723 35.7523 175.042 35.7523V34.9329L179.268 33.596H180.303V33.5529ZM180.562 29.499C180.562 30.534 179.742 31.3103 178.707 31.3103C177.715 31.3103 176.896 30.4909 176.896 29.499C176.896 28.4639 177.715 27.6445 178.75 27.6445C179.742 27.6445 180.562 28.4639 180.562 29.499Z" fill="white"/>
<path d="M196.518 44.6789C195.397 46.7921 193.5 47.8703 191.085 47.8703C186.987 47.8703 184.141 44.8946 184.141 40.6681C184.141 36.4417 186.901 33.4229 190.826 33.4229C192.594 33.4229 194.103 34.1129 195.138 35.3204C196.13 36.528 196.518 37.7355 196.605 40.1075H187.289V40.6681C187.289 44.4633 188.885 46.4902 191.818 46.4902C193.586 46.4902 194.621 45.8865 195.742 44.2045L196.518 44.6789ZM193.327 38.4687C193.327 35.8379 192.421 34.4579 190.696 34.4579C188.756 34.4579 187.721 35.8811 187.333 39.0724H193.327V38.4687Z" fill="white"/>
<path d="M211.526 14.2745C211.526 10.1344 214.89 6.77051 219.03 6.77051C223.171 6.77051 226.534 10.1344 226.534 14.2745C226.534 18.4147 223.171 21.7786 219.03 21.7786C214.89 21.7786 211.526 18.4147 211.526 14.2745Z" fill="white"/>
<path d="M211.526 40.4962C211.526 36.3561 214.89 32.9922 219.03 32.9922C223.171 32.9922 226.534 36.3561 226.534 40.4962C226.534 44.6364 223.171 48.0003 219.03 48.0003C214.89 48.0003 211.526 44.6364 211.526 40.4962Z" fill="white"/>
</svg>
