<svg width="112" height="104" viewBox="0 0 112 104" fill="none" xmlns="http://www.w3.org/2000/svg">
<rect width="80" height="80" fill="#F7F3F4"/>
<path d="M98 20H108V36H28V20H80.83" stroke="#2393D2" stroke-width="3" stroke-miterlimit="10"/>
<path d="M74 94H92" stroke="#2393D2" stroke-width="3" stroke-miterlimit="10"/>
<path d="M34.0703 28H37.0703" stroke="#2393D2" stroke-width="3" stroke-miterlimit="10"/>
<path d="M41.0303 28H44.0303" stroke="#2393D2" stroke-width="3" stroke-miterlimit="10"/>
<path d="M98 64H108V80H28V64H80.83H98Z" fill="#2393D2" stroke="#2393D2" stroke-width="3" stroke-miterlimit="10"/>
<path d="M34.0703 72H37.0703" stroke="white" stroke-width="3" stroke-miterlimit="10"/>
<path d="M41.0303 72H44.0303" stroke="white" stroke-width="3" stroke-miterlimit="10"/>
<path d="M98 42H108V58H28V42H80.83H98Z" stroke="#2393D2" stroke-width="3" stroke-miterlimit="10"/>
<path d="M34.0703 50H37.0703" stroke="#2393D2" stroke-width="3" stroke-miterlimit="10"/>
<path d="M41.0303 50H44.0303" stroke="#2393D2" stroke-width="3" stroke-miterlimit="10"/>
<path d="M68 88V80" stroke="#2393D2" stroke-width="3" stroke-miterlimit="10"/>
<path d="M68 100C71.3137 100 74 97.3137 74 94C74 90.6863 71.3137 88 68 88C64.6863 88 62 90.6863 62 94C62 97.3137 64.6863 100 68 100Z" stroke="#2393D2" stroke-width="3" stroke-miterlimit="10"/>
<path d="M44 94H62" stroke="#2393D2" stroke-width="3" stroke-miterlimit="10"/>
</svg>
