<svg width="112" height="104" viewBox="0 0 112 104" fill="none" xmlns="http://www.w3.org/2000/svg">
<path d="M80 80V0L0 80H80Z" fill="#F7F3F4"/>
<path d="M37 38C32 38 28 34 28 29C28 24 32 20 37 20C42 20 46 24 46 29C46 34 42 38 37 38Z" stroke="#FF6C00" stroke-width="3" stroke-miterlimit="10"/>
<path d="M37 100C32 100 28 96 28 91C28 86 32 82 37 82C42 82 46 86 46 91C46 96 42 100 37 100Z" stroke="#FF6C00" stroke-width="3" stroke-miterlimit="10"/>
<path d="M99 38C94 38 90 34 90 29C90 24 94 20 99 20C104 20 108 24 108 29C108 34 104 38 99 38Z" stroke="#FF6C00" stroke-width="3" stroke-miterlimit="10"/>
<path d="M37 37.5V81.5" stroke="#FF6C00" stroke-width="3" stroke-miterlimit="10"/>
<path d="M99 38V56" stroke="#FF6C00" stroke-width="3" stroke-miterlimit="10"/>
<path d="M46 29H90" stroke="#FF6C00" stroke-width="3" stroke-miterlimit="10"/>
<path d="M46 91H64" stroke="#FF6C00" stroke-width="3" stroke-miterlimit="10"/>
<path d="M62 54L78.1 102L88.9 80.9L110 70.1L62 54Z" fill="#FF6C00"/>
</svg>
