<svg width="112" height="104" viewBox="0 0 112 104" fill="none" xmlns="http://www.w3.org/2000/svg">
<path d="M0 0V80L80 0H0Z" fill="#F7F3F4"/>
<path d="M98 20H108V100H28V20H80.83" stroke="#2393D2" stroke-width="3" stroke-miterlimit="10"/>
<path d="M90 68C90 55.8497 80.1503 46 68 46C55.8497 46 46 55.8497 46 68C46 80.1503 55.8497 90 68 90C80.1503 90 90 80.1503 90 68Z" fill="#2393D2"/>
<path d="M28 36H108" stroke="#2393D2" stroke-width="3" stroke-miterlimit="10"/>
<path d="M34.0703 28H37.0703" stroke="#2393D2" stroke-width="3" stroke-miterlimit="10"/>
<path d="M41.0303 28H44.0303" stroke="#2393D2" stroke-width="3" stroke-miterlimit="10"/>
<path d="M48 28H51" stroke="#2393D2" stroke-width="3" stroke-miterlimit="10"/>
<path d="M56 67.5H80" stroke="white" stroke-width="3" stroke-miterlimit="10"/>
<path d="M68 79.5V55.5" stroke="white" stroke-width="3" stroke-miterlimit="10"/>
</svg>
