<svg width="52" height="52" viewBox="0 0 52 52" fill="none" xmlns="http://www.w3.org/2000/svg">
<g clip-path="url(#clip0_4425_8178)">
<path d="M52 26C52 40.3584 40.3584 52 26 52C11.6416 52 0 40.3584 0 26C0 11.6416 11.6416 0 26 0C40.3584 0 52 11.6416 52 26ZM37.3665 9.61882C34.7259 9.70768 32.4196 11.1676 30.7015 13.1777C28.8014 15.3867 27.5361 18.0062 26.6263 20.6764C24.9971 19.3392 23.7402 17.6126 21.125 16.8594C19.1022 16.2796 16.9821 16.5166 15.0313 17.9723C14.1087 18.6621 13.4697 19.7031 13.1693 20.6891C12.3864 23.2367 13.9945 25.5091 14.7223 26.3216L16.3177 28.0312C16.6478 28.3656 17.4391 29.2415 17.054 30.4984C16.6351 31.8652 14.9889 32.7454 13.3005 32.2292C12.5472 31.9964 11.4639 31.4378 11.7051 30.6465C11.8066 30.3206 12.0352 30.0794 12.1621 29.8044C12.2764 29.5632 12.3314 29.3854 12.3652 29.2754C12.6742 28.2682 12.251 26.9606 11.1761 26.6263C10.1689 26.3174 9.14063 26.5628 8.74284 27.8577C8.29004 29.3304 8.99675 32.0007 12.7673 33.1602C17.1852 34.5228 20.9261 32.1149 21.4551 28.9749C21.7894 27.0114 20.9007 25.5472 19.2757 23.6725L17.9512 22.2041C17.1514 21.4043 16.8721 20.0374 17.7057 18.988C18.4082 18.0993 19.4027 17.7227 21.0404 18.167C23.4271 18.8145 24.4893 20.4691 26.2666 21.8063C25.5345 24.21 25.0563 26.6263 24.6204 28.7887L24.3538 30.401C23.0843 37.0534 22.1152 40.7096 19.5973 42.8086C19.0895 43.1683 18.3659 43.71 17.2741 43.748C16.6986 43.765 16.5166 43.3714 16.5081 43.1979C16.4954 42.7959 16.834 42.6097 17.0583 42.432C17.3968 42.25 17.9046 41.9453 17.8665 40.9678C17.8327 39.8167 16.8763 38.818 15.4967 38.8646C14.4642 38.8984 12.89 39.8717 12.9492 41.6491C13.0085 43.4899 14.7223 44.8652 17.3079 44.7806C18.6875 44.7341 21.7725 44.1712 24.8109 40.5573C28.3529 36.4229 29.3431 31.6748 30.0879 28.2005L30.9173 23.6133C31.3786 23.6683 31.8737 23.7064 32.4111 23.7191C36.8164 23.8122 39.0212 21.5313 39.055 19.8682C39.0762 18.8652 38.3949 17.875 37.4427 17.8962C36.7614 17.9131 35.9023 18.3701 35.6992 19.3138C35.4961 20.2363 37.0999 21.0742 35.8473 21.8867C34.9587 22.4622 33.3633 22.8685 31.1162 22.5384L31.5267 20.2786C32.3604 15.9961 33.3887 10.7275 37.2904 10.6006C37.5739 10.5879 38.6149 10.6133 38.6403 11.3031C38.6488 11.5316 38.5895 11.5908 38.3187 12.1198C38.0436 12.5303 37.9421 12.8815 37.9548 13.2793C37.9928 14.3711 38.8223 15.0905 40.0283 15.0482C41.6364 14.9932 42.1019 13.4274 42.0723 12.6234C42.0003 10.7275 40.0072 9.53418 37.3665 9.61882Z" fill="#4D4D4D"/>
</g>
<defs>
<clipPath id="clip0_4425_8178">
<rect width="52" height="52" fill="white"/>
</clipPath>
</defs>
</svg>
