<svg width="112" height="104" viewBox="0 0 112 104" fill="none" xmlns="http://www.w3.org/2000/svg">
<circle cx="40" cy="40" r="40" fill="#F7F3F4"/>
<g clip-path="url(#clip0_3321_5705)">
<path d="M85.6392 38.3201C88.5555 45.1972 88.8059 52.9139 86.3416 59.9656C83.8772 67.0173 78.8748 72.8983 72.3098 76.4619C65.7448 80.0256 58.0878 81.0163 50.832 79.2409C43.5761 77.4656 37.2416 73.0514 33.0637 66.8592C28.8857 60.667 27.1638 53.1406 28.2338 45.7478C29.3037 38.3549 33.0888 31.6256 38.8509 26.872C44.613 22.1183 51.9391 19.6812 59.4005 20.0359C66.862 20.3905 73.9239 23.5114 79.2092 28.7901" stroke="#0094D3" stroke-width="3" stroke-miterlimit="10"/>
<path d="M58 72C70.1503 72 80 62.1503 80 50C80 37.8497 70.1503 28 58 28C45.8497 28 36 37.8497 36 50C36 62.1503 45.8497 72 58 72Z" fill="#0094D3"/>
<path d="M108 88.69L91.31 72L80 83.31L96.69 100H103.76L108 95.76V88.69Z" stroke="#0094D3" stroke-width="3" stroke-miterlimit="10"/>
<path d="M47 40.5H69" stroke="white" stroke-width="3" stroke-miterlimit="10"/>
<path d="M47 49.5H69" stroke="white" stroke-width="3" stroke-miterlimit="10"/>
<path d="M47 59.5H59" stroke="white" stroke-width="3" stroke-miterlimit="10"/>
<path d="M85.9995 77.9995L79.1895 71.1895" stroke="#0094D3" stroke-width="3" stroke-miterlimit="10"/>
</g>
<defs>
<clipPath id="clip0_3321_5705">
<rect width="88" height="88" fill="white" transform="translate(24 16)"/>
</clipPath>
</defs>
</svg>
