<svg width="1020" height="378" viewBox="0 0 1020 378" fill="none" xmlns="http://www.w3.org/2000/svg">
<path fill-rule="evenodd" clip-rule="evenodd" d="M210.044 265.333C192.084 274.703 171.661 280 150 280C78.2031 280 20.0002 221.797 20.0002 150C20.0002 123.899 27.692 99.5954 40.9327 79.231L24.1678 68.3531C6.13597 96.1433 -2.18893 129.121 0.492242 162.14C3.17342 195.159 16.7098 226.362 38.9891 250.879C61.2683 275.396 91.037 291.848 123.65 297.667C156.262 303.487 189.884 298.347 219.268 283.049L210.044 265.333Z" fill="#5481DC"/>
<path fill-rule="evenodd" clip-rule="evenodd" d="M77.8081 18.5151C55.9406 30.5215 37.4129 47.7922 23.9023 68.7638L40.7022 79.5868C63.7214 43.9292 103.715 20.2582 149.253 20.0021L149.139 0.00247192C124.192 0.145776 99.6755 6.50866 77.8081 18.5151Z" fill="#0254A6"/>
<path d="M150 0C183.612 4.0082e-07 216.25 11.2892 242.679 32.0567C269.108 52.8243 287.796 81.8666 295.745 114.525C303.694 147.184 300.444 181.566 286.516 212.156C272.588 242.747 248.789 267.773 218.937 283.22L150 150L150 0Z" fill="white"/>
<path d="M185.192 120.88V117.568L192.776 106.72H197.36V117.328H199.328V120.88H197.36V124H193.256V120.88H185.192ZM193.544 111.232L189.512 117.328H193.544V111.232ZM201.194 120.712C201.738 120.28 201.986 120.08 201.938 120.112C203.506 118.816 204.738 117.752 205.634 116.92C206.546 116.088 207.314 115.216 207.938 114.304C208.562 113.392 208.874 112.504 208.874 111.64C208.874 110.984 208.722 110.472 208.418 110.104C208.114 109.736 207.658 109.552 207.05 109.552C206.442 109.552 205.962 109.784 205.61 110.248C205.274 110.696 205.106 111.336 205.106 112.168H201.146C201.178 110.808 201.466 109.672 202.01 108.76C202.57 107.848 203.298 107.176 204.194 106.744C205.106 106.312 206.114 106.096 207.218 106.096C209.122 106.096 210.554 106.584 211.514 107.56C212.49 108.536 212.978 109.808 212.978 111.376C212.978 113.088 212.394 114.68 211.226 116.152C210.058 117.608 208.57 119.032 206.762 120.424H213.242V123.76H201.194V120.712ZM219.873 120.208L217.209 127.096H214.593L215.985 120.208H219.873ZM222.035 120.88V117.568L229.619 106.72H234.203V117.328H236.171V120.88H234.203V124H230.099V120.88H222.035ZM230.387 111.232L226.355 117.328H230.387V111.232ZM237.846 110.896C237.846 109.6 238.214 108.6 238.95 107.896C239.702 107.192 240.67 106.84 241.854 106.84C243.038 106.84 243.998 107.192 244.734 107.896C245.47 108.6 245.838 109.6 245.838 110.896C245.838 112.192 245.47 113.192 244.734 113.896C243.998 114.6 243.038 114.952 241.854 114.952C240.67 114.952 239.702 114.6 238.95 113.896C238.214 113.192 237.846 112.192 237.846 110.896ZM254.142 107.104L244.902 124H240.942L250.182 107.104H254.142ZM241.83 109.24C241.062 109.24 240.678 109.792 240.678 110.896C240.678 111.984 241.062 112.528 241.83 112.528C242.198 112.528 242.486 112.392 242.694 112.12C242.902 111.848 243.006 111.44 243.006 110.896C243.006 109.792 242.614 109.24 241.83 109.24ZM249.27 120.208C249.27 118.912 249.638 117.912 250.374 117.208C251.11 116.504 252.07 116.152 253.254 116.152C254.438 116.152 255.398 116.504 256.134 117.208C256.87 117.912 257.238 118.912 257.238 120.208C257.238 121.504 256.87 122.504 256.134 123.208C255.398 123.912 254.438 124.264 253.254 124.264C252.07 124.264 251.11 123.912 250.374 123.208C249.638 122.504 249.27 121.504 249.27 120.208ZM253.23 118.552C252.862 118.552 252.574 118.688 252.366 118.96C252.174 119.232 252.078 119.648 252.078 120.208C252.078 121.296 252.462 121.84 253.23 121.84C253.598 121.84 253.886 121.704 254.094 121.432C254.302 121.16 254.406 120.752 254.406 120.208C254.406 119.664 254.302 119.256 254.094 118.984C253.886 118.696 253.598 118.552 253.23 118.552Z" fill="#333333"/>
<path d="M207.196 134.768V146H204.46V139.264L201.948 146H199.74L197.212 139.248V146H194.476V134.768H197.708L200.86 142.544L203.98 134.768H207.196ZM213.228 146.128C212.353 146.128 211.564 145.941 210.86 145.568C210.167 145.195 209.617 144.661 209.212 143.968C208.817 143.275 208.62 142.464 208.62 141.536C208.62 140.619 208.823 139.813 209.228 139.12C209.633 138.416 210.188 137.877 210.892 137.504C211.596 137.131 212.385 136.944 213.26 136.944C214.135 136.944 214.924 137.131 215.628 137.504C216.332 137.877 216.887 138.416 217.292 139.12C217.697 139.813 217.9 140.619 217.9 141.536C217.9 142.453 217.692 143.264 217.276 143.968C216.871 144.661 216.311 145.195 215.596 145.568C214.892 145.941 214.103 146.128 213.228 146.128ZM213.228 143.76C213.751 143.76 214.193 143.568 214.556 143.184C214.929 142.8 215.116 142.251 215.116 141.536C215.116 140.821 214.935 140.272 214.572 139.888C214.22 139.504 213.783 139.312 213.26 139.312C212.727 139.312 212.284 139.504 211.932 139.888C211.58 140.261 211.404 140.811 211.404 141.536C211.404 142.251 211.575 142.8 211.916 143.184C212.268 143.568 212.705 143.76 213.228 143.76ZM222.087 138.336C222.343 137.92 222.711 137.584 223.191 137.328C223.671 137.072 224.221 136.944 224.839 136.944C225.575 136.944 226.242 137.131 226.839 137.504C227.437 137.877 227.906 138.411 228.247 139.104C228.599 139.797 228.775 140.603 228.775 141.52C228.775 142.437 228.599 143.248 228.247 143.952C227.906 144.645 227.437 145.184 226.839 145.568C226.242 145.941 225.575 146.128 224.839 146.128C224.21 146.128 223.661 146.005 223.191 145.76C222.722 145.504 222.354 145.168 222.087 144.752V146H219.351V134.16H222.087V138.336ZM225.991 141.52C225.991 140.837 225.799 140.304 225.415 139.92C225.042 139.525 224.578 139.328 224.023 139.328C223.479 139.328 223.015 139.525 222.631 139.92C222.258 140.315 222.071 140.853 222.071 141.536C222.071 142.219 222.258 142.757 222.631 143.152C223.015 143.547 223.479 143.744 224.023 143.744C224.567 143.744 225.031 143.547 225.415 143.152C225.799 142.747 225.991 142.203 225.991 141.52ZM231.587 136.144C231.107 136.144 230.712 136.005 230.403 135.728C230.104 135.44 229.955 135.088 229.955 134.672C229.955 134.245 230.104 133.893 230.403 133.616C230.712 133.328 231.107 133.184 231.587 133.184C232.056 133.184 232.44 133.328 232.739 133.616C233.048 133.893 233.203 134.245 233.203 134.672C233.203 135.088 233.048 135.44 232.739 135.728C232.44 136.005 232.056 136.144 231.587 136.144ZM232.947 137.072V146H230.211V137.072H232.947ZM237.666 134.16V146H234.93V134.16H237.666ZM248.064 141.392C248.064 141.648 248.048 141.915 248.016 142.192H241.824C241.867 142.747 242.043 143.173 242.352 143.472C242.672 143.76 243.062 143.904 243.52 143.904C244.203 143.904 244.678 143.616 244.944 143.04H247.856C247.707 143.627 247.435 144.155 247.04 144.624C246.656 145.093 246.171 145.461 245.584 145.728C244.998 145.995 244.342 146.128 243.616 146.128C242.742 146.128 241.963 145.941 241.28 145.568C240.598 145.195 240.064 144.661 239.68 143.968C239.296 143.275 239.104 142.464 239.104 141.536C239.104 140.608 239.291 139.797 239.664 139.104C240.048 138.411 240.582 137.877 241.264 137.504C241.947 137.131 242.731 136.944 243.616 136.944C244.48 136.944 245.248 137.125 245.92 137.488C246.592 137.851 247.115 138.368 247.488 139.04C247.872 139.712 248.064 140.496 248.064 141.392ZM245.264 140.672C245.264 140.203 245.104 139.829 244.784 139.552C244.464 139.275 244.064 139.136 243.584 139.136C243.126 139.136 242.736 139.269 242.416 139.536C242.107 139.803 241.915 140.181 241.84 140.672H245.264Z" fill="#0254A6"/>
<path d="M77.896 351.4V348.64L84.216 339.6H88.036V348.44H89.676V351.4H88.036V354H84.616V351.4H77.896ZM84.856 343.36L81.496 348.44H84.856V343.36ZM90.9912 342.58V339.4H96.5312V354H92.9712V342.58H90.9912ZM102.891 350.84L100.671 356.58H98.4907L99.6507 350.84H102.891ZM107.013 346.16C105.76 345.494 105.133 344.447 105.133 343.02C105.133 342.3 105.32 341.647 105.693 341.06C106.066 340.46 106.633 339.987 107.393 339.64C108.153 339.28 109.086 339.1 110.193 339.1C111.3 339.1 112.226 339.28 112.973 339.64C113.733 339.987 114.3 340.46 114.673 341.06C115.046 341.647 115.233 342.3 115.233 343.02C115.233 343.74 115.06 344.367 114.713 344.9C114.38 345.434 113.926 345.854 113.353 346.16C114.073 346.507 114.626 346.987 115.013 347.6C115.4 348.2 115.593 348.907 115.593 349.72C115.593 350.667 115.353 351.487 114.873 352.18C114.393 352.86 113.74 353.38 112.913 353.74C112.1 354.1 111.193 354.28 110.193 354.28C109.193 354.28 108.28 354.1 107.453 353.74C106.64 353.38 105.993 352.86 105.513 352.18C105.033 351.487 104.793 350.667 104.793 349.72C104.793 348.894 104.986 348.18 105.373 347.58C105.76 346.967 106.306 346.494 107.013 346.16ZM111.913 343.54C111.913 342.994 111.753 342.574 111.433 342.28C111.126 341.974 110.713 341.82 110.193 341.82C109.673 341.82 109.253 341.974 108.933 342.28C108.626 342.587 108.473 343.014 108.473 343.56C108.473 344.08 108.633 344.494 108.953 344.8C109.273 345.094 109.686 345.24 110.193 345.24C110.7 345.24 111.113 345.087 111.433 344.78C111.753 344.474 111.913 344.06 111.913 343.54ZM110.193 347.64C109.566 347.64 109.06 347.814 108.673 348.16C108.286 348.494 108.093 348.96 108.093 349.56C108.093 350.12 108.28 350.58 108.653 350.94C109.04 351.3 109.553 351.48 110.193 351.48C110.833 351.48 111.333 351.3 111.693 350.94C112.066 350.58 112.253 350.12 112.253 349.56C112.253 348.974 112.06 348.507 111.673 348.16C111.3 347.814 110.806 347.64 110.193 347.64ZM117.302 343.08C117.302 342 117.608 341.167 118.222 340.58C118.848 339.994 119.655 339.7 120.642 339.7C121.628 339.7 122.428 339.994 123.042 340.58C123.655 341.167 123.962 342 123.962 343.08C123.962 344.16 123.655 344.994 123.042 345.58C122.428 346.167 121.628 346.46 120.642 346.46C119.655 346.46 118.848 346.167 118.222 345.58C117.608 344.994 117.302 344.16 117.302 343.08ZM130.882 339.92L123.182 354H119.882L127.582 339.92H130.882ZM120.622 341.7C119.982 341.7 119.662 342.16 119.662 343.08C119.662 343.987 119.982 344.44 120.622 344.44C120.928 344.44 121.168 344.327 121.342 344.1C121.515 343.874 121.602 343.534 121.602 343.08C121.602 342.16 121.275 341.7 120.622 341.7ZM126.822 350.84C126.822 349.76 127.128 348.927 127.742 348.34C128.355 347.754 129.155 347.46 130.142 347.46C131.128 347.46 131.928 347.754 132.542 348.34C133.155 348.927 133.462 349.76 133.462 350.84C133.462 351.92 133.155 352.754 132.542 353.34C131.928 353.927 131.128 354.22 130.142 354.22C129.155 354.22 128.355 353.927 127.742 353.34C127.128 352.754 126.822 351.92 126.822 350.84ZM130.122 349.46C129.815 349.46 129.575 349.574 129.402 349.8C129.242 350.027 129.162 350.374 129.162 350.84C129.162 351.747 129.482 352.2 130.122 352.2C130.428 352.2 130.668 352.087 130.842 351.86C131.015 351.634 131.102 351.294 131.102 350.84C131.102 350.387 131.015 350.047 130.842 349.82C130.668 349.58 130.428 349.46 130.122 349.46Z" fill="white"/>
<path d="M84.4586 363.576C85.3466 363.576 86.1226 363.752 86.7866 364.104C87.4506 364.456 87.9626 364.952 88.3226 365.592C88.6906 366.224 88.8746 366.956 88.8746 367.788C88.8746 368.612 88.6906 369.344 88.3226 369.984C87.9626 370.624 87.4466 371.12 86.7746 371.472C86.1106 371.824 85.3386 372 84.4586 372H81.3026V363.576H84.4586ZM84.3266 370.224C85.1026 370.224 85.7066 370.012 86.1386 369.588C86.5706 369.164 86.7866 368.564 86.7866 367.788C86.7866 367.012 86.5706 366.408 86.1386 365.976C85.7066 365.544 85.1026 365.328 84.3266 365.328H83.3546V370.224H84.3266ZM96.3333 368.544C96.3333 368.736 96.3213 368.936 96.2973 369.144H91.6533C91.6853 369.56 91.8173 369.88 92.0493 370.104C92.2893 370.32 92.5813 370.428 92.9253 370.428C93.4373 370.428 93.7933 370.212 93.9933 369.78H96.1773C96.0653 370.22 95.8613 370.616 95.5653 370.968C95.2773 371.32 94.9133 371.596 94.4733 371.796C94.0333 371.996 93.5413 372.096 92.9973 372.096C92.3413 372.096 91.7573 371.956 91.2453 371.676C90.7333 371.396 90.3333 370.996 90.0453 370.476C89.7573 369.956 89.6133 369.348 89.6133 368.652C89.6133 367.956 89.7533 367.348 90.0333 366.828C90.3213 366.308 90.7213 365.908 91.2333 365.628C91.7453 365.348 92.3333 365.208 92.9973 365.208C93.6453 365.208 94.2213 365.344 94.7253 365.616C95.2293 365.888 95.6213 366.276 95.9013 366.78C96.1893 367.284 96.3333 367.872 96.3333 368.544ZM94.2333 368.004C94.2333 367.652 94.1133 367.372 93.8733 367.164C93.6333 366.956 93.3333 366.852 92.9733 366.852C92.6293 366.852 92.3373 366.952 92.0973 367.152C91.8653 367.352 91.7213 367.636 91.6653 368.004H94.2333ZM100.14 372.096C99.5559 372.096 99.0359 371.996 98.5799 371.796C98.1239 371.596 97.7639 371.324 97.4999 370.98C97.2359 370.628 97.0879 370.236 97.0559 369.804H99.0839C99.1079 370.036 99.2159 370.224 99.4079 370.368C99.5999 370.512 99.8359 370.584 100.116 370.584C100.372 370.584 100.568 370.536 100.704 370.44C100.848 370.336 100.92 370.204 100.92 370.044C100.92 369.852 100.82 369.712 100.62 369.624C100.42 369.528 100.096 369.424 99.6479 369.312C99.1679 369.2 98.7679 369.084 98.4479 368.964C98.1279 368.836 97.8519 368.64 97.6199 368.376C97.3879 368.104 97.2719 367.74 97.2719 367.284C97.2719 366.9 97.3759 366.552 97.5839 366.24C97.7999 365.92 98.1119 365.668 98.5199 365.484C98.9359 365.3 99.4279 365.208 99.9959 365.208C100.836 365.208 101.496 365.416 101.976 365.832C102.464 366.248 102.744 366.8 102.816 367.488H100.92C100.888 367.256 100.784 367.072 100.608 366.936C100.44 366.8 100.216 366.732 99.9359 366.732C99.6959 366.732 99.5119 366.78 99.3839 366.876C99.2559 366.964 99.1919 367.088 99.1919 367.248C99.1919 367.44 99.2919 367.584 99.4919 367.68C99.6999 367.776 100.02 367.872 100.452 367.968C100.948 368.096 101.352 368.224 101.664 368.352C101.976 368.472 102.248 368.672 102.48 368.952C102.72 369.224 102.844 369.592 102.852 370.056C102.852 370.448 102.74 370.8 102.516 371.112C102.3 371.416 101.984 371.656 101.568 371.832C101.16 372.008 100.684 372.096 100.14 372.096ZM108.199 372L106.159 369.192V372H104.107V363.12H106.159V368.028L108.187 365.304H110.719L107.935 368.664L110.743 372H108.199ZM115.257 370.26V372H114.213C113.469 372 112.889 371.82 112.473 371.46C112.057 371.092 111.849 370.496 111.849 369.672V367.008H111.033V365.304H111.849V363.672H113.901V365.304H115.245V367.008H113.901V369.696C113.901 369.896 113.949 370.04 114.045 370.128C114.141 370.216 114.301 370.26 114.525 370.26H115.257ZM119.448 372.096C118.792 372.096 118.2 371.956 117.672 371.676C117.152 371.396 116.74 370.996 116.436 370.476C116.14 369.956 115.992 369.348 115.992 368.652C115.992 367.964 116.144 367.36 116.448 366.84C116.752 366.312 117.168 365.908 117.696 365.628C118.224 365.348 118.816 365.208 119.472 365.208C120.128 365.208 120.72 365.348 121.248 365.628C121.776 365.908 122.192 366.312 122.496 366.84C122.8 367.36 122.952 367.964 122.952 368.652C122.952 369.34 122.796 369.948 122.484 370.476C122.18 370.996 121.76 371.396 121.224 371.676C120.696 371.956 120.104 372.096 119.448 372.096ZM119.448 370.32C119.84 370.32 120.172 370.176 120.444 369.888C120.724 369.6 120.864 369.188 120.864 368.652C120.864 368.116 120.728 367.704 120.456 367.416C120.192 367.128 119.864 366.984 119.472 366.984C119.072 366.984 118.74 367.128 118.476 367.416C118.212 367.696 118.08 368.108 118.08 368.652C118.08 369.188 118.208 369.6 118.464 369.888C118.728 370.176 119.056 370.32 119.448 370.32ZM126.093 366.252C126.293 365.94 126.569 365.688 126.921 365.496C127.273 365.304 127.685 365.208 128.157 365.208C128.709 365.208 129.209 365.348 129.657 365.628C130.105 365.908 130.457 366.308 130.713 366.828C130.977 367.348 131.109 367.952 131.109 368.64C131.109 369.328 130.977 369.936 130.713 370.464C130.457 370.984 130.105 371.388 129.657 371.676C129.209 371.956 128.709 372.096 128.157 372.096C127.693 372.096 127.281 372 126.921 371.808C126.569 371.616 126.293 371.368 126.093 371.064V375.192H124.041V365.304H126.093V366.252ZM129.021 368.64C129.021 368.128 128.877 367.728 128.589 367.44C128.309 367.144 127.961 366.996 127.545 366.996C127.137 366.996 126.789 367.144 126.501 367.44C126.221 367.736 126.081 368.14 126.081 368.652C126.081 369.164 126.221 369.568 126.501 369.864C126.789 370.16 127.137 370.308 127.545 370.308C127.953 370.308 128.301 370.16 128.589 369.864C128.877 369.56 129.021 369.152 129.021 368.64Z" fill="white"/>
<path d="M167.22 342.58V339.4H172.76V354H169.2V342.58H167.22ZM185.379 342.38H179.139V345.14C179.406 344.847 179.779 344.607 180.259 344.42C180.739 344.234 181.259 344.14 181.819 344.14C182.819 344.14 183.646 344.367 184.299 344.82C184.966 345.274 185.453 345.86 185.759 346.58C186.066 347.3 186.219 348.08 186.219 348.92C186.219 350.48 185.779 351.72 184.899 352.64C184.019 353.547 182.779 354 181.179 354C180.113 354 179.186 353.82 178.399 353.46C177.613 353.087 177.006 352.574 176.579 351.92C176.153 351.267 175.919 350.514 175.879 349.66H179.219C179.299 350.074 179.493 350.42 179.799 350.7C180.106 350.967 180.526 351.1 181.059 351.1C181.686 351.1 182.153 350.9 182.459 350.5C182.766 350.1 182.919 349.567 182.919 348.9C182.919 348.247 182.759 347.747 182.439 347.4C182.119 347.054 181.653 346.88 181.039 346.88C180.586 346.88 180.213 346.994 179.919 347.22C179.626 347.434 179.433 347.72 179.339 348.08H176.039V339.38H185.379V342.38ZM192.127 350.84L189.907 356.58H187.727L188.887 350.84H192.127ZM196.249 346.16C194.996 345.494 194.369 344.447 194.369 343.02C194.369 342.3 194.556 341.647 194.929 341.06C195.303 340.46 195.869 339.987 196.629 339.64C197.389 339.28 198.323 339.1 199.429 339.1C200.536 339.1 201.463 339.28 202.209 339.64C202.969 339.987 203.536 340.46 203.909 341.06C204.283 341.647 204.469 342.3 204.469 343.02C204.469 343.74 204.296 344.367 203.949 344.9C203.616 345.434 203.163 345.854 202.589 346.16C203.309 346.507 203.863 346.987 204.249 347.6C204.636 348.2 204.829 348.907 204.829 349.72C204.829 350.667 204.589 351.487 204.109 352.18C203.629 352.86 202.976 353.38 202.149 353.74C201.336 354.1 200.429 354.28 199.429 354.28C198.429 354.28 197.516 354.1 196.689 353.74C195.876 353.38 195.229 352.86 194.749 352.18C194.269 351.487 194.029 350.667 194.029 349.72C194.029 348.894 194.223 348.18 194.609 347.58C194.996 346.967 195.543 346.494 196.249 346.16ZM201.149 343.54C201.149 342.994 200.989 342.574 200.669 342.28C200.363 341.974 199.949 341.82 199.429 341.82C198.909 341.82 198.489 341.974 198.169 342.28C197.863 342.587 197.709 343.014 197.709 343.56C197.709 344.08 197.869 344.494 198.189 344.8C198.509 345.094 198.923 345.24 199.429 345.24C199.936 345.24 200.349 345.087 200.669 344.78C200.989 344.474 201.149 344.06 201.149 343.54ZM199.429 347.64C198.803 347.64 198.296 347.814 197.909 348.16C197.523 348.494 197.329 348.96 197.329 349.56C197.329 350.12 197.516 350.58 197.889 350.94C198.276 351.3 198.789 351.48 199.429 351.48C200.069 351.48 200.569 351.3 200.929 350.94C201.303 350.58 201.489 350.12 201.489 349.56C201.489 348.974 201.296 348.507 200.909 348.16C200.536 347.814 200.043 347.64 199.429 347.64ZM206.538 343.08C206.538 342 206.845 341.167 207.458 340.58C208.085 339.994 208.891 339.7 209.878 339.7C210.865 339.7 211.665 339.994 212.278 340.58C212.891 341.167 213.198 342 213.198 343.08C213.198 344.16 212.891 344.994 212.278 345.58C211.665 346.167 210.865 346.46 209.878 346.46C208.891 346.46 208.085 346.167 207.458 345.58C206.845 344.994 206.538 344.16 206.538 343.08ZM220.118 339.92L212.418 354H209.118L216.818 339.92H220.118ZM209.858 341.7C209.218 341.7 208.898 342.16 208.898 343.08C208.898 343.987 209.218 344.44 209.858 344.44C210.165 344.44 210.405 344.327 210.578 344.1C210.751 343.874 210.838 343.534 210.838 343.08C210.838 342.16 210.511 341.7 209.858 341.7ZM216.058 350.84C216.058 349.76 216.365 348.927 216.978 348.34C217.591 347.754 218.391 347.46 219.378 347.46C220.365 347.46 221.165 347.754 221.778 348.34C222.391 348.927 222.698 349.76 222.698 350.84C222.698 351.92 222.391 352.754 221.778 353.34C221.165 353.927 220.365 354.22 219.378 354.22C218.391 354.22 217.591 353.927 216.978 353.34C216.365 352.754 216.058 351.92 216.058 350.84ZM219.358 349.46C219.051 349.46 218.811 349.574 218.638 349.8C218.478 350.027 218.398 350.374 218.398 350.84C218.398 351.747 218.718 352.2 219.358 352.2C219.665 352.2 219.905 352.087 220.078 351.86C220.251 351.634 220.338 351.294 220.338 350.84C220.338 350.387 220.251 350.047 220.078 349.82C219.905 349.58 219.665 349.46 219.358 349.46Z" fill="white"/>
<path d="M181.71 363.576V365.22H179.478V372H177.426V365.22H175.194V363.576H181.71ZM182.332 368.64C182.332 367.952 182.46 367.348 182.716 366.828C182.98 366.308 183.336 365.908 183.784 365.628C184.232 365.348 184.732 365.208 185.284 365.208C185.756 365.208 186.168 365.304 186.52 365.496C186.88 365.688 187.156 365.94 187.348 366.252V365.304H189.4V372H187.348V371.052C187.148 371.364 186.868 371.616 186.508 371.808C186.156 372 185.744 372.096 185.272 372.096C184.728 372.096 184.232 371.956 183.784 371.676C183.336 371.388 182.98 370.984 182.716 370.464C182.46 369.936 182.332 369.328 182.332 368.64ZM187.348 368.652C187.348 368.14 187.204 367.736 186.916 367.44C186.636 367.144 186.292 366.996 185.884 366.996C185.476 366.996 185.128 367.144 184.84 367.44C184.56 367.728 184.42 368.128 184.42 368.64C184.42 369.152 184.56 369.56 184.84 369.864C185.128 370.16 185.476 370.308 185.884 370.308C186.292 370.308 186.636 370.16 186.916 369.864C187.204 369.568 187.348 369.164 187.348 368.652ZM192.937 366.252C193.129 365.94 193.405 365.688 193.765 365.496C194.125 365.304 194.537 365.208 195.001 365.208C195.553 365.208 196.053 365.348 196.501 365.628C196.949 365.908 197.301 366.308 197.557 366.828C197.821 367.348 197.953 367.952 197.953 368.64C197.953 369.328 197.821 369.936 197.557 370.464C197.301 370.984 196.949 371.388 196.501 371.676C196.053 371.956 195.553 372.096 195.001 372.096C194.529 372.096 194.117 372.004 193.765 371.82C193.413 371.628 193.137 371.376 192.937 371.064V372H190.885V363.12H192.937V366.252ZM195.865 368.64C195.865 368.128 195.721 367.728 195.433 367.44C195.153 367.144 194.805 366.996 194.389 366.996C193.981 366.996 193.633 367.144 193.345 367.44C193.065 367.736 192.925 368.14 192.925 368.652C192.925 369.164 193.065 369.568 193.345 369.864C193.633 370.16 193.981 370.308 194.389 370.308C194.797 370.308 195.145 370.16 195.433 369.864C195.721 369.56 195.865 369.152 195.865 368.64ZM201.081 363.12V372H199.029V363.12H201.081ZM208.88 368.544C208.88 368.736 208.868 368.936 208.844 369.144H204.2C204.232 369.56 204.364 369.88 204.596 370.104C204.836 370.32 205.128 370.428 205.472 370.428C205.984 370.428 206.34 370.212 206.54 369.78H208.724C208.612 370.22 208.408 370.616 208.112 370.968C207.824 371.32 207.46 371.596 207.02 371.796C206.58 371.996 206.088 372.096 205.544 372.096C204.888 372.096 204.304 371.956 203.792 371.676C203.28 371.396 202.88 370.996 202.592 370.476C202.304 369.956 202.16 369.348 202.16 368.652C202.16 367.956 202.3 367.348 202.58 366.828C202.868 366.308 203.268 365.908 203.78 365.628C204.292 365.348 204.88 365.208 205.544 365.208C206.192 365.208 206.768 365.344 207.272 365.616C207.776 365.888 208.168 366.276 208.448 366.78C208.736 367.284 208.88 367.872 208.88 368.544ZM206.78 368.004C206.78 367.652 206.66 367.372 206.42 367.164C206.18 366.956 205.88 366.852 205.52 366.852C205.176 366.852 204.884 366.952 204.644 367.152C204.412 367.352 204.268 367.636 204.212 368.004H206.78ZM213.695 370.26V372H212.651C211.907 372 211.327 371.82 210.911 371.46C210.495 371.092 210.287 370.496 210.287 369.672V367.008H209.471V365.304H210.287V363.672H212.339V365.304H213.683V367.008H212.339V369.696C212.339 369.896 212.387 370.04 212.483 370.128C212.579 370.216 212.739 370.26 212.963 370.26H213.695Z" fill="white"/>
<path fill-rule="evenodd" clip-rule="evenodd" d="M444.284 37.8088L434.186 20.5694C406.019 37.0683 384.003 62.3056 371.479 92.4512C358.955 122.597 356.607 156.005 364.791 187.606C372.975 219.207 391.244 247.276 416.827 267.553C442.409 287.83 473.908 299.208 506.543 299.96L507.004 279.966C436.591 278.374 380 220.796 380 150C380 102.178 405.822 60.3865 444.284 37.8088Z" fill="#5481DC"/>
<path fill-rule="evenodd" clip-rule="evenodd" d="M508.802 0.00478429C481.939 0.219404 455.627 7.644 432.615 21.5029L442.923 38.6192C462.23 26.9671 484.812 20.193 508.962 20.0041L508.802 0.00478429Z" fill="#0254A6"/>
<path d="M510 0C529.817 2.36318e-07 549.438 3.92686 567.729 11.5537C586.02 19.1806 602.618 30.3562 616.565 44.435C630.511 58.5138 641.53 75.2166 648.984 93.5785C656.438 111.94 660.18 131.597 659.993 151.414C659.807 171.23 655.695 190.813 647.896 209.031C640.097 227.249 628.766 243.741 614.556 257.555C600.346 271.368 583.54 282.229 565.109 289.51C546.678 296.791 526.986 300.347 507.173 299.973L510 150L510 0Z" fill="white"/>
<path d="M557.631 110.056H550.143V113.368C550.463 113.016 550.911 112.728 551.487 112.504C552.063 112.28 552.687 112.168 553.359 112.168C554.559 112.168 555.551 112.44 556.335 112.984C557.135 113.528 557.719 114.232 558.087 115.096C558.455 115.96 558.639 116.896 558.639 117.904C558.639 119.776 558.111 121.264 557.055 122.368C555.999 123.456 554.511 124 552.591 124C551.311 124 550.199 123.784 549.255 123.352C548.311 122.904 547.583 122.288 547.071 121.504C546.559 120.72 546.279 119.816 546.231 118.792H550.239C550.335 119.288 550.567 119.704 550.935 120.04C551.303 120.36 551.807 120.52 552.447 120.52C553.199 120.52 553.759 120.28 554.127 119.8C554.495 119.32 554.679 118.68 554.679 117.88C554.679 117.096 554.487 116.496 554.103 116.08C553.719 115.664 553.159 115.456 552.423 115.456C551.879 115.456 551.431 115.592 551.079 115.864C550.727 116.12 550.495 116.464 550.383 116.896H546.423V106.456H557.631V110.056ZM560.904 115C560.904 112.248 561.432 110.08 562.488 108.496C563.56 106.912 565.28 106.12 567.648 106.12C570.016 106.12 571.728 106.912 572.784 108.496C573.856 110.08 574.392 112.248 574.392 115C574.392 117.784 573.856 119.968 572.784 121.552C571.728 123.136 570.016 123.928 567.648 123.928C565.28 123.928 563.56 123.136 562.488 121.552C561.432 119.968 560.904 117.784 560.904 115ZM570.36 115C570.36 113.384 570.184 112.144 569.832 111.28C569.48 110.4 568.752 109.96 567.648 109.96C566.544 109.96 565.816 110.4 565.464 111.28C565.112 112.144 564.936 113.384 564.936 115C564.936 116.088 565 116.992 565.128 117.712C565.256 118.416 565.512 118.992 565.896 119.44C566.296 119.872 566.88 120.088 567.648 120.088C568.416 120.088 568.992 119.872 569.376 119.44C569.776 118.992 570.04 118.416 570.168 117.712C570.296 116.992 570.36 116.088 570.36 115ZM581.384 120.208L578.72 127.096H576.104L577.496 120.208H581.384ZM583.595 111.424C583.659 109.712 584.219 108.392 585.275 107.464C586.331 106.536 587.763 106.072 589.571 106.072C590.771 106.072 591.795 106.28 592.643 106.696C593.507 107.112 594.155 107.68 594.587 108.4C595.035 109.12 595.259 109.928 595.259 110.824C595.259 111.88 594.995 112.744 594.467 113.416C593.939 114.072 593.323 114.52 592.619 114.76V114.856C593.531 115.16 594.251 115.664 594.779 116.368C595.307 117.072 595.571 117.976 595.571 119.08C595.571 120.072 595.339 120.952 594.875 121.72C594.427 122.472 593.763 123.064 592.883 123.496C592.019 123.928 590.987 124.144 589.787 124.144C587.867 124.144 586.331 123.672 585.179 122.728C584.043 121.784 583.443 120.36 583.379 118.456H587.363C587.379 119.16 587.579 119.72 587.963 120.136C588.347 120.536 588.907 120.736 589.643 120.736C590.267 120.736 590.747 120.56 591.083 120.208C591.435 119.84 591.611 119.36 591.611 118.768C591.611 118 591.363 117.448 590.867 117.112C590.387 116.76 589.611 116.584 588.539 116.584H587.771V113.248H588.539C589.355 113.248 590.011 113.112 590.507 112.84C591.019 112.552 591.275 112.048 591.275 111.328C591.275 110.752 591.115 110.304 590.795 109.984C590.475 109.664 590.035 109.504 589.475 109.504C588.867 109.504 588.411 109.688 588.107 110.056C587.819 110.424 587.651 110.88 587.603 111.424H583.595ZM597.646 110.896C597.646 109.6 598.014 108.6 598.75 107.896C599.502 107.192 600.47 106.84 601.654 106.84C602.838 106.84 603.798 107.192 604.534 107.896C605.27 108.6 605.638 109.6 605.638 110.896C605.638 112.192 605.27 113.192 604.534 113.896C603.798 114.6 602.838 114.952 601.654 114.952C600.47 114.952 599.502 114.6 598.75 113.896C598.014 113.192 597.646 112.192 597.646 110.896ZM613.942 107.104L604.702 124H600.742L609.982 107.104H613.942ZM601.63 109.24C600.862 109.24 600.478 109.792 600.478 110.896C600.478 111.984 600.862 112.528 601.63 112.528C601.998 112.528 602.286 112.392 602.494 112.12C602.702 111.848 602.806 111.44 602.806 110.896C602.806 109.792 602.414 109.24 601.63 109.24ZM609.07 120.208C609.07 118.912 609.438 117.912 610.174 117.208C610.91 116.504 611.87 116.152 613.054 116.152C614.238 116.152 615.198 116.504 615.934 117.208C616.67 117.912 617.038 118.912 617.038 120.208C617.038 121.504 616.67 122.504 615.934 123.208C615.198 123.912 614.238 124.264 613.054 124.264C611.87 124.264 610.91 123.912 610.174 123.208C609.438 122.504 609.07 121.504 609.07 120.208ZM613.03 118.552C612.662 118.552 612.374 118.688 612.166 118.96C611.974 119.232 611.878 119.648 611.878 120.208C611.878 121.296 612.262 121.84 613.03 121.84C613.398 121.84 613.686 121.704 613.894 121.432C614.102 121.16 614.206 120.752 614.206 120.208C614.206 119.664 614.102 119.256 613.894 118.984C613.686 118.696 613.398 118.552 613.03 118.552Z" fill="#333333"/>
<path d="M567.196 134.768V146H564.46V139.264L561.948 146H559.74L557.212 139.248V146H554.476V134.768H557.708L560.86 142.544L563.98 134.768H567.196ZM573.228 146.128C572.353 146.128 571.564 145.941 570.86 145.568C570.167 145.195 569.617 144.661 569.212 143.968C568.817 143.275 568.62 142.464 568.62 141.536C568.62 140.619 568.823 139.813 569.228 139.12C569.633 138.416 570.188 137.877 570.892 137.504C571.596 137.131 572.385 136.944 573.26 136.944C574.135 136.944 574.924 137.131 575.628 137.504C576.332 137.877 576.887 138.416 577.292 139.12C577.697 139.813 577.9 140.619 577.9 141.536C577.9 142.453 577.692 143.264 577.276 143.968C576.871 144.661 576.311 145.195 575.596 145.568C574.892 145.941 574.103 146.128 573.228 146.128ZM573.228 143.76C573.751 143.76 574.193 143.568 574.556 143.184C574.929 142.8 575.116 142.251 575.116 141.536C575.116 140.821 574.935 140.272 574.572 139.888C574.22 139.504 573.783 139.312 573.26 139.312C572.727 139.312 572.284 139.504 571.932 139.888C571.58 140.261 571.404 140.811 571.404 141.536C571.404 142.251 571.575 142.8 571.916 143.184C572.268 143.568 572.705 143.76 573.228 143.76ZM582.087 138.336C582.343 137.92 582.711 137.584 583.191 137.328C583.671 137.072 584.221 136.944 584.839 136.944C585.575 136.944 586.242 137.131 586.839 137.504C587.437 137.877 587.906 138.411 588.247 139.104C588.599 139.797 588.775 140.603 588.775 141.52C588.775 142.437 588.599 143.248 588.247 143.952C587.906 144.645 587.437 145.184 586.839 145.568C586.242 145.941 585.575 146.128 584.839 146.128C584.21 146.128 583.661 146.005 583.191 145.76C582.722 145.504 582.354 145.168 582.087 144.752V146H579.351V134.16H582.087V138.336ZM585.991 141.52C585.991 140.837 585.799 140.304 585.415 139.92C585.042 139.525 584.578 139.328 584.023 139.328C583.479 139.328 583.015 139.525 582.631 139.92C582.258 140.315 582.071 140.853 582.071 141.536C582.071 142.219 582.258 142.757 582.631 143.152C583.015 143.547 583.479 143.744 584.023 143.744C584.567 143.744 585.031 143.547 585.415 143.152C585.799 142.747 585.991 142.203 585.991 141.52ZM591.587 136.144C591.107 136.144 590.712 136.005 590.403 135.728C590.104 135.44 589.955 135.088 589.955 134.672C589.955 134.245 590.104 133.893 590.403 133.616C590.712 133.328 591.107 133.184 591.587 133.184C592.056 133.184 592.44 133.328 592.739 133.616C593.048 133.893 593.203 134.245 593.203 134.672C593.203 135.088 593.048 135.44 592.739 135.728C592.44 136.005 592.056 136.144 591.587 136.144ZM592.947 137.072V146H590.211V137.072H592.947ZM597.666 134.16V146H594.93V134.16H597.666ZM608.064 141.392C608.064 141.648 608.048 141.915 608.016 142.192H601.824C601.867 142.747 602.043 143.173 602.352 143.472C602.672 143.76 603.062 143.904 603.52 143.904C604.203 143.904 604.678 143.616 604.944 143.04H607.856C607.707 143.627 607.435 144.155 607.04 144.624C606.656 145.093 606.171 145.461 605.584 145.728C604.998 145.995 604.342 146.128 603.616 146.128C602.742 146.128 601.963 145.941 601.28 145.568C600.598 145.195 600.064 144.661 599.68 143.968C599.296 143.275 599.104 142.464 599.104 141.536C599.104 140.608 599.291 139.797 599.664 139.104C600.048 138.411 600.582 137.877 601.264 137.504C601.947 137.131 602.731 136.944 603.616 136.944C604.48 136.944 605.248 137.125 605.92 137.488C606.592 137.851 607.115 138.368 607.488 139.04C607.872 139.712 608.064 140.496 608.064 141.392ZM605.264 140.672C605.264 140.203 605.104 139.829 604.784 139.552C604.464 139.275 604.064 139.136 603.584 139.136C603.126 139.136 602.736 139.269 602.416 139.536C602.107 139.803 601.915 140.181 601.84 140.672H605.264Z" fill="#0254A6"/>
<path d="M442.168 351.4V348.64L448.488 339.6H452.308V348.44H453.948V351.4H452.308V354H448.888V351.4H442.168ZM449.128 343.36L445.768 348.44H449.128V343.36ZM455.263 342.58V339.4H460.803V354H457.243V342.58H455.263ZM467.162 350.84L464.942 356.58H462.762L463.922 350.84H467.162ZM468.764 351.26C469.218 350.9 469.424 350.733 469.384 350.76C470.691 349.68 471.718 348.793 472.464 348.1C473.224 347.407 473.864 346.68 474.384 345.92C474.904 345.16 475.164 344.42 475.164 343.7C475.164 343.153 475.038 342.727 474.784 342.42C474.531 342.113 474.151 341.96 473.644 341.96C473.138 341.96 472.738 342.153 472.444 342.54C472.164 342.913 472.024 343.447 472.024 344.14H468.724C468.751 343.007 468.991 342.06 469.444 341.3C469.911 340.54 470.518 339.98 471.264 339.62C472.024 339.26 472.864 339.08 473.784 339.08C475.371 339.08 476.564 339.487 477.364 340.3C478.178 341.113 478.584 342.173 478.584 343.48C478.584 344.907 478.098 346.233 477.124 347.46C476.151 348.673 474.911 349.86 473.404 351.02H478.804V353.8H468.764V351.26ZM480.03 343.08C480.03 342 480.337 341.167 480.95 340.58C481.577 339.993 482.383 339.7 483.37 339.7C484.357 339.7 485.157 339.993 485.77 340.58C486.383 341.167 486.69 342 486.69 343.08C486.69 344.16 486.383 344.993 485.77 345.58C485.157 346.167 484.357 346.46 483.37 346.46C482.383 346.46 481.577 346.167 480.95 345.58C480.337 344.993 480.03 344.16 480.03 343.08ZM493.61 339.92L485.91 354H482.61L490.31 339.92H493.61ZM483.35 341.7C482.71 341.7 482.39 342.16 482.39 343.08C482.39 343.987 482.71 344.44 483.35 344.44C483.657 344.44 483.897 344.327 484.07 344.1C484.243 343.873 484.33 343.533 484.33 343.08C484.33 342.16 484.003 341.7 483.35 341.7ZM489.55 350.84C489.55 349.76 489.857 348.927 490.47 348.34C491.083 347.753 491.883 347.46 492.87 347.46C493.857 347.46 494.657 347.753 495.27 348.34C495.883 348.927 496.19 349.76 496.19 350.84C496.19 351.92 495.883 352.753 495.27 353.34C494.657 353.927 493.857 354.22 492.87 354.22C491.883 354.22 491.083 353.927 490.47 353.34C489.857 352.753 489.55 351.92 489.55 350.84ZM492.85 349.46C492.543 349.46 492.303 349.573 492.13 349.8C491.97 350.027 491.89 350.373 491.89 350.84C491.89 351.747 492.21 352.2 492.85 352.2C493.157 352.2 493.397 352.087 493.57 351.86C493.743 351.633 493.83 351.293 493.83 350.84C493.83 350.387 493.743 350.047 493.57 349.82C493.397 349.58 493.157 349.46 492.85 349.46Z" fill="white"/>
<path d="M447.959 363.576C448.847 363.576 449.623 363.752 450.287 364.104C450.951 364.456 451.463 364.952 451.823 365.592C452.191 366.224 452.375 366.956 452.375 367.788C452.375 368.612 452.191 369.344 451.823 369.984C451.463 370.624 450.947 371.12 450.275 371.472C449.611 371.824 448.839 372 447.959 372H444.803V363.576H447.959ZM447.827 370.224C448.603 370.224 449.207 370.012 449.639 369.588C450.071 369.164 450.287 368.564 450.287 367.788C450.287 367.012 450.071 366.408 449.639 365.976C449.207 365.544 448.603 365.328 447.827 365.328H446.855V370.224H447.827ZM459.833 368.544C459.833 368.736 459.821 368.936 459.797 369.144H455.153C455.185 369.56 455.317 369.88 455.549 370.104C455.789 370.32 456.081 370.428 456.425 370.428C456.937 370.428 457.293 370.212 457.493 369.78H459.677C459.565 370.22 459.361 370.616 459.065 370.968C458.777 371.32 458.413 371.596 457.973 371.796C457.533 371.996 457.041 372.096 456.497 372.096C455.841 372.096 455.257 371.956 454.745 371.676C454.233 371.396 453.833 370.996 453.545 370.476C453.257 369.956 453.113 369.348 453.113 368.652C453.113 367.956 453.253 367.348 453.533 366.828C453.821 366.308 454.221 365.908 454.733 365.628C455.245 365.348 455.833 365.208 456.497 365.208C457.145 365.208 457.721 365.344 458.225 365.616C458.729 365.888 459.121 366.276 459.401 366.78C459.689 367.284 459.833 367.872 459.833 368.544ZM457.733 368.004C457.733 367.652 457.613 367.372 457.373 367.164C457.133 366.956 456.833 366.852 456.473 366.852C456.129 366.852 455.837 366.952 455.597 367.152C455.365 367.352 455.221 367.636 455.165 368.004H457.733ZM463.64 372.096C463.056 372.096 462.536 371.996 462.08 371.796C461.624 371.596 461.264 371.324 461 370.98C460.736 370.628 460.588 370.236 460.556 369.804H462.584C462.608 370.036 462.716 370.224 462.908 370.368C463.1 370.512 463.336 370.584 463.616 370.584C463.872 370.584 464.068 370.536 464.204 370.44C464.348 370.336 464.42 370.204 464.42 370.044C464.42 369.852 464.32 369.712 464.12 369.624C463.92 369.528 463.596 369.424 463.148 369.312C462.668 369.2 462.268 369.084 461.948 368.964C461.628 368.836 461.352 368.64 461.12 368.376C460.888 368.104 460.772 367.74 460.772 367.284C460.772 366.9 460.876 366.552 461.084 366.24C461.3 365.92 461.612 365.668 462.02 365.484C462.436 365.3 462.928 365.208 463.496 365.208C464.336 365.208 464.996 365.416 465.476 365.832C465.964 366.248 466.244 366.8 466.316 367.488H464.42C464.388 367.256 464.284 367.072 464.108 366.936C463.94 366.8 463.716 366.732 463.436 366.732C463.196 366.732 463.012 366.78 462.884 366.876C462.756 366.964 462.692 367.088 462.692 367.248C462.692 367.44 462.792 367.584 462.992 367.68C463.2 367.776 463.52 367.872 463.952 367.968C464.448 368.096 464.852 368.224 465.164 368.352C465.476 368.472 465.748 368.672 465.98 368.952C466.22 369.224 466.344 369.592 466.352 370.056C466.352 370.448 466.24 370.8 466.016 371.112C465.8 371.416 465.484 371.656 465.068 371.832C464.66 372.008 464.184 372.096 463.64 372.096ZM471.699 372L469.659 369.192V372H467.607V363.12H469.659V368.028L471.687 365.304H474.219L471.435 368.664L474.243 372H471.699ZM478.757 370.26V372H477.713C476.969 372 476.389 371.82 475.973 371.46C475.557 371.092 475.349 370.496 475.349 369.672V367.008H474.533V365.304H475.349V363.672H477.401V365.304H478.745V367.008H477.401V369.696C477.401 369.896 477.449 370.04 477.545 370.128C477.641 370.216 477.801 370.26 478.025 370.26H478.757ZM482.948 372.096C482.292 372.096 481.7 371.956 481.172 371.676C480.652 371.396 480.24 370.996 479.936 370.476C479.64 369.956 479.492 369.348 479.492 368.652C479.492 367.964 479.644 367.36 479.948 366.84C480.252 366.312 480.668 365.908 481.196 365.628C481.724 365.348 482.316 365.208 482.972 365.208C483.628 365.208 484.22 365.348 484.748 365.628C485.276 365.908 485.692 366.312 485.996 366.84C486.3 367.36 486.452 367.964 486.452 368.652C486.452 369.34 486.296 369.948 485.984 370.476C485.68 370.996 485.26 371.396 484.724 371.676C484.196 371.956 483.604 372.096 482.948 372.096ZM482.948 370.32C483.34 370.32 483.672 370.176 483.944 369.888C484.224 369.6 484.364 369.188 484.364 368.652C484.364 368.116 484.228 367.704 483.956 367.416C483.692 367.128 483.364 366.984 482.972 366.984C482.572 366.984 482.24 367.128 481.976 367.416C481.712 367.696 481.58 368.108 481.58 368.652C481.58 369.188 481.708 369.6 481.964 369.888C482.228 370.176 482.556 370.32 482.948 370.32ZM489.593 366.252C489.793 365.94 490.069 365.688 490.421 365.496C490.773 365.304 491.185 365.208 491.657 365.208C492.209 365.208 492.709 365.348 493.157 365.628C493.605 365.908 493.957 366.308 494.213 366.828C494.477 367.348 494.609 367.952 494.609 368.64C494.609 369.328 494.477 369.936 494.213 370.464C493.957 370.984 493.605 371.388 493.157 371.676C492.709 371.956 492.209 372.096 491.657 372.096C491.193 372.096 490.781 372 490.421 371.808C490.069 371.616 489.793 371.368 489.593 371.064V375.192H487.541V365.304H489.593V366.252ZM492.521 368.64C492.521 368.128 492.377 367.728 492.089 367.44C491.809 367.144 491.461 366.996 491.045 366.996C490.637 366.996 490.289 367.144 490.001 367.44C489.721 367.736 489.581 368.14 489.581 368.652C489.581 369.164 489.721 369.568 490.001 369.864C490.289 370.16 490.637 370.308 491.045 370.308C491.453 370.308 491.801 370.16 492.089 369.864C492.377 369.56 492.521 369.152 492.521 368.64Z" fill="white"/>
<path d="M532.739 346.16C531.486 345.493 530.859 344.447 530.859 343.02C530.859 342.3 531.046 341.647 531.419 341.06C531.793 340.46 532.359 339.987 533.119 339.64C533.879 339.28 534.813 339.1 535.919 339.1C537.026 339.1 537.953 339.28 538.699 339.64C539.459 339.987 540.026 340.46 540.399 341.06C540.773 341.647 540.959 342.3 540.959 343.02C540.959 343.74 540.786 344.367 540.439 344.9C540.106 345.433 539.653 345.853 539.079 346.16C539.799 346.507 540.353 346.987 540.739 347.6C541.126 348.2 541.319 348.907 541.319 349.72C541.319 350.667 541.079 351.487 540.599 352.18C540.119 352.86 539.466 353.38 538.639 353.74C537.826 354.1 536.919 354.28 535.919 354.28C534.919 354.28 534.006 354.1 533.179 353.74C532.366 353.38 531.719 352.86 531.239 352.18C530.759 351.487 530.519 350.667 530.519 349.72C530.519 348.893 530.713 348.18 531.099 347.58C531.486 346.967 532.033 346.493 532.739 346.16ZM537.639 343.54C537.639 342.993 537.479 342.573 537.159 342.28C536.853 341.973 536.439 341.82 535.919 341.82C535.399 341.82 534.979 341.973 534.659 342.28C534.353 342.587 534.199 343.013 534.199 343.56C534.199 344.08 534.359 344.493 534.679 344.8C534.999 345.093 535.413 345.24 535.919 345.24C536.426 345.24 536.839 345.087 537.159 344.78C537.479 344.473 537.639 344.06 537.639 343.54ZM535.919 347.64C535.293 347.64 534.786 347.813 534.399 348.16C534.013 348.493 533.819 348.96 533.819 349.56C533.819 350.12 534.006 350.58 534.379 350.94C534.766 351.3 535.279 351.48 535.919 351.48C536.559 351.48 537.059 351.3 537.419 350.94C537.793 350.58 537.979 350.12 537.979 349.56C537.979 348.973 537.786 348.507 537.399 348.16C537.026 347.813 536.533 347.64 535.919 347.64ZM547.328 350.84L545.108 356.58H542.928L544.088 350.84H547.328ZM559.33 342.38H553.09V345.14C553.357 344.847 553.73 344.607 554.21 344.42C554.69 344.233 555.21 344.14 555.77 344.14C556.77 344.14 557.597 344.367 558.25 344.82C558.917 345.273 559.404 345.86 559.71 346.58C560.017 347.3 560.17 348.08 560.17 348.92C560.17 350.48 559.73 351.72 558.85 352.64C557.97 353.547 556.73 354 555.13 354C554.064 354 553.137 353.82 552.35 353.46C551.564 353.087 550.957 352.573 550.53 351.92C550.104 351.267 549.87 350.513 549.83 349.66H553.17C553.25 350.073 553.444 350.42 553.75 350.7C554.057 350.967 554.477 351.1 555.01 351.1C555.637 351.1 556.104 350.9 556.41 350.5C556.717 350.1 556.87 349.567 556.87 348.9C556.87 348.247 556.71 347.747 556.39 347.4C556.07 347.053 555.604 346.88 554.99 346.88C554.537 346.88 554.164 346.993 553.87 347.22C553.577 347.433 553.384 347.72 553.29 348.08H549.99V339.38H559.33V342.38ZM561.778 343.08C561.778 342 562.085 341.167 562.698 340.58C563.325 339.993 564.132 339.7 565.118 339.7C566.105 339.7 566.905 339.993 567.518 340.58C568.132 341.167 568.438 342 568.438 343.08C568.438 344.16 568.132 344.993 567.518 345.58C566.905 346.167 566.105 346.46 565.118 346.46C564.132 346.46 563.325 346.167 562.698 345.58C562.085 344.993 561.778 344.16 561.778 343.08ZM575.358 339.92L567.658 354H564.358L572.058 339.92H575.358ZM565.098 341.7C564.458 341.7 564.138 342.16 564.138 343.08C564.138 343.987 564.458 344.44 565.098 344.44C565.405 344.44 565.645 344.327 565.818 344.1C565.992 343.873 566.078 343.533 566.078 343.08C566.078 342.16 565.752 341.7 565.098 341.7ZM571.298 350.84C571.298 349.76 571.605 348.927 572.218 348.34C572.832 347.753 573.632 347.46 574.618 347.46C575.605 347.46 576.405 347.753 577.018 348.34C577.632 348.927 577.938 349.76 577.938 350.84C577.938 351.92 577.632 352.753 577.018 353.34C576.405 353.927 575.605 354.22 574.618 354.22C573.632 354.22 572.832 353.927 572.218 353.34C571.605 352.753 571.298 351.92 571.298 350.84ZM574.598 349.46C574.292 349.46 574.052 349.573 573.878 349.8C573.718 350.027 573.638 350.373 573.638 350.84C573.638 351.747 573.958 352.2 574.598 352.2C574.905 352.2 575.145 352.087 575.318 351.86C575.492 351.633 575.578 351.293 575.578 350.84C575.578 350.387 575.492 350.047 575.318 349.82C575.145 349.58 574.905 349.46 574.598 349.46Z" fill="white"/>
<path d="M541.21 363.576V365.22H538.978V372H536.926V365.22H534.694V363.576H541.21ZM541.832 368.64C541.832 367.952 541.96 367.348 542.216 366.828C542.48 366.308 542.836 365.908 543.284 365.628C543.732 365.348 544.232 365.208 544.784 365.208C545.256 365.208 545.668 365.304 546.02 365.496C546.38 365.688 546.656 365.94 546.848 366.252V365.304H548.9V372H546.848V371.052C546.648 371.364 546.368 371.616 546.008 371.808C545.656 372 545.244 372.096 544.772 372.096C544.228 372.096 543.732 371.956 543.284 371.676C542.836 371.388 542.48 370.984 542.216 370.464C541.96 369.936 541.832 369.328 541.832 368.64ZM546.848 368.652C546.848 368.14 546.704 367.736 546.416 367.44C546.136 367.144 545.792 366.996 545.384 366.996C544.976 366.996 544.628 367.144 544.34 367.44C544.06 367.728 543.92 368.128 543.92 368.64C543.92 369.152 544.06 369.56 544.34 369.864C544.628 370.16 544.976 370.308 545.384 370.308C545.792 370.308 546.136 370.16 546.416 369.864C546.704 369.568 546.848 369.164 546.848 368.652ZM552.437 366.252C552.629 365.94 552.905 365.688 553.265 365.496C553.625 365.304 554.037 365.208 554.501 365.208C555.053 365.208 555.553 365.348 556.001 365.628C556.449 365.908 556.801 366.308 557.057 366.828C557.321 367.348 557.453 367.952 557.453 368.64C557.453 369.328 557.321 369.936 557.057 370.464C556.801 370.984 556.449 371.388 556.001 371.676C555.553 371.956 555.053 372.096 554.501 372.096C554.029 372.096 553.617 372.004 553.265 371.82C552.913 371.628 552.637 371.376 552.437 371.064V372H550.385V363.12H552.437V366.252ZM555.365 368.64C555.365 368.128 555.221 367.728 554.933 367.44C554.653 367.144 554.305 366.996 553.889 366.996C553.481 366.996 553.133 367.144 552.845 367.44C552.565 367.736 552.425 368.14 552.425 368.652C552.425 369.164 552.565 369.568 552.845 369.864C553.133 370.16 553.481 370.308 553.889 370.308C554.297 370.308 554.645 370.16 554.933 369.864C555.221 369.56 555.365 369.152 555.365 368.64ZM560.581 363.12V372H558.529V363.12H560.581ZM568.38 368.544C568.38 368.736 568.368 368.936 568.344 369.144H563.7C563.732 369.56 563.864 369.88 564.096 370.104C564.336 370.32 564.628 370.428 564.972 370.428C565.484 370.428 565.84 370.212 566.04 369.78H568.224C568.112 370.22 567.908 370.616 567.612 370.968C567.324 371.32 566.96 371.596 566.52 371.796C566.08 371.996 565.588 372.096 565.044 372.096C564.388 372.096 563.804 371.956 563.292 371.676C562.78 371.396 562.38 370.996 562.092 370.476C561.804 369.956 561.66 369.348 561.66 368.652C561.66 367.956 561.8 367.348 562.08 366.828C562.368 366.308 562.768 365.908 563.28 365.628C563.792 365.348 564.38 365.208 565.044 365.208C565.692 365.208 566.268 365.344 566.772 365.616C567.276 365.888 567.668 366.276 567.948 366.78C568.236 367.284 568.38 367.872 568.38 368.544ZM566.28 368.004C566.28 367.652 566.16 367.372 565.92 367.164C565.68 366.956 565.38 366.852 565.02 366.852C564.676 366.852 564.384 366.952 564.144 367.152C563.912 367.352 563.768 367.636 563.712 368.004H566.28ZM573.195 370.26V372H572.151C571.407 372 570.827 371.82 570.411 371.46C569.995 371.092 569.787 370.496 569.787 369.672V367.008H568.971V365.304H569.787V363.672H571.839V365.304H573.183V367.008H571.839V369.696C571.839 369.896 571.887 370.04 571.983 370.128C572.079 370.216 572.239 370.26 572.463 370.26H573.195Z" fill="white"/>
<path fill-rule="evenodd" clip-rule="evenodd" d="M720.28 140.835C719.053 160.893 721.867 180.992 728.558 199.941L747.383 193.294C742.602 179.751 740 165.179 740 150C740 91.9455 778.054 42.779 830.58 26.0843L824.527 7.05874C805.378 13.1506 787.648 23.0279 772.39 36.1044C757.132 49.1809 744.656 65.1898 735.705 83.1808C726.753 101.172 721.508 120.778 720.28 140.835Z" fill="#5481DC"/>
<path fill-rule="evenodd" clip-rule="evenodd" d="M868.998 0.00335115C853.89 0.104281 838.884 2.48711 824.488 7.07117L830.546 26.0951C842.727 22.2196 855.687 20.0908 869.132 20.0028L868.998 0.00335115Z" fill="#0254A6"/>
<path d="M870 0C897.543 3.28451e-07 924.555 7.58371 948.073 21.9197C971.592 36.2556 990.709 56.7903 1003.33 81.2724C1015.95 105.754 1021.58 133.239 1019.62 160.712C1017.65 188.185 1008.16 214.586 992.178 237.02C976.199 259.455 954.352 277.057 929.031 287.896C903.711 298.735 875.894 302.394 848.632 298.47C821.369 294.546 795.714 283.192 774.477 265.652C753.241 248.112 737.244 225.063 728.241 199.033L870 150L870 0Z" fill="white"/>
<path d="M915.912 111.208C915.784 110.616 915.56 110.176 915.24 109.888C914.92 109.584 914.464 109.432 913.872 109.432C912.96 109.432 912.304 109.832 911.904 110.632C911.504 111.416 911.296 112.664 911.28 114.376C911.632 113.816 912.136 113.376 912.792 113.056C913.464 112.736 914.2 112.576 915 112.576C916.568 112.576 917.824 113.072 918.768 114.064C919.728 115.056 920.208 116.44 920.208 118.216C920.208 119.384 919.968 120.408 919.488 121.288C919.024 122.168 918.336 122.856 917.424 123.352C916.528 123.848 915.464 124.096 914.232 124.096C911.768 124.096 910.056 123.328 909.096 121.792C908.136 120.24 907.656 118.016 907.656 115.12C907.656 112.08 908.16 109.824 909.168 108.352C910.192 106.864 911.824 106.12 914.064 106.12C915.264 106.12 916.272 106.36 917.088 106.84C917.92 107.304 918.544 107.92 918.96 108.688C919.392 109.456 919.648 110.296 919.728 111.208H915.912ZM914.016 115.816C913.328 115.816 912.752 116.024 912.288 116.44C911.84 116.84 911.616 117.416 911.616 118.168C911.616 118.936 911.824 119.536 912.24 119.968C912.672 120.4 913.28 120.616 914.064 120.616C914.768 120.616 915.32 120.408 915.72 119.992C916.136 119.56 916.344 118.976 916.344 118.24C916.344 117.488 916.144 116.896 915.744 116.464C915.344 116.032 914.768 115.816 914.016 115.816ZM926.945 118.864C927.185 120.128 927.921 120.76 929.153 120.76C930.001 120.76 930.601 120.384 930.953 119.632C931.305 118.88 931.481 117.656 931.481 115.96C931.129 116.456 930.649 116.84 930.041 117.112C929.433 117.384 928.753 117.52 928.001 117.52C926.977 117.52 926.065 117.312 925.265 116.896C924.465 116.464 923.833 115.832 923.369 115C922.921 114.152 922.697 113.128 922.697 111.928C922.697 110.744 922.937 109.712 923.417 108.832C923.913 107.952 924.609 107.272 925.505 106.792C926.417 106.312 927.489 106.072 928.721 106.072C931.089 106.072 932.745 106.808 933.689 108.28C934.633 109.752 935.105 111.92 935.105 114.784C935.105 116.864 934.913 118.584 934.529 119.944C934.161 121.288 933.529 122.312 932.633 123.016C931.753 123.72 930.545 124.072 929.009 124.072C927.793 124.072 926.753 123.832 925.889 123.352C925.041 122.872 924.385 122.24 923.921 121.456C923.473 120.672 923.217 119.808 923.153 118.864H926.945ZM928.937 114.28C929.609 114.28 930.145 114.08 930.545 113.68C930.945 113.264 931.145 112.704 931.145 112C931.145 111.232 930.937 110.64 930.521 110.224C930.105 109.808 929.545 109.6 928.841 109.6C928.137 109.6 927.577 109.816 927.161 110.248C926.761 110.664 926.561 111.24 926.561 111.976C926.561 112.664 926.761 113.224 927.161 113.656C927.577 114.072 928.169 114.28 928.937 114.28ZM942.119 120.208L939.455 127.096H936.839L938.231 120.208H942.119ZM955.369 109.552L949.345 124H945.145L951.241 110.008H943.777V106.504H955.369V109.552ZM956.693 110.896C956.693 109.6 957.061 108.6 957.797 107.896C958.549 107.192 959.517 106.84 960.701 106.84C961.885 106.84 962.845 107.192 963.581 107.896C964.317 108.6 964.685 109.6 964.685 110.896C964.685 112.192 964.317 113.192 963.581 113.896C962.845 114.6 961.885 114.952 960.701 114.952C959.517 114.952 958.549 114.6 957.797 113.896C957.061 113.192 956.693 112.192 956.693 110.896ZM972.989 107.104L963.749 124H959.789L969.029 107.104H972.989ZM960.677 109.24C959.909 109.24 959.525 109.792 959.525 110.896C959.525 111.984 959.909 112.528 960.677 112.528C961.045 112.528 961.333 112.392 961.541 112.12C961.749 111.848 961.853 111.44 961.853 110.896C961.853 109.792 961.461 109.24 960.677 109.24ZM968.117 120.208C968.117 118.912 968.485 117.912 969.221 117.208C969.957 116.504 970.917 116.152 972.101 116.152C973.285 116.152 974.245 116.504 974.981 117.208C975.717 117.912 976.085 118.912 976.085 120.208C976.085 121.504 975.717 122.504 974.981 123.208C974.245 123.912 973.285 124.264 972.101 124.264C970.917 124.264 969.957 123.912 969.221 123.208C968.485 122.504 968.117 121.504 968.117 120.208ZM972.077 118.552C971.709 118.552 971.421 118.688 971.213 118.96C971.021 119.232 970.925 119.648 970.925 120.208C970.925 121.296 971.309 121.84 972.077 121.84C972.445 121.84 972.733 121.704 972.941 121.432C973.149 121.16 973.253 120.752 973.253 120.208C973.253 119.664 973.149 119.256 972.941 118.984C972.733 118.696 972.445 118.552 972.077 118.552Z" fill="#333333"/>
<path d="M927.196 134.768V146H924.46V139.264L921.948 146H919.74L917.212 139.248V146H914.476V134.768H917.708L920.86 142.544L923.98 134.768H927.196ZM933.228 146.128C932.353 146.128 931.564 145.941 930.86 145.568C930.167 145.195 929.617 144.661 929.212 143.968C928.817 143.275 928.62 142.464 928.62 141.536C928.62 140.619 928.823 139.813 929.228 139.12C929.633 138.416 930.188 137.877 930.892 137.504C931.596 137.131 932.385 136.944 933.26 136.944C934.135 136.944 934.924 137.131 935.628 137.504C936.332 137.877 936.887 138.416 937.292 139.12C937.697 139.813 937.9 140.619 937.9 141.536C937.9 142.453 937.692 143.264 937.276 143.968C936.871 144.661 936.311 145.195 935.596 145.568C934.892 145.941 934.103 146.128 933.228 146.128ZM933.228 143.76C933.751 143.76 934.193 143.568 934.556 143.184C934.929 142.8 935.116 142.251 935.116 141.536C935.116 140.821 934.935 140.272 934.572 139.888C934.22 139.504 933.783 139.312 933.26 139.312C932.727 139.312 932.284 139.504 931.932 139.888C931.58 140.261 931.404 140.811 931.404 141.536C931.404 142.251 931.575 142.8 931.916 143.184C932.268 143.568 932.705 143.76 933.228 143.76ZM942.087 138.336C942.343 137.92 942.711 137.584 943.191 137.328C943.671 137.072 944.221 136.944 944.839 136.944C945.575 136.944 946.242 137.131 946.839 137.504C947.437 137.877 947.906 138.411 948.247 139.104C948.599 139.797 948.775 140.603 948.775 141.52C948.775 142.437 948.599 143.248 948.247 143.952C947.906 144.645 947.437 145.184 946.839 145.568C946.242 145.941 945.575 146.128 944.839 146.128C944.21 146.128 943.661 146.005 943.191 145.76C942.722 145.504 942.354 145.168 942.087 144.752V146H939.351V134.16H942.087V138.336ZM945.991 141.52C945.991 140.837 945.799 140.304 945.415 139.92C945.042 139.525 944.578 139.328 944.023 139.328C943.479 139.328 943.015 139.525 942.631 139.92C942.258 140.315 942.071 140.853 942.071 141.536C942.071 142.219 942.258 142.757 942.631 143.152C943.015 143.547 943.479 143.744 944.023 143.744C944.567 143.744 945.031 143.547 945.415 143.152C945.799 142.747 945.991 142.203 945.991 141.52ZM951.587 136.144C951.107 136.144 950.712 136.005 950.403 135.728C950.104 135.44 949.955 135.088 949.955 134.672C949.955 134.245 950.104 133.893 950.403 133.616C950.712 133.328 951.107 133.184 951.587 133.184C952.056 133.184 952.44 133.328 952.739 133.616C953.048 133.893 953.203 134.245 953.203 134.672C953.203 135.088 953.048 135.44 952.739 135.728C952.44 136.005 952.056 136.144 951.587 136.144ZM952.947 137.072V146H950.211V137.072H952.947ZM957.666 134.16V146H954.93V134.16H957.666ZM968.064 141.392C968.064 141.648 968.048 141.915 968.016 142.192H961.824C961.867 142.747 962.043 143.173 962.352 143.472C962.672 143.76 963.062 143.904 963.52 143.904C964.203 143.904 964.678 143.616 964.944 143.04H967.856C967.707 143.627 967.435 144.155 967.04 144.624C966.656 145.093 966.171 145.461 965.584 145.728C964.998 145.995 964.342 146.128 963.616 146.128C962.742 146.128 961.963 145.941 961.28 145.568C960.598 145.195 960.064 144.661 959.68 143.968C959.296 143.275 959.104 142.464 959.104 141.536C959.104 140.608 959.291 139.797 959.664 139.104C960.048 138.411 960.582 137.877 961.264 137.504C961.947 137.131 962.731 136.944 963.616 136.944C964.48 136.944 965.248 137.125 965.92 137.488C966.592 137.851 967.115 138.368 967.488 139.04C967.872 139.712 968.064 140.496 968.064 141.392ZM965.264 140.672C965.264 140.203 965.104 139.829 964.784 139.552C964.464 139.275 964.064 139.136 963.584 139.136C963.126 139.136 962.736 139.269 962.416 139.536C962.107 139.803 961.915 140.181 961.84 140.672H965.264Z" fill="#0254A6"/>
<path d="M799.487 351.26C799.94 350.9 800.147 350.733 800.107 350.76C801.414 349.68 802.44 348.793 803.187 348.1C803.947 347.407 804.587 346.68 805.107 345.92C805.627 345.16 805.887 344.42 805.887 343.7C805.887 343.153 805.76 342.727 805.507 342.42C805.254 342.113 804.874 341.96 804.367 341.96C803.86 341.96 803.46 342.153 803.167 342.54C802.887 342.913 802.747 343.447 802.747 344.14H799.447C799.474 343.007 799.714 342.06 800.167 341.3C800.634 340.54 801.24 339.98 801.987 339.62C802.747 339.26 803.587 339.08 804.507 339.08C806.094 339.08 807.287 339.487 808.087 340.3C808.9 341.113 809.307 342.173 809.307 343.48C809.307 344.907 808.82 346.233 807.847 347.46C806.874 348.673 805.634 349.86 804.127 351.02H809.527V353.8H799.487V351.26ZM821.313 342.38H815.073V345.14C815.339 344.847 815.713 344.607 816.193 344.42C816.673 344.233 817.193 344.14 817.753 344.14C818.753 344.14 819.579 344.367 820.233 344.82C820.899 345.273 821.386 345.86 821.693 346.58C821.999 347.3 822.153 348.08 822.153 348.92C822.153 350.48 821.713 351.72 820.833 352.64C819.953 353.547 818.713 354 817.113 354C816.046 354 815.119 353.82 814.333 353.46C813.546 353.087 812.939 352.573 812.513 351.92C812.086 351.267 811.853 350.513 811.813 349.66H815.153C815.233 350.073 815.426 350.42 815.733 350.7C816.039 350.967 816.459 351.1 816.993 351.1C817.619 351.1 818.086 350.9 818.393 350.5C818.699 350.1 818.853 349.567 818.853 348.9C818.853 348.247 818.693 347.747 818.373 347.4C818.053 347.053 817.586 346.88 816.973 346.88C816.519 346.88 816.146 346.993 815.853 347.22C815.559 347.433 815.366 347.72 815.273 348.08H811.973V339.38H821.313V342.38ZM828.061 350.84L825.841 356.58H823.661L824.821 350.84H828.061ZM840.063 342.38H833.823V345.14C834.089 344.847 834.463 344.607 834.943 344.42C835.423 344.233 835.943 344.14 836.503 344.14C837.503 344.14 838.329 344.367 838.983 344.82C839.649 345.273 840.136 345.86 840.443 346.58C840.749 347.3 840.903 348.08 840.903 348.92C840.903 350.48 840.463 351.72 839.583 352.64C838.703 353.547 837.463 354 835.863 354C834.796 354 833.869 353.82 833.083 353.46C832.296 353.087 831.689 352.573 831.263 351.92C830.836 351.267 830.603 350.513 830.563 349.66H833.903C833.983 350.073 834.176 350.42 834.483 350.7C834.789 350.967 835.209 351.1 835.743 351.1C836.369 351.1 836.836 350.9 837.143 350.5C837.449 350.1 837.603 349.567 837.603 348.9C837.603 348.247 837.443 347.747 837.123 347.4C836.803 347.053 836.336 346.88 835.723 346.88C835.269 346.88 834.896 346.993 834.603 347.22C834.309 347.433 834.116 347.72 834.023 348.08H830.723V339.38H840.063V342.38ZM842.511 343.08C842.511 342 842.817 341.167 843.431 340.58C844.057 339.993 844.864 339.7 845.851 339.7C846.837 339.7 847.637 339.993 848.251 340.58C848.864 341.167 849.171 342 849.171 343.08C849.171 344.16 848.864 344.993 848.251 345.58C847.637 346.167 846.837 346.46 845.851 346.46C844.864 346.46 844.057 346.167 843.431 345.58C842.817 344.993 842.511 344.16 842.511 343.08ZM856.091 339.92L848.391 354H845.091L852.791 339.92H856.091ZM845.831 341.7C845.191 341.7 844.871 342.16 844.871 343.08C844.871 343.987 845.191 344.44 845.831 344.44C846.137 344.44 846.377 344.327 846.551 344.1C846.724 343.873 846.811 343.533 846.811 343.08C846.811 342.16 846.484 341.7 845.831 341.7ZM852.031 350.84C852.031 349.76 852.337 348.927 852.951 348.34C853.564 347.753 854.364 347.46 855.351 347.46C856.337 347.46 857.137 347.753 857.751 348.34C858.364 348.927 858.671 349.76 858.671 350.84C858.671 351.92 858.364 352.753 857.751 353.34C857.137 353.927 856.337 354.22 855.351 354.22C854.364 354.22 853.564 353.927 852.951 353.34C852.337 352.753 852.031 351.92 852.031 350.84ZM855.331 349.46C855.024 349.46 854.784 349.573 854.611 349.8C854.451 350.027 854.371 350.373 854.371 350.84C854.371 351.747 854.691 352.2 855.331 352.2C855.637 352.2 855.877 352.087 856.051 351.86C856.224 351.633 856.311 351.293 856.311 350.84C856.311 350.387 856.224 350.047 856.051 349.82C855.877 349.58 855.637 349.46 855.331 349.46Z" fill="white"/>
<path d="M807.459 363.576C808.347 363.576 809.123 363.752 809.787 364.104C810.451 364.456 810.963 364.952 811.323 365.592C811.691 366.224 811.875 366.956 811.875 367.788C811.875 368.612 811.691 369.344 811.323 369.984C810.963 370.624 810.447 371.12 809.775 371.472C809.111 371.824 808.339 372 807.459 372H804.303V363.576H807.459ZM807.327 370.224C808.103 370.224 808.707 370.012 809.139 369.588C809.571 369.164 809.787 368.564 809.787 367.788C809.787 367.012 809.571 366.408 809.139 365.976C808.707 365.544 808.103 365.328 807.327 365.328H806.355V370.224H807.327ZM819.333 368.544C819.333 368.736 819.321 368.936 819.297 369.144H814.653C814.685 369.56 814.817 369.88 815.049 370.104C815.289 370.32 815.581 370.428 815.925 370.428C816.437 370.428 816.793 370.212 816.993 369.78H819.177C819.065 370.22 818.861 370.616 818.565 370.968C818.277 371.32 817.913 371.596 817.473 371.796C817.033 371.996 816.541 372.096 815.997 372.096C815.341 372.096 814.757 371.956 814.245 371.676C813.733 371.396 813.333 370.996 813.045 370.476C812.757 369.956 812.613 369.348 812.613 368.652C812.613 367.956 812.753 367.348 813.033 366.828C813.321 366.308 813.721 365.908 814.233 365.628C814.745 365.348 815.333 365.208 815.997 365.208C816.645 365.208 817.221 365.344 817.725 365.616C818.229 365.888 818.621 366.276 818.901 366.78C819.189 367.284 819.333 367.872 819.333 368.544ZM817.233 368.004C817.233 367.652 817.113 367.372 816.873 367.164C816.633 366.956 816.333 366.852 815.973 366.852C815.629 366.852 815.337 366.952 815.097 367.152C814.865 367.352 814.721 367.636 814.665 368.004H817.233ZM823.14 372.096C822.556 372.096 822.036 371.996 821.58 371.796C821.124 371.596 820.764 371.324 820.5 370.98C820.236 370.628 820.088 370.236 820.056 369.804H822.084C822.108 370.036 822.216 370.224 822.408 370.368C822.6 370.512 822.836 370.584 823.116 370.584C823.372 370.584 823.568 370.536 823.704 370.44C823.848 370.336 823.92 370.204 823.92 370.044C823.92 369.852 823.82 369.712 823.62 369.624C823.42 369.528 823.096 369.424 822.648 369.312C822.168 369.2 821.768 369.084 821.448 368.964C821.128 368.836 820.852 368.64 820.62 368.376C820.388 368.104 820.272 367.74 820.272 367.284C820.272 366.9 820.376 366.552 820.584 366.24C820.8 365.92 821.112 365.668 821.52 365.484C821.936 365.3 822.428 365.208 822.996 365.208C823.836 365.208 824.496 365.416 824.976 365.832C825.464 366.248 825.744 366.8 825.816 367.488H823.92C823.888 367.256 823.784 367.072 823.608 366.936C823.44 366.8 823.216 366.732 822.936 366.732C822.696 366.732 822.512 366.78 822.384 366.876C822.256 366.964 822.192 367.088 822.192 367.248C822.192 367.44 822.292 367.584 822.492 367.68C822.7 367.776 823.02 367.872 823.452 367.968C823.948 368.096 824.352 368.224 824.664 368.352C824.976 368.472 825.248 368.672 825.48 368.952C825.72 369.224 825.844 369.592 825.852 370.056C825.852 370.448 825.74 370.8 825.516 371.112C825.3 371.416 824.984 371.656 824.568 371.832C824.16 372.008 823.684 372.096 823.14 372.096ZM831.199 372L829.159 369.192V372H827.107V363.12H829.159V368.028L831.187 365.304H833.719L830.935 368.664L833.743 372H831.199ZM838.257 370.26V372H837.213C836.469 372 835.889 371.82 835.473 371.46C835.057 371.092 834.849 370.496 834.849 369.672V367.008H834.033V365.304H834.849V363.672H836.901V365.304H838.245V367.008H836.901V369.696C836.901 369.896 836.949 370.04 837.045 370.128C837.141 370.216 837.301 370.26 837.525 370.26H838.257ZM842.448 372.096C841.792 372.096 841.2 371.956 840.672 371.676C840.152 371.396 839.74 370.996 839.436 370.476C839.14 369.956 838.992 369.348 838.992 368.652C838.992 367.964 839.144 367.36 839.448 366.84C839.752 366.312 840.168 365.908 840.696 365.628C841.224 365.348 841.816 365.208 842.472 365.208C843.128 365.208 843.72 365.348 844.248 365.628C844.776 365.908 845.192 366.312 845.496 366.84C845.8 367.36 845.952 367.964 845.952 368.652C845.952 369.34 845.796 369.948 845.484 370.476C845.18 370.996 844.76 371.396 844.224 371.676C843.696 371.956 843.104 372.096 842.448 372.096ZM842.448 370.32C842.84 370.32 843.172 370.176 843.444 369.888C843.724 369.6 843.864 369.188 843.864 368.652C843.864 368.116 843.728 367.704 843.456 367.416C843.192 367.128 842.864 366.984 842.472 366.984C842.072 366.984 841.74 367.128 841.476 367.416C841.212 367.696 841.08 368.108 841.08 368.652C841.08 369.188 841.208 369.6 841.464 369.888C841.728 370.176 842.056 370.32 842.448 370.32ZM849.093 366.252C849.293 365.94 849.569 365.688 849.921 365.496C850.273 365.304 850.685 365.208 851.157 365.208C851.709 365.208 852.209 365.348 852.657 365.628C853.105 365.908 853.457 366.308 853.713 366.828C853.977 367.348 854.109 367.952 854.109 368.64C854.109 369.328 853.977 369.936 853.713 370.464C853.457 370.984 853.105 371.388 852.657 371.676C852.209 371.956 851.709 372.096 851.157 372.096C850.693 372.096 850.281 372 849.921 371.808C849.569 371.616 849.293 371.368 849.093 371.064V375.192H847.041V365.304H849.093V366.252ZM852.021 368.64C852.021 368.128 851.877 367.728 851.589 367.44C851.309 367.144 850.961 366.996 850.545 366.996C850.137 366.996 849.789 367.144 849.501 367.44C849.221 367.736 849.081 368.14 849.081 368.652C849.081 369.164 849.221 369.568 849.501 369.864C849.789 370.16 850.137 370.308 850.545 370.308C850.953 370.308 851.301 370.16 851.589 369.864C851.877 369.56 852.021 369.152 852.021 368.64Z" fill="white"/>
<path d="M892.656 351.4V348.64L898.976 339.6H902.796V348.44H904.436V351.4H902.796V354H899.376V351.4H892.656ZM899.616 343.36L896.256 348.44H899.616V343.36ZM910.131 350.84L907.911 356.58H905.731L906.891 350.84H910.131ZM914.253 346.16C913 345.493 912.373 344.447 912.373 343.02C912.373 342.3 912.56 341.647 912.933 341.06C913.306 340.46 913.873 339.987 914.633 339.64C915.393 339.28 916.326 339.1 917.433 339.1C918.54 339.1 919.466 339.28 920.213 339.64C920.973 339.987 921.54 340.46 921.913 341.06C922.286 341.647 922.473 342.3 922.473 343.02C922.473 343.74 922.3 344.367 921.953 344.9C921.62 345.433 921.166 345.853 920.593 346.16C921.313 346.507 921.866 346.987 922.253 347.6C922.64 348.2 922.833 348.907 922.833 349.72C922.833 350.667 922.593 351.487 922.113 352.18C921.633 352.86 920.98 353.38 920.153 353.74C919.34 354.1 918.433 354.28 917.433 354.28C916.433 354.28 915.52 354.1 914.693 353.74C913.88 353.38 913.233 352.86 912.753 352.18C912.273 351.487 912.033 350.667 912.033 349.72C912.033 348.893 912.226 348.18 912.613 347.58C913 346.967 913.546 346.493 914.253 346.16ZM919.153 343.54C919.153 342.993 918.993 342.573 918.673 342.28C918.366 341.973 917.953 341.82 917.433 341.82C916.913 341.82 916.493 341.973 916.173 342.28C915.866 342.587 915.713 343.013 915.713 343.56C915.713 344.08 915.873 344.493 916.193 344.8C916.513 345.093 916.926 345.24 917.433 345.24C917.94 345.24 918.353 345.087 918.673 344.78C918.993 344.473 919.153 344.06 919.153 343.54ZM917.433 347.64C916.806 347.64 916.3 347.813 915.913 348.16C915.526 348.493 915.333 348.96 915.333 349.56C915.333 350.12 915.52 350.58 915.893 350.94C916.28 351.3 916.793 351.48 917.433 351.48C918.073 351.48 918.573 351.3 918.933 350.94C919.306 350.58 919.493 350.12 919.493 349.56C919.493 348.973 919.3 348.507 918.913 348.16C918.54 347.813 918.046 347.64 917.433 347.64ZM924.542 343.08C924.542 342 924.849 341.167 925.462 340.58C926.089 339.993 926.895 339.7 927.882 339.7C928.869 339.7 929.669 339.993 930.282 340.58C930.895 341.167 931.202 342 931.202 343.08C931.202 344.16 930.895 344.993 930.282 345.58C929.669 346.167 928.869 346.46 927.882 346.46C926.895 346.46 926.089 346.167 925.462 345.58C924.849 344.993 924.542 344.16 924.542 343.08ZM938.122 339.92L930.422 354H927.122L934.822 339.92H938.122ZM927.862 341.7C927.222 341.7 926.902 342.16 926.902 343.08C926.902 343.987 927.222 344.44 927.862 344.44C928.169 344.44 928.409 344.327 928.582 344.1C928.755 343.873 928.842 343.533 928.842 343.08C928.842 342.16 928.515 341.7 927.862 341.7ZM934.062 350.84C934.062 349.76 934.369 348.927 934.982 348.34C935.595 347.753 936.395 347.46 937.382 347.46C938.369 347.46 939.169 347.753 939.782 348.34C940.395 348.927 940.702 349.76 940.702 350.84C940.702 351.92 940.395 352.753 939.782 353.34C939.169 353.927 938.369 354.22 937.382 354.22C936.395 354.22 935.595 353.927 934.982 353.34C934.369 352.753 934.062 351.92 934.062 350.84ZM937.362 349.46C937.055 349.46 936.815 349.573 936.642 349.8C936.482 350.027 936.402 350.373 936.402 350.84C936.402 351.747 936.722 352.2 937.362 352.2C937.669 352.2 937.909 352.087 938.082 351.86C938.255 351.633 938.342 351.293 938.342 350.84C938.342 350.387 938.255 350.047 938.082 349.82C937.909 349.58 937.669 349.46 937.362 349.46Z" fill="white"/>
<path d="M903.71 363.576V365.22H901.478V372H899.426V365.22H897.194V363.576H903.71ZM904.332 368.64C904.332 367.952 904.46 367.348 904.716 366.828C904.98 366.308 905.336 365.908 905.784 365.628C906.232 365.348 906.732 365.208 907.284 365.208C907.756 365.208 908.168 365.304 908.52 365.496C908.88 365.688 909.156 365.94 909.348 366.252V365.304H911.4V372H909.348V371.052C909.148 371.364 908.868 371.616 908.508 371.808C908.156 372 907.744 372.096 907.272 372.096C906.728 372.096 906.232 371.956 905.784 371.676C905.336 371.388 904.98 370.984 904.716 370.464C904.46 369.936 904.332 369.328 904.332 368.64ZM909.348 368.652C909.348 368.14 909.204 367.736 908.916 367.44C908.636 367.144 908.292 366.996 907.884 366.996C907.476 366.996 907.128 367.144 906.84 367.44C906.56 367.728 906.42 368.128 906.42 368.64C906.42 369.152 906.56 369.56 906.84 369.864C907.128 370.16 907.476 370.308 907.884 370.308C908.292 370.308 908.636 370.16 908.916 369.864C909.204 369.568 909.348 369.164 909.348 368.652ZM914.937 366.252C915.129 365.94 915.405 365.688 915.765 365.496C916.125 365.304 916.537 365.208 917.001 365.208C917.553 365.208 918.053 365.348 918.501 365.628C918.949 365.908 919.301 366.308 919.557 366.828C919.821 367.348 919.953 367.952 919.953 368.64C919.953 369.328 919.821 369.936 919.557 370.464C919.301 370.984 918.949 371.388 918.501 371.676C918.053 371.956 917.553 372.096 917.001 372.096C916.529 372.096 916.117 372.004 915.765 371.82C915.413 371.628 915.137 371.376 914.937 371.064V372H912.885V363.12H914.937V366.252ZM917.865 368.64C917.865 368.128 917.721 367.728 917.433 367.44C917.153 367.144 916.805 366.996 916.389 366.996C915.981 366.996 915.633 367.144 915.345 367.44C915.065 367.736 914.925 368.14 914.925 368.652C914.925 369.164 915.065 369.568 915.345 369.864C915.633 370.16 915.981 370.308 916.389 370.308C916.797 370.308 917.145 370.16 917.433 369.864C917.721 369.56 917.865 369.152 917.865 368.64ZM923.081 363.12V372H921.029V363.12H923.081ZM930.88 368.544C930.88 368.736 930.868 368.936 930.844 369.144H926.2C926.232 369.56 926.364 369.88 926.596 370.104C926.836 370.32 927.128 370.428 927.472 370.428C927.984 370.428 928.34 370.212 928.54 369.78H930.724C930.612 370.22 930.408 370.616 930.112 370.968C929.824 371.32 929.46 371.596 929.02 371.796C928.58 371.996 928.088 372.096 927.544 372.096C926.888 372.096 926.304 371.956 925.792 371.676C925.28 371.396 924.88 370.996 924.592 370.476C924.304 369.956 924.16 369.348 924.16 368.652C924.16 367.956 924.3 367.348 924.58 366.828C924.868 366.308 925.268 365.908 925.78 365.628C926.292 365.348 926.88 365.208 927.544 365.208C928.192 365.208 928.768 365.344 929.272 365.616C929.776 365.888 930.168 366.276 930.448 366.78C930.736 367.284 930.88 367.872 930.88 368.544ZM928.78 368.004C928.78 367.652 928.66 367.372 928.42 367.164C928.18 366.956 927.88 366.852 927.52 366.852C927.176 366.852 926.884 366.952 926.644 367.152C926.412 367.352 926.268 367.636 926.212 368.004H928.78ZM935.695 370.26V372H934.651C933.907 372 933.327 371.82 932.911 371.46C932.495 371.092 932.287 370.496 932.287 369.672V367.008H931.471V365.304H932.287V363.672H934.339V365.304H935.683V367.008H934.339V369.696C934.339 369.896 934.387 370.04 934.483 370.128C934.579 370.216 934.739 370.26 934.963 370.26H935.695Z" fill="white"/>
<path d="M211.482 181H205.852V180.162L208.107 177.895C208.795 177.199 209.248 176.703 209.467 176.406C209.686 176.109 209.85 175.82 209.959 175.539C210.068 175.258 210.123 174.955 210.123 174.631C210.123 174.174 209.984 173.812 209.707 173.547C209.43 173.277 209.045 173.143 208.553 173.143C208.197 173.143 207.859 173.201 207.539 173.318C207.223 173.436 206.869 173.648 206.479 173.957L205.963 173.295C206.752 172.639 207.611 172.311 208.541 172.311C209.346 172.311 209.977 172.518 210.434 172.932C210.891 173.342 211.119 173.895 211.119 174.59C211.119 175.133 210.967 175.67 210.662 176.201C210.357 176.732 209.787 177.404 208.951 178.217L207.076 180.051V180.098H211.482V181ZM218.396 176.705C218.396 178.186 218.162 179.291 217.693 180.021C217.229 180.752 216.516 181.117 215.555 181.117C214.633 181.117 213.932 180.744 213.451 179.998C212.971 179.248 212.73 178.15 212.73 176.705C212.73 175.213 212.963 174.105 213.428 173.383C213.893 172.66 214.602 172.299 215.555 172.299C216.484 172.299 217.189 172.676 217.67 173.43C218.154 174.184 218.396 175.275 218.396 176.705ZM213.715 176.705C213.715 177.951 213.861 178.859 214.154 179.43C214.447 179.996 214.914 180.279 215.555 180.279C216.203 180.279 216.672 179.992 216.961 179.418C217.254 178.84 217.4 177.936 217.4 176.705C217.4 175.475 217.254 174.574 216.961 174.004C216.672 173.43 216.203 173.143 215.555 173.143C214.914 173.143 214.447 173.426 214.154 173.992C213.861 174.555 213.715 175.459 213.715 176.705ZM223.189 181H222.24V174.895C222.24 174.387 222.256 173.906 222.287 173.453C222.205 173.535 222.113 173.621 222.012 173.711C221.91 173.801 221.445 174.182 220.617 174.854L220.102 174.186L222.369 172.434H223.189V181ZM232.084 176.09C232.084 179.441 230.787 181.117 228.193 181.117C227.74 181.117 227.381 181.078 227.115 181V180.162C227.428 180.264 227.783 180.314 228.182 180.314C229.119 180.314 229.826 180.025 230.303 179.447C230.783 178.865 231.045 177.975 231.088 176.775H231.018C230.803 177.1 230.518 177.348 230.162 177.52C229.807 177.688 229.406 177.771 228.961 177.771C228.203 177.771 227.602 177.545 227.156 177.092C226.711 176.639 226.488 176.006 226.488 175.193C226.488 174.303 226.736 173.6 227.232 173.084C227.732 172.568 228.389 172.311 229.201 172.311C229.783 172.311 230.291 172.461 230.725 172.762C231.162 173.059 231.498 173.494 231.732 174.068C231.967 174.639 232.084 175.312 232.084 176.09ZM229.201 173.143C228.643 173.143 228.211 173.322 227.906 173.682C227.602 174.041 227.449 174.541 227.449 175.182C227.449 175.744 227.59 176.188 227.871 176.512C228.152 176.832 228.58 176.992 229.154 176.992C229.51 176.992 229.836 176.92 230.133 176.775C230.434 176.631 230.67 176.434 230.842 176.184C231.014 175.934 231.1 175.672 231.1 175.398C231.1 174.988 231.02 174.609 230.859 174.262C230.699 173.914 230.475 173.641 230.186 173.441C229.9 173.242 229.572 173.143 229.201 173.143Z" fill="#5481DC"/>
<path d="M571.482 181H565.852V180.162L568.107 177.895C568.795 177.199 569.248 176.703 569.467 176.406C569.686 176.109 569.85 175.82 569.959 175.539C570.068 175.258 570.123 174.955 570.123 174.631C570.123 174.174 569.984 173.812 569.707 173.547C569.43 173.277 569.045 173.143 568.553 173.143C568.197 173.143 567.859 173.201 567.539 173.318C567.223 173.436 566.869 173.648 566.479 173.957L565.963 173.295C566.752 172.639 567.611 172.311 568.541 172.311C569.346 172.311 569.977 172.518 570.434 172.932C570.891 173.342 571.119 173.895 571.119 174.59C571.119 175.133 570.967 175.67 570.662 176.201C570.357 176.732 569.787 177.404 568.951 178.217L567.076 180.051V180.098H571.482V181ZM578.396 176.705C578.396 178.186 578.162 179.291 577.693 180.021C577.229 180.752 576.516 181.117 575.555 181.117C574.633 181.117 573.932 180.744 573.451 179.998C572.971 179.248 572.73 178.15 572.73 176.705C572.73 175.213 572.963 174.105 573.428 173.383C573.893 172.66 574.602 172.299 575.555 172.299C576.484 172.299 577.189 172.676 577.67 173.43C578.154 174.184 578.396 175.275 578.396 176.705ZM573.715 176.705C573.715 177.951 573.861 178.859 574.154 179.43C574.447 179.996 574.914 180.279 575.555 180.279C576.203 180.279 576.672 179.992 576.961 179.418C577.254 178.84 577.4 177.936 577.4 176.705C577.4 175.475 577.254 174.574 576.961 174.004C576.672 173.43 576.203 173.143 575.555 173.143C574.914 173.143 574.447 173.426 574.154 173.992C573.861 174.555 573.715 175.459 573.715 176.705ZM585.217 181H579.586V180.162L581.842 177.895C582.529 177.199 582.982 176.703 583.201 176.406C583.42 176.109 583.584 175.82 583.693 175.539C583.803 175.258 583.857 174.955 583.857 174.631C583.857 174.174 583.719 173.812 583.441 173.547C583.164 173.277 582.779 173.143 582.287 173.143C581.932 173.143 581.594 173.201 581.273 173.318C580.957 173.436 580.604 173.648 580.213 173.957L579.697 173.295C580.486 172.639 581.346 172.311 582.275 172.311C583.08 172.311 583.711 172.518 584.168 172.932C584.625 173.342 584.854 173.895 584.854 174.59C584.854 175.133 584.701 175.67 584.396 176.201C584.092 176.732 583.521 177.404 582.686 178.217L580.811 180.051V180.098H585.217V181ZM592.131 176.705C592.131 178.186 591.896 179.291 591.428 180.021C590.963 180.752 590.25 181.117 589.289 181.117C588.367 181.117 587.666 180.744 587.186 179.998C586.705 179.248 586.465 178.15 586.465 176.705C586.465 175.213 586.697 174.105 587.162 173.383C587.627 172.66 588.336 172.299 589.289 172.299C590.219 172.299 590.924 172.676 591.404 173.43C591.889 174.184 592.131 175.275 592.131 176.705ZM587.449 176.705C587.449 177.951 587.596 178.859 587.889 179.43C588.182 179.996 588.648 180.279 589.289 180.279C589.938 180.279 590.406 179.992 590.695 179.418C590.988 178.84 591.135 177.936 591.135 176.705C591.135 175.475 590.988 174.574 590.695 174.004C590.406 173.43 589.938 173.143 589.289 173.143C588.648 173.143 588.182 173.426 587.889 173.992C587.596 174.555 587.449 175.459 587.449 176.705Z" fill="#5481DC"/>
<path d="M933.482 181H927.852V180.162L930.107 177.895C930.795 177.199 931.248 176.703 931.467 176.406C931.686 176.109 931.85 175.82 931.959 175.539C932.068 175.258 932.123 174.955 932.123 174.631C932.123 174.174 931.984 173.812 931.707 173.547C931.43 173.277 931.045 173.143 930.553 173.143C930.197 173.143 929.859 173.201 929.539 173.318C929.223 173.436 928.869 173.648 928.479 173.957L927.963 173.295C928.752 172.639 929.611 172.311 930.541 172.311C931.346 172.311 931.977 172.518 932.434 172.932C932.891 173.342 933.119 173.895 933.119 174.59C933.119 175.133 932.967 175.67 932.662 176.201C932.357 176.732 931.787 177.404 930.951 178.217L929.076 180.051V180.098H933.482V181ZM940.396 176.705C940.396 178.186 940.162 179.291 939.693 180.021C939.229 180.752 938.516 181.117 937.555 181.117C936.633 181.117 935.932 180.744 935.451 179.998C934.971 179.248 934.73 178.15 934.73 176.705C934.73 175.213 934.963 174.105 935.428 173.383C935.893 172.66 936.602 172.299 937.555 172.299C938.484 172.299 939.189 172.676 939.67 173.43C940.154 174.184 940.396 175.275 940.396 176.705ZM935.715 176.705C935.715 177.951 935.861 178.859 936.154 179.43C936.447 179.996 936.914 180.279 937.555 180.279C938.203 180.279 938.672 179.992 938.961 179.418C939.254 178.84 939.4 177.936 939.4 176.705C939.4 175.475 939.254 174.574 938.961 174.004C938.672 173.43 938.203 173.143 937.555 173.143C936.914 173.143 936.447 173.426 936.154 173.992C935.861 174.555 935.715 175.459 935.715 176.705ZM947.217 181H941.586V180.162L943.842 177.895C944.529 177.199 944.982 176.703 945.201 176.406C945.42 176.109 945.584 175.82 945.693 175.539C945.803 175.258 945.857 174.955 945.857 174.631C945.857 174.174 945.719 173.812 945.441 173.547C945.164 173.277 944.779 173.143 944.287 173.143C943.932 173.143 943.594 173.201 943.273 173.318C942.957 173.436 942.604 173.648 942.213 173.957L941.697 173.295C942.486 172.639 943.346 172.311 944.275 172.311C945.08 172.311 945.711 172.518 946.168 172.932C946.625 173.342 946.854 173.895 946.854 174.59C946.854 175.133 946.701 175.67 946.396 176.201C946.092 176.732 945.521 177.404 944.686 178.217L942.811 180.051V180.098H947.217V181ZM952.057 181H951.107V174.895C951.107 174.387 951.123 173.906 951.154 173.453C951.072 173.535 950.98 173.621 950.879 173.711C950.777 173.801 950.312 174.182 949.484 174.854L948.969 174.186L951.236 172.434H952.057V181Z" fill="#5481DC"/>
</svg>
