<svg width="112" height="104" viewBox="0 0 112 104" fill="none" xmlns="http://www.w3.org/2000/svg">
<circle cx="40" cy="40" r="40" fill="#F7F3F4"/>
<path d="M46 29C46 24.0294 41.9706 20 37 20C32.0294 20 28 24.0294 28 29C28 33.9706 32.0294 38 37 38C41.9706 38 46 33.9706 46 29Z" stroke="#8E0A3F" stroke-width="3" stroke-miterlimit="10"/>
<path d="M46 91C46 86.0294 41.9706 82 37 82C32.0294 82 28 86.0294 28 91C28 95.9706 32.0294 100 37 100C41.9706 100 46 95.9706 46 91Z" stroke="#8E0A3F" stroke-width="3" stroke-miterlimit="10"/>
<path d="M108 29C108 24.0294 103.971 20 99 20C94.0294 20 90 24.0294 90 29C90 33.9706 94.0294 38 99 38C103.971 38 108 33.9706 108 29Z" stroke="#8E0A3F" stroke-width="3" stroke-miterlimit="10"/>
<path d="M37 37.5V81.5" stroke="#8E0A3F" stroke-width="3" stroke-miterlimit="10"/>
<path d="M46 29H90" stroke="#8E0A3F" stroke-width="3" stroke-miterlimit="10"/>
<path d="M46 91H60" stroke="#8E0A3F" stroke-width="3" stroke-miterlimit="10"/>
<path d="M101 50H49V62H101V50Z" fill="#8E0A3F"/>
<path d="M69 50V100H81V50H69Z" fill="#8E0A3F"/>
<path d="M99 38V44" stroke="#8E0A3F" stroke-width="3" stroke-miterlimit="10"/>
</svg>
