<svg width="112" height="104" viewBox="0 0 112 104" fill="none" xmlns="http://www.w3.org/2000/svg">
<rect width="80" height="80" fill="#F7F3F4"/>
<path d="M57.96 92.0391C60.1691 92.0391 61.96 90.2482 61.96 88.0391C61.96 85.8299 60.1691 84.0391 57.96 84.0391C55.7508 84.0391 53.96 85.8299 53.96 88.0391C53.96 90.2482 55.7508 92.0391 57.96 92.0391Z" stroke="#FF6C00" stroke-width="3" stroke-miterlimit="10"/>
<path d="M78.04 92.0391C80.2492 92.0391 82.04 90.2482 82.04 88.0391C82.04 85.8299 80.2492 84.0391 78.04 84.0391C75.8309 84.0391 74.04 85.8299 74.04 88.0391C74.04 90.2482 75.8309 92.0391 78.04 92.0391Z" stroke="#FF6C00" stroke-width="3" stroke-miterlimit="10"/>
<path d="M28 36H108" stroke="#FF6C00" stroke-width="3" stroke-miterlimit="10"/>
<path d="M34.0701 28H37.0701" stroke="#FF6C00" stroke-width="3" stroke-miterlimit="10"/>
<path d="M41.03 28H44.03" stroke="#FF6C00" stroke-width="3" stroke-miterlimit="10"/>
<path d="M48 28H51" stroke="#FF6C00" stroke-width="3" stroke-miterlimit="10"/>
<path d="M82 78H54L46 44H35.5" stroke="#FF6C00" stroke-width="3" stroke-miterlimit="10"/>
<path d="M98 20H108V100H28V20H80.83" stroke="#FF6C00" stroke-width="3" stroke-miterlimit="10"/>
<path d="M88.5 72H58.5L53 48H94.5L88.5 72Z" fill="#FF6C00"/>
</svg>
