<svg width="112" height="104" viewBox="0 0 112 104" fill="none" xmlns="http://www.w3.org/2000/svg">
<rect width="80" height="80" fill="#F7F3F4"/>
<path d="M44 88H28V20H80.83" stroke="#8E0A3F" stroke-width="3" stroke-miterlimit="10"/>
<path d="M98 20H108V88H80" stroke="#8E0A3F" stroke-width="3" stroke-miterlimit="10"/>
<path d="M28 36H108" stroke="#8E0A3F" stroke-width="3" stroke-miterlimit="10"/>
<path d="M34.07 28H37.07" stroke="#8E0A3F" stroke-width="3" stroke-miterlimit="10"/>
<path d="M41.03 28H44.03" stroke="#8E0A3F" stroke-width="3" stroke-miterlimit="10"/>
<path d="M48 28H51" stroke="#8E0A3F" stroke-width="3" stroke-miterlimit="10"/>
<path d="M101 61H51V81H101V61Z" fill="#8E0A3F"/>
<path d="M80 55.67V46H44V100H58.83H70H80V86.59" stroke="#8E0A3F" stroke-width="3" stroke-miterlimit="10"/>
<path d="M52 46L56 54H68L72 46" stroke="#8E0A3F" stroke-width="3" stroke-miterlimit="10"/>
</svg>
