<svg width="112" height="104" viewBox="0 0 112 104" fill="none" xmlns="http://www.w3.org/2000/svg">
<rect width="80" height="80" fill="#F7F3F4"/>
<g clip-path="url(#clip0_2722_4754)">
<g clip-path="url(#clip1_2722_4754)">
<path d="M98 20H108V100H28V20H80.83" stroke="#0254A6" stroke-width="3" stroke-miterlimit="10"/>
<path d="M60 46.5H76C87.8741 46.5 97.5 56.1259 97.5 68C97.5 79.8741 87.8741 89.5 76 89.5H60C48.1259 89.5 38.5 79.8741 38.5 68C38.5 56.1259 48.1259 46.5 60 46.5Z" fill="#0254A6" stroke="#0254A6"/>
<path d="M28 36H108" stroke="#0254A6" stroke-width="3" stroke-miterlimit="10"/>
<path d="M34.0699 28H37.0699" stroke="#0254A6" stroke-width="3" stroke-miterlimit="10"/>
<path d="M41.03 28H44.03" stroke="#0254A6" stroke-width="3" stroke-miterlimit="10"/>
<path d="M48 28H51" stroke="#0254A6" stroke-width="3" stroke-miterlimit="10"/>
<path d="M64 68C64 74.63 69.37 80 76 80H78C84.63 80 90 74.63 90 68C90 61.37 84.63 56 78 56H71.5" stroke="white" stroke-width="3" stroke-miterlimit="10"/>
<path d="M72 68C72 61.37 66.63 56 60 56H58C51.37 56 46 61.37 46 68C46 74.63 51.37 80 58 80H64" stroke="white" stroke-width="3" stroke-miterlimit="10"/>
</g>
</g>
<defs>
<clipPath id="clip0_2722_4754">
<rect width="88" height="88" fill="white" transform="translate(24 16)"/>
</clipPath>
<clipPath id="clip1_2722_4754">
<rect width="88" height="88" fill="white" transform="translate(24 16)"/>
</clipPath>
</defs>
</svg>
