<svg width="112" height="104" viewBox="0 0 112 104" fill="none" xmlns="http://www.w3.org/2000/svg">
<rect width="80" height="80" fill="#F7F3F4"/>
<path d="M98 20H108V100H28V20H80.8" stroke="#09223D" stroke-width="3" stroke-miterlimit="10"/>
<path d="M76 90H60C47.8 90 38 80.2 38 68C38 55.8 47.8 46 60 46H76C88.2 46 98 55.8 98 68C98 80.2 88.2 90 76 90Z" fill="#09223D"/>
<path d="M28 36H108" stroke="#09223D" stroke-width="3" stroke-miterlimit="10"/>
<path d="M58 80L46 68L58 56" stroke="white" stroke-width="3" stroke-miterlimit="10"/>
<path d="M78 80L90 68L78 56" stroke="white" stroke-width="3" stroke-miterlimit="10"/>
<path d="M72 56L64 80" stroke="white" stroke-width="3" stroke-miterlimit="10"/>
<path d="M34.1 28H37.1" stroke="#09223D" stroke-width="3" stroke-miterlimit="10"/>
<path d="M41 28H44" stroke="#09223D" stroke-width="3" stroke-miterlimit="10"/>
<path d="M48 28H51" stroke="#09223D" stroke-width="3" stroke-miterlimit="10"/>
</svg>
