{
  "results": [
    {
      "nombre_negocio_proveedor": "ENB COMPANY",
      "nombre_proveedor": "Mauricio Duran",
      "tipo_documento_proveedor": "RUC",
      "numero_documento_proveedor": "20606789468",
      "fecha_servicio": "2022-01-10",
      "fecha_inicio_servicio": "2022-01-10",
      "hora_inicio_servicio": "09:43:15 am",
      "fecha_servicio_completado": "2022-01-10",
      "hora_servicio_completado": "11:43:15 am",
      "fecha_cancelacion": "",
      "hora_cancelacion": "",
      "lugar_servicio": "Mercurio 7575, Cercado de Lima 15302, Perú",
      "ciudad_servicio": "Provincia de Lima, Cercado de Lima",
      "servicio_contratado": "Limpieza",
      "total_pagado": 24,
      "nombre_consumidor": "angel velazquez Velazquez",
      "email_consumidor": "teodrum64@gmail.com",
      "puntaje_trabajador": 5
    },
    {
      "nombre_negocio_proveedor": "Oliverio's",
      "nombre_proveedor": "Oliverio Cuyo Quispe",
      "tipo_documento_proveedor": "DNI",
      "numero_documento_proveedor": "74546214",
      "fecha_servicio": "2022-01-11",
      "fecha_inicio_servicio": "2022-01-11",
      "hora_inicio_servicio": "07:43:15 am",
      "fecha_servicio_completado": "2022-01-11",
      "hora_servicio_completado": "10:43:15 am",
      "fecha_cancelacion": "",
      "hora_cancelacion": "",
      "lugar_servicio": "Mercurio 7574, Los Olivos 15302, Perú",
      "ciudad_servicio": "Provincia de Lima, Los Olivos",
      "servicio_contratado": "Gasfitería",
      "total_pagado": 18,
      "nombre_consumidor": "Angel Velazquez Velazquez ",
      "email_consumidor": "avelazquez0702@gmail.com",
      "puntaje_trabajador": 1
    },
    {
      "nombre_negocio_proveedor": "Angel Velazquez Rey",
      "nombre_proveedor": "Angel Velazquez Rey",
      "tipo_documento_proveedor": "DNI",
      "numero_documento_proveedor": "74077477",
      "fecha_servicio": "2022-01-10",
      "fecha_inicio_servicio": "",
      "hora_inicio_servicio": "",
      "fecha_servicio_completado": "",
      "hora_servicio_completado": "",
      "fecha_cancelacion": "2022-01-10",
      "hora_cancelacion": "09:43:15 am",
      "lugar_servicio": "Mercurio 7574, Los Olivos 15302, Perú",
      "ciudad_servicio": "Provincia de Lima, Los Olivos",
      "servicio_contratado": "Electricidad",
      "total_pagado": 13,
      "nombre_consumidor": "Angel Velazquez Velazquez ",
      "email_consumidor": "avelazquez0702@gmail.com"
    },
    {
      "nombre_negocio_proveedor": "Angel Velazquez Rey",
      "nombre_proveedor": "Angel Velazquez Rey",
      "tipo_documento_proveedor": "DNI",
      "numero_documento_proveedor": "74077477",
      "fecha_servicio": "2021-12-14",
      "fecha_inicio_servicio": "",
      "hora_inicio_servicio": "",
      "fecha_servicio_completado": "",
      "hora_servicio_completado": "",
      "fecha_cancelacion": "2021-12-14",
      "hora_cancelacion": "09:54:14 pm",
      "lugar_servicio": "Jr. Bacilio Ramirez Peña No 316, San Martín de Porres 15103, Perú",
      "ciudad_servicio": "Provincia de Lima, San Martín de Porres",
      "servicio_contratado": "Limpieza",
      "total_pagado": 12,
      "nombre_consumidor": "Diego  Rey",
      "email_consumidor": "diego29097@gmail.com"
    },
    {
      "nombre_negocio_proveedor": "Oliverio's",
      "nombre_proveedor": "Oliverio Cuyo Quispe",
      "tipo_documento_proveedor": "DNI",
      "numero_documento_proveedor": "74546214",
      "fecha_servicio": "2021-12-15",
      "fecha_inicio_servicio": "",
      "hora_inicio_servicio": "",
      "fecha_servicio_completado": "",
      "hora_servicio_completado": "",
      "fecha_cancelacion": "2021-12-15",
      "hora_cancelacion": "09:56:17 pm",
      "lugar_servicio": "Jr. Bacilio Ramirez Peña No 316, San Martín de Porres 15103, Perú",
      "ciudad_servicio": "Provincia de Lima, San Martín de Porres",
      "servicio_contratado": "Limpieza",
      "total_pagado": 12,
      "nombre_consumidor": "Diego  Rey",
      "email_consumidor": "diego29097@gmail.com"
    },
    {
      "nombre_negocio_proveedor": "Angel Velazquez Rey",
      "nombre_proveedor": "Angel Velazquez Rey",
      "tipo_documento_proveedor": "DNI",
      "numero_documento_proveedor": "74077477",
      "fecha_servicio": "2022-01-10",
      "fecha_inicio_servicio": "",
      "hora_inicio_servicio": "",
      "fecha_servicio_completado": "",
      "hora_servicio_completado": "",
      "fecha_cancelacion": "2022-01-10",
      "hora_cancelacion": "09:43:15 am",
      "lugar_servicio": "Jr. Bacilio Ramirez Peña No 316, San Martín de Porres 15103, Peru",
      "ciudad_servicio": "Provincia de Lima, San Martín de Porres",
      "servicio_contratado": "Gasfitería",
      "total_pagado": 16,
      "nombre_consumidor": "Walter Rey",
      "email_consumidor": "wallyreyc2229@gmail.com",
      "puntaje_trabajador": 4
    },
    {
      "nombre_negocio_proveedor": "Mr clean",
      "nombre_proveedor": "Diego Pacheco",
      "tipo_documento_proveedor": "DNI",
      "numero_documento_proveedor": "77777775",
      "fecha_servicio": "2022-01-10",
      "fecha_inicio_servicio": "",
      "hora_inicio_servicio": "",
      "fecha_servicio_completado": "",
      "hora_servicio_completado": "",
      "fecha_cancelacion": "2022-01-10",
      "hora_cancelacion": "09:43:15 am",
      "lugar_servicio": "Av. Alfredo Benavides 540, Miraflores 15074, Perú",
      "ciudad_servicio": "Provincia de Lima, Miraflores",
      "servicio_contratado": "Limpieza",
      "nombre_consumidor": "Alfredo  Cautin",
      "email_consumidor": "alfredo.cautin@icloud.com"
    },
    {
      "nombre_negocio_proveedor": "Pizza Deliciosa",
      "nombre_proveedor": "Angel Rodriguez",
      "tipo_documento_proveedor": "DNI",
      "numero_documento_proveedor": "77777777",
      "fecha_servicio": "2022-01-10",
      "fecha_inicio_servicio": "",
      "hora_inicio_servicio": "",
      "fecha_servicio_completado": "",
      "hora_servicio_completado": "",
      "fecha_cancelacion": "2022-01-10",
      "hora_cancelacion": "09:43:15 am",
      "lugar_servicio": "Av. Alfredo Benavides 540, Miraflores 15074, Perú",
      "ciudad_servicio": "Provincia de Lima, Miraflores",
      "servicio_contratado": "Limpieza",
      "nombre_consumidor": "Alfredo  Cautin",
      "email_consumidor": "alfredo.cautin@icloud.com"
    },
    {
      "nombre_negocio_proveedor": "ENB COMPANY",
      "nombre_proveedor": "Mauricio Duran",
      "tipo_documento_proveedor": "RUC",
      "numero_documento_proveedor": "20606789468",
      "fecha_servicio": "2021-12-15",
      "fecha_inicio_servicio": "",
      "hora_inicio_servicio": "",
      "fecha_servicio_completado": "",
      "hora_servicio_completado": "",
      "fecha_cancelacion": "2021-12-15",
      "hora_cancelacion": "10:23:17 am",
      "lugar_servicio": "Mercurio 7575, Cercado de Lima 15302, Perú",
      "ciudad_servicio": "Provincia de Lima, Cercado de Lima",
      "servicio_contratado": "Electricidad",
      "total_pagado": 13,
      "nombre_consumidor": "angel velazquez Velazquez",
      "email_consumidor": "teodrum64@gmail.com"
    },
    {
      "nombre_negocio_proveedor": "Angel Velazquez Rey",
      "nombre_proveedor": "Angel Velazquez Rey",
      "tipo_documento_proveedor": "DNI",
      "numero_documento_proveedor": "74077477",
      "fecha_servicio": "2021-12-16",
      "fecha_inicio_servicio": "",
      "hora_inicio_servicio": "",
      "fecha_servicio_completado": "",
      "hora_servicio_completado": "",
      "fecha_cancelacion": "2021-12-16",
      "hora_cancelacion": "10:41:48 am",
      "lugar_servicio": "Avenida Canta Callao S/N, San Martín de Porres 15112, Peru",
      "ciudad_servicio": "Provincia de Lima, San Martín de Porres",
      "servicio_contratado": "Limpieza",
      "total_pagado": 13,
      "nombre_consumidor": "Junito Pérez",
      "email_consumidor": "alexis.arecochea03@gmail.com"
    },
    {
      "nombre_negocio_proveedor": "Oliverio's",
      "nombre_proveedor": "Oliverio Cuyo Quispe",
      "tipo_documento_proveedor": "DNI",
      "numero_documento_proveedor": "74546214",
      "fecha_servicio": "2021-12-16",
      "fecha_inicio_servicio": "",
      "hora_inicio_servicio": "",
      "fecha_servicio_completado": "",
      "hora_servicio_completado": "",
      "fecha_cancelacion": "2021-12-16",
      "hora_cancelacion": "10:51:10 am",
      "lugar_servicio": "Avenida Canta Callao S/N, San Martín de Porres 15112, Peru",
      "ciudad_servicio": "Provincia de Lima, San Martín de Porres",
      "servicio_contratado": "Electricidad",
      "total_pagado": 12,
      "nombre_consumidor": "Junito Pérez",
      "email_consumidor": "alexis.arecochea03@gmail.com"
    },
    {
      "nombre_negocio_proveedor": "Disney",
      "nombre_proveedor": "Juan Perez",
      "tipo_documento_proveedor": "DNI",
      "numero_documento_proveedor": "77889945",
      "fecha_servicio": "2021-12-17",
      "fecha_inicio_servicio": "",
      "hora_inicio_servicio": "",
      "fecha_servicio_completado": "",
      "hora_servicio_completado": "",
      "fecha_cancelacion": "2021-12-17",
      "hora_cancelacion": "08:44:59 pm",
      "lugar_servicio": "Avenida Canta Callao S/N, San Martín de Porres 15112, Peru",
      "ciudad_servicio": "Provincia de Lima, San Martín de Porres",
      "servicio_contratado": "Gasfitería",
      "total_pagado": 13,
      "nombre_consumidor": "Junito Pérez",
      "email_consumidor": "alexis.arecochea03@gmail.com"
    },
    {
      "nombre_negocio_proveedor": "Provider Test",
      "nombre_proveedor": "Provider Test",
      "tipo_documento_proveedor": "DNI",
      "numero_documento_proveedor": "78945612",
      "fecha_servicio": "2021-12-18",
      "fecha_inicio_servicio": "",
      "hora_inicio_servicio": "",
      "fecha_servicio_completado": "",
      "hora_servicio_completado": "",
      "fecha_cancelacion": "2021-12-18",
      "hora_cancelacion": "10:32:26 am",
      "lugar_servicio": "Av. José Carlos Mariátegui 2445, El Agustino 15006, Peru",
      "ciudad_servicio": "Provincia de Lima, El Agustino",
      "servicio_contratado": "Electricidad",
      "total_pagado": 24,
      "nombre_consumidor": "Max Collazos Collazos",
      "email_consumidor": "max.collazosm@gmail.com",
      "puntaje_trabajador": 4
    },
    {
      "nombre_negocio_proveedor": "Provider Test",
      "nombre_proveedor": "Provider Test",
      "tipo_documento_proveedor": "DNI",
      "numero_documento_proveedor": "78945612",
      "fecha_servicio": "2021-12-18",
      "fecha_inicio_servicio": "",
      "hora_inicio_servicio": "",
      "fecha_servicio_completado": "",
      "hora_servicio_completado": "",
      "fecha_cancelacion": "2021-12-18",
      "hora_cancelacion": "10:49:18 am",
      "lugar_servicio": "Av. José Carlos Mariátegui 2445, El Agustino 15006, Peru",
      "ciudad_servicio": "Provincia de Lima, El Agustino",
      "servicio_contratado": "Electricidad",
      "total_pagado": 24,
      "nombre_consumidor": "Max Collazos Collazos",
      "email_consumidor": "max.collazosm@gmail.com",
      "feedback_consumidor": "Ynnynynynyynyn",
      "puntaje_trabajador": 4
    },
    {
      "nombre_negocio_proveedor": "Provider Test",
      "nombre_proveedor": "Provider Test",
      "tipo_documento_proveedor": "DNI",
      "numero_documento_proveedor": "78945612",
      "fecha_servicio": "2021-12-18",
      "fecha_inicio_servicio": "",
      "hora_inicio_servicio": "",
      "fecha_servicio_completado": "",
      "hora_servicio_completado": "",
      "fecha_cancelacion": "2021-12-18",
      "hora_cancelacion": "10:52:02 am",
      "lugar_servicio": "Av. José Carlos Mariátegui 2445, El Agustino 15006, Peru",
      "ciudad_servicio": "Provincia de Lima, El Agustino",
      "servicio_contratado": "Reparación de electrodomésticos",
      "total_pagado": 24,
      "nombre_consumidor": "Max Collazos Collazos",
      "email_consumidor": "max.collazosm@gmail.com",
      "puntaje_trabajador": 5
    },
    {
      "nombre_negocio_proveedor": "Provider Test",
      "nombre_proveedor": "Provider Test",
      "tipo_documento_proveedor": "DNI",
      "numero_documento_proveedor": "78945612",
      "fecha_servicio": "2021-12-18",
      "fecha_inicio_servicio": "",
      "hora_inicio_servicio": "",
      "fecha_servicio_completado": "",
      "hora_servicio_completado": "",
      "fecha_cancelacion": "2021-12-18",
      "hora_cancelacion": "11:06:58 am",
      "lugar_servicio": "Av. José Carlos Mariátegui 2445, El Agustino 15006, Peru",
      "ciudad_servicio": "Provincia de Lima, El Agustino",
      "servicio_contratado": "Electricidad",
      "total_pagado": 30,
      "nombre_consumidor": "Max Collazos Collazos",
      "email_consumidor": "max.collazosm@gmail.com"
    },
    {
      "nombre_negocio_proveedor": "Provider Test",
      "nombre_proveedor": "Provider Test",
      "tipo_documento_proveedor": "DNI",
      "numero_documento_proveedor": "78945612",
      "fecha_servicio": "2021-12-18",
      "fecha_inicio_servicio": "",
      "hora_inicio_servicio": "",
      "fecha_servicio_completado": "",
      "hora_servicio_completado": "",
      "fecha_cancelacion": "2021-12-18",
      "hora_cancelacion": "11:09:32 am",
      "lugar_servicio": "Av. José Carlos Mariátegui 2445, El Agustino 15006, Peru",
      "ciudad_servicio": "Provincia de Lima, El Agustino",
      "servicio_contratado": "Reparación de electrodomésticos",
      "total_pagado": 30,
      "nombre_consumidor": "Max Collazos Collazos",
      "email_consumidor": "max.collazosm@gmail.com"
    },
    {
      "nombre_negocio_proveedor": "Provider Test",
      "nombre_proveedor": "Provider Test",
      "tipo_documento_proveedor": "DNI",
      "numero_documento_proveedor": "78945612",
      "fecha_servicio": "2021-12-18",
      "fecha_inicio_servicio": "",
      "hora_inicio_servicio": "",
      "fecha_servicio_completado": "",
      "hora_servicio_completado": "",
      "fecha_cancelacion": "2021-12-18",
      "hora_cancelacion": "11:11:21 am",
      "lugar_servicio": "Av. José Carlos Mariátegui 2445, El Agustino 15006, Peru",
      "ciudad_servicio": "Provincia de Lima, El Agustino",
      "servicio_contratado": "Electricidad",
      "total_pagado": 30,
      "nombre_consumidor": "Max Collazos Collazos",
      "email_consumidor": "max.collazosm@gmail.com"
    },
    {
      "nombre_negocio_proveedor": "Provider Test",
      "nombre_proveedor": "Provider Test",
      "tipo_documento_proveedor": "DNI",
      "numero_documento_proveedor": "78945612",
      "fecha_servicio": "2021-12-18",
      "fecha_inicio_servicio": "",
      "hora_inicio_servicio": "",
      "fecha_servicio_completado": "",
      "hora_servicio_completado": "",
      "fecha_cancelacion": "2021-12-18",
      "hora_cancelacion": "11:14:50 am",
      "lugar_servicio": "Av. José Carlos Mariátegui 2445, El Agustino 15006, Peru",
      "ciudad_servicio": "Provincia de Lima, El Agustino",
      "servicio_contratado": "Electricidad",
      "total_pagado": 67,
      "nombre_consumidor": "Max Collazos Collazos",
      "email_consumidor": "max.collazosm@gmail.com"
    },
    {
      "nombre_negocio_proveedor": "Provider Test",
      "nombre_proveedor": "Provider Test",
      "tipo_documento_proveedor": "DNI",
      "numero_documento_proveedor": "78945612",
      "fecha_servicio": "2021-12-18",
      "fecha_inicio_servicio": "",
      "hora_inicio_servicio": "",
      "fecha_servicio_completado": "",
      "hora_servicio_completado": "",
      "fecha_cancelacion": "2021-12-18",
      "hora_cancelacion": "11:17:32 am",
      "lugar_servicio": "Av. José Carlos Mariátegui 2445, El Agustino 15006, Peru",
      "ciudad_servicio": "Provincia de Lima, El Agustino",
      "servicio_contratado": "Electricidad",
      "total_pagado": 30,
      "nombre_consumidor": "Max Collazos Collazos",
      "email_consumidor": "max.collazosm@gmail.com"
    },
    {
      "nombre_negocio_proveedor": "Provider Test",
      "nombre_proveedor": "Provider Test",
      "tipo_documento_proveedor": "DNI",
      "numero_documento_proveedor": "78945612",
      "fecha_servicio": "2021-12-18",
      "fecha_inicio_servicio": "",
      "hora_inicio_servicio": "",
      "fecha_servicio_completado": "",
      "hora_servicio_completado": "",
      "fecha_cancelacion": "2021-12-18",
      "hora_cancelacion": "11:20:25 am",
      "lugar_servicio": "Av. José Carlos Mariátegui 2445, El Agustino 15006, Peru",
      "ciudad_servicio": "Provincia de Lima, El Agustino",
      "servicio_contratado": "Soporte técnico",
      "total_pagado": 30,
      "nombre_consumidor": "Max Collazos Collazos",
      "email_consumidor": "max.collazosm@gmail.com"
    },
    {
      "nombre_negocio_proveedor": "Provider Test",
      "nombre_proveedor": "Provider Test",
      "tipo_documento_proveedor": "DNI",
      "numero_documento_proveedor": "78945612",
      "fecha_servicio": "2021-12-18",
      "fecha_inicio_servicio": "",
      "hora_inicio_servicio": "",
      "fecha_servicio_completado": "",
      "hora_servicio_completado": "",
      "fecha_cancelacion": "2021-12-18",
      "hora_cancelacion": "12:02:16 pm",
      "lugar_servicio": "Av. José Carlos Mariátegui 2445, El Agustino 15006, Peru",
      "ciudad_servicio": "Provincia de Lima, El Agustino",
      "servicio_contratado": "Electricidad",
      "total_pagado": 69,
      "nombre_consumidor": "Max Collazos Collazos",
      "email_consumidor": "max.collazosm@gmail.com"
    },
    {
      "nombre_negocio_proveedor": "Provider Test",
      "nombre_proveedor": "Provider Test",
      "tipo_documento_proveedor": "DNI",
      "numero_documento_proveedor": "78945612",
      "fecha_servicio": "2021-12-18",
      "fecha_inicio_servicio": "",
      "hora_inicio_servicio": "",
      "fecha_servicio_completado": "",
      "hora_servicio_completado": "",
      "fecha_cancelacion": "2021-12-18",
      "hora_cancelacion": "12:13:14 pm",
      "lugar_servicio": "Av. José Carlos Mariátegui 2445, El Agustino 15006, Peru",
      "ciudad_servicio": "Provincia de Lima, El Agustino",
      "servicio_contratado": "Reparación de electrodomésticos",
      "total_pagado": 30,
      "nombre_consumidor": "Max Collazos Collazos",
      "email_consumidor": "max.collazosm@gmail.com",
      "feedback_consumidor": "Testing",
      "puntaje_trabajador": 5
    },
    {
      "nombre_negocio_proveedor": "Provider Test",
      "nombre_proveedor": "Provider Test",
      "tipo_documento_proveedor": "DNI",
      "numero_documento_proveedor": "78945612",
      "fecha_servicio": "2021-12-18",
      "fecha_inicio_servicio": "",
      "hora_inicio_servicio": "",
      "fecha_servicio_completado": "",
      "hora_servicio_completado": "",
      "fecha_cancelacion": "2021-12-18",
      "hora_cancelacion": "01:02:13 pm",
      "lugar_servicio": "Av. José Carlos Mariátegui 2445, El Agustino 15006, Peru",
      "ciudad_servicio": "Provincia de Lima, El Agustino",
      "servicio_contratado": "Reparación de electrodomésticos",
      "total_pagado": 30,
      "nombre_consumidor": "Max Collazos Collazos",
      "email_consumidor": "max.collazosm@gmail.com"
    },
    {
      "nombre_negocio_proveedor": "Provider Test",
      "nombre_proveedor": "Provider Test",
      "tipo_documento_proveedor": "DNI",
      "numero_documento_proveedor": "78945612",
      "fecha_servicio": "2021-12-18",
      "fecha_inicio_servicio": "",
      "hora_inicio_servicio": "",
      "fecha_servicio_completado": "",
      "hora_servicio_completado": "",
      "fecha_cancelacion": "2021-12-18",
      "hora_cancelacion": "01:23:51 pm",
      "lugar_servicio": "Av. José Carlos Mariátegui 2445, El Agustino 15006, Peru",
      "ciudad_servicio": "Provincia de Lima, El Agustino",
      "servicio_contratado": "Reparación de electrodomésticos",
      "total_pagado": 30,
      "nombre_consumidor": "Max Collazos Collazos",
      "email_consumidor": "max.collazosm@gmail.com"
    },
    {
      "nombre_negocio_proveedor": "Provider Test",
      "nombre_proveedor": "Provider Test",
      "tipo_documento_proveedor": "DNI",
      "numero_documento_proveedor": "78945612",
      "fecha_servicio": "2021-12-18",
      "fecha_inicio_servicio": "",
      "hora_inicio_servicio": "",
      "fecha_servicio_completado": "",
      "hora_servicio_completado": "",
      "fecha_cancelacion": "2021-12-18",
      "hora_cancelacion": "01:30:35 pm",
      "lugar_servicio": "Av. José Carlos Mariátegui 2445, El Agustino 15006, Peru",
      "ciudad_servicio": "Provincia de Lima, El Agustino",
      "servicio_contratado": "Electricidad",
      "total_pagado": 295,
      "nombre_consumidor": "Max Collazos Collazos",
      "email_consumidor": "max.collazosm@gmail.com"
    },
    {
      "nombre_negocio_proveedor": "Provider Test",
      "nombre_proveedor": "Provider Test",
      "tipo_documento_proveedor": "DNI",
      "numero_documento_proveedor": "78945612",
      "fecha_servicio": "2021-12-18",
      "fecha_inicio_servicio": "",
      "hora_inicio_servicio": "",
      "fecha_servicio_completado": "",
      "hora_servicio_completado": "",
      "fecha_cancelacion": "2021-12-18",
      "hora_cancelacion": "01:34:14 pm",
      "lugar_servicio": "Av. José Carlos Mariátegui 2445, El Agustino 15006, Peru",
      "ciudad_servicio": "Provincia de Lima, El Agustino",
      "servicio_contratado": "Electricidad",
      "total_pagado": 305,
      "nombre_consumidor": "Max Collazos Collazos",
      "email_consumidor": "max.collazosm@gmail.com"
    },
    {
      "nombre_negocio_proveedor": "Provider Test",
      "nombre_proveedor": "Provider Test",
      "tipo_documento_proveedor": "DNI",
      "numero_documento_proveedor": "78945612",
      "fecha_servicio": "2021-12-18",
      "fecha_inicio_servicio": "",
      "hora_inicio_servicio": "",
      "fecha_servicio_completado": "",
      "hora_servicio_completado": "",
      "fecha_cancelacion": "2021-12-18",
      "hora_cancelacion": "01:53:27 pm",
      "lugar_servicio": "Av. José Carlos Mariátegui 2445, El Agustino 15006, Peru",
      "ciudad_servicio": "Provincia de Lima, El Agustino",
      "servicio_contratado": "Reparación de electrodomésticos",
      "total_pagado": 295,
      "nombre_consumidor": "Max Collazos Collazos",
      "email_consumidor": "max.collazosm@gmail.com"
    },
    {
      "nombre_negocio_proveedor": "Provider Test",
      "nombre_proveedor": "Provider Test",
      "tipo_documento_proveedor": "DNI",
      "numero_documento_proveedor": "78945612",
      "fecha_servicio": "2021-12-18",
      "fecha_inicio_servicio": "",
      "hora_inicio_servicio": "",
      "fecha_servicio_completado": "",
      "hora_servicio_completado": "",
      "fecha_cancelacion": "2021-12-18",
      "hora_cancelacion": "02:17:41 pm",
      "lugar_servicio": "Av. José Carlos Mariátegui 2445, El Agustino 15006, Peru",
      "ciudad_servicio": "Provincia de Lima, El Agustino",
      "servicio_contratado": "Reparación de electrodomésticos",
      "total_pagado": 177,
      "nombre_consumidor": "Max Collazos Collazos",
      "email_consumidor": "max.collazosm@gmail.com"
    },
    {
      "nombre_negocio_proveedor": "Provider Test",
      "nombre_proveedor": "Provider Test",
      "tipo_documento_proveedor": "DNI",
      "numero_documento_proveedor": "78945612",
      "fecha_servicio": "2021-12-18",
      "fecha_inicio_servicio": "",
      "hora_inicio_servicio": "",
      "fecha_servicio_completado": "",
      "hora_servicio_completado": "",
      "fecha_cancelacion": "2021-12-18",
      "hora_cancelacion": "02:31:12 pm",
      "lugar_servicio": "Av. José Carlos Mariátegui 2445, El Agustino 15006, Peru",
      "ciudad_servicio": "Provincia de Lima, El Agustino",
      "servicio_contratado": "Reparación de electrodomésticos",
      "total_pagado": 30,
      "nombre_consumidor": "Max Collazos Collazos",
      "email_consumidor": "max.collazosm@gmail.com"
    },
    {
      "nombre_negocio_proveedor": "Provider Test",
      "nombre_proveedor": "Provider Test",
      "tipo_documento_proveedor": "DNI",
      "numero_documento_proveedor": "78945612",
      "fecha_servicio": "2021-12-18",
      "fecha_inicio_servicio": "",
      "hora_inicio_servicio": "",
      "fecha_servicio_completado": "",
      "hora_servicio_completado": "",
      "fecha_cancelacion": "2021-12-18",
      "hora_cancelacion": "02:51:05 pm",
      "lugar_servicio": "Av. José Carlos Mariátegui 2445, El Agustino 15006, Peru",
      "ciudad_servicio": "Provincia de Lima, El Agustino",
      "servicio_contratado": "Electricidad",
      "total_pagado": 30,
      "nombre_consumidor": "Max Collazos Collazos",
      "email_consumidor": "max.collazosm@gmail.com"
    },
    {
      "nombre_negocio_proveedor": "Provider Test",
      "nombre_proveedor": "Provider Test",
      "tipo_documento_proveedor": "DNI",
      "numero_documento_proveedor": "78945612",
      "fecha_servicio": "2021-12-18",
      "fecha_inicio_servicio": "",
      "hora_inicio_servicio": "",
      "fecha_servicio_completado": "",
      "hora_servicio_completado": "",
      "fecha_cancelacion": "2021-12-18",
      "hora_cancelacion": "02:54:36 pm",
      "lugar_servicio": "Av. José Carlos Mariátegui 2445, El Agustino 15006, Peru",
      "ciudad_servicio": "Provincia de Lima, El Agustino",
      "servicio_contratado": "Electricidad",
      "total_pagado": 142,
      "nombre_consumidor": "Max Collazos Collazos",
      "email_consumidor": "max.collazosm@gmail.com"
    },
    {
      "nombre_negocio_proveedor": "Provider Test",
      "nombre_proveedor": "Provider Test",
      "tipo_documento_proveedor": "DNI",
      "numero_documento_proveedor": "78945612",
      "fecha_servicio": "2021-12-18",
      "fecha_inicio_servicio": "",
      "hora_inicio_servicio": "",
      "fecha_servicio_completado": "",
      "hora_servicio_completado": "",
      "fecha_cancelacion": "2021-12-18",
      "hora_cancelacion": "03:05:07 pm",
      "lugar_servicio": "Av. José Carlos Mariátegui 2445, El Agustino 15006, Peru",
      "ciudad_servicio": "Provincia de Lima, El Agustino",
      "servicio_contratado": "Reparación de electrodomésticos",
      "total_pagado": 30,
      "nombre_consumidor": "Max Collazos Collazos",
      "email_consumidor": "max.collazosm@gmail.com"
    },
    {
      "nombre_negocio_proveedor": "Provider Test",
      "nombre_proveedor": "Provider Test",
      "tipo_documento_proveedor": "DNI",
      "numero_documento_proveedor": "78945612",
      "fecha_servicio": "2021-12-18",
      "fecha_inicio_servicio": "",
      "hora_inicio_servicio": "",
      "fecha_servicio_completado": "",
      "hora_servicio_completado": "",
      "fecha_cancelacion": "2021-12-18",
      "hora_cancelacion": "03:11:26 pm",
      "lugar_servicio": "Av. José Carlos Mariátegui 2445, El Agustino 15006, Peru",
      "ciudad_servicio": "Provincia de Lima, El Agustino",
      "servicio_contratado": "Reparación de electrodomésticos",
      "total_pagado": 331,
      "nombre_consumidor": "Max Collazos Collazos",
      "email_consumidor": "max.collazosm@gmail.com"
    },
    {
      "nombre_negocio_proveedor": "Provider Test",
      "nombre_proveedor": "Provider Test",
      "tipo_documento_proveedor": "DNI",
      "numero_documento_proveedor": "78945612",
      "fecha_servicio": "2021-12-18",
      "fecha_inicio_servicio": "",
      "hora_inicio_servicio": "",
      "fecha_servicio_completado": "",
      "hora_servicio_completado": "",
      "fecha_cancelacion": "2021-12-18",
      "hora_cancelacion": "03:19:34 pm",
      "lugar_servicio": "Av. José Carlos Mariátegui 2445, El Agustino 15006, Peru",
      "ciudad_servicio": "Provincia de Lima, El Agustino",
      "servicio_contratado": "Electricidad",
      "total_pagado": 30,
      "nombre_consumidor": "Max Collazos Collazos",
      "email_consumidor": "max.collazosm@gmail.com"
    },
    {
      "nombre_negocio_proveedor": "Provider Test",
      "nombre_proveedor": "Provider Test",
      "tipo_documento_proveedor": "DNI",
      "numero_documento_proveedor": "78945612",
      "fecha_servicio": "2021-12-18",
      "fecha_inicio_servicio": "",
      "hora_inicio_servicio": "",
      "fecha_servicio_completado": "",
      "hora_servicio_completado": "",
      "fecha_cancelacion": "2021-12-18",
      "hora_cancelacion": "03:32:46 pm",
      "lugar_servicio": "Av. José Carlos Mariátegui 2445, El Agustino 15006, Peru",
      "ciudad_servicio": "Provincia de Lima, El Agustino",
      "servicio_contratado": "Gasfitería",
      "total_pagado": 30,
      "nombre_consumidor": "Max Collazos Collazos",
      "email_consumidor": "max.collazosm@gmail.com"
    },
    {
      "nombre_negocio_proveedor": "Provider Test",
      "nombre_proveedor": "Provider Test",
      "tipo_documento_proveedor": "DNI",
      "numero_documento_proveedor": "78945612",
      "fecha_servicio": "2021-12-18",
      "fecha_inicio_servicio": "",
      "hora_inicio_servicio": "",
      "fecha_servicio_completado": "",
      "hora_servicio_completado": "",
      "fecha_cancelacion": "2021-12-18",
      "hora_cancelacion": "03:43:11 pm",
      "lugar_servicio": "Av. José Carlos Mariátegui 2445, El Agustino 15006, Peru",
      "ciudad_servicio": "Provincia de Lima, El Agustino",
      "servicio_contratado": "Electricidad",
      "total_pagado": 177,
      "nombre_consumidor": "Max Collazos Collazos",
      "email_consumidor": "max.collazosm@gmail.com"
    },
    {
      "nombre_negocio_proveedor": "Provider Test",
      "nombre_proveedor": "Provider Test",
      "tipo_documento_proveedor": "DNI",
      "numero_documento_proveedor": "78945612",
      "fecha_servicio": "2021-12-18",
      "fecha_inicio_servicio": "",
      "hora_inicio_servicio": "",
      "fecha_servicio_completado": "",
      "hora_servicio_completado": "",
      "fecha_cancelacion": "2021-12-18",
      "hora_cancelacion": "03:46:59 pm",
      "lugar_servicio": "Av. José Carlos Mariátegui 2445, El Agustino 15006, Peru",
      "ciudad_servicio": "Provincia de Lima, El Agustino",
      "servicio_contratado": "Gasfitería",
      "total_pagado": 3028,
      "nombre_consumidor": "Max Collazos Collazos",
      "email_consumidor": "max.collazosm@gmail.com"
    },
    {
      "nombre_negocio_proveedor": "Provider Test",
      "nombre_proveedor": "Provider Test",
      "tipo_documento_proveedor": "DNI",
      "numero_documento_proveedor": "78945612",
      "fecha_servicio": "2021-12-18",
      "fecha_inicio_servicio": "",
      "hora_inicio_servicio": "",
      "fecha_servicio_completado": "",
      "hora_servicio_completado": "",
      "fecha_cancelacion": "2021-12-18",
      "hora_cancelacion": "03:49:26 pm",
      "lugar_servicio": "Av. José Carlos Mariátegui 2445, El Agustino 15006, Peru",
      "ciudad_servicio": "Provincia de Lima, El Agustino",
      "servicio_contratado": "Electricidad",
      "total_pagado": 177,
      "nombre_consumidor": "Max Collazos Collazos",
      "email_consumidor": "max.collazosm@gmail.com"
    },
    {
      "nombre_negocio_proveedor": "Provider Test",
      "nombre_proveedor": "Provider Test",
      "tipo_documento_proveedor": "DNI",
      "numero_documento_proveedor": "78945612",
      "fecha_servicio": "2021-12-18",
      "fecha_inicio_servicio": "",
      "hora_inicio_servicio": "",
      "fecha_servicio_completado": "",
      "hora_servicio_completado": "",
      "fecha_cancelacion": "2021-12-18",
      "hora_cancelacion": "04:05:25 pm",
      "lugar_servicio": "Av. José Carlos Mariátegui 2445, El Agustino 15006, Peru",
      "ciudad_servicio": "Provincia de Lima, El Agustino",
      "servicio_contratado": "Reparación de electrodomésticos",
      "total_pagado": 34,
      "nombre_consumidor": "Max Collazos Collazos",
      "email_consumidor": "max.collazosm@gmail.com"
    },
    {
      "nombre_negocio_proveedor": "Provider Test",
      "nombre_proveedor": "Provider Test",
      "tipo_documento_proveedor": "DNI",
      "numero_documento_proveedor": "78945612",
      "fecha_servicio": "2021-12-18",
      "fecha_inicio_servicio": "",
      "hora_inicio_servicio": "",
      "fecha_servicio_completado": "",
      "hora_servicio_completado": "",
      "fecha_cancelacion": "2021-12-18",
      "hora_cancelacion": "04:37:17 pm",
      "lugar_servicio": "Av. José Carlos Mariátegui 2445, El Agustino 15006, Peru",
      "ciudad_servicio": "Provincia de Lima, El Agustino",
      "servicio_contratado": "Reparación de electrodomésticos",
      "total_pagado": 18,
      "nombre_consumidor": "Max Collazos Collazos",
      "email_consumidor": "max.collazosm@gmail.com"
    },
    {
      "nombre_negocio_proveedor": "Provider Test",
      "nombre_proveedor": "Provider Test",
      "tipo_documento_proveedor": "DNI",
      "numero_documento_proveedor": "78945612",
      "fecha_servicio": "2021-12-18",
      "fecha_inicio_servicio": "",
      "hora_inicio_servicio": "",
      "fecha_servicio_completado": "",
      "hora_servicio_completado": "",
      "fecha_cancelacion": "2021-12-18",
      "hora_cancelacion": "05:46:43 pm",
      "lugar_servicio": "Av. José Carlos Mariátegui 2445, El Agustino 15006, Peru",
      "ciudad_servicio": "Provincia de Lima, El Agustino",
      "servicio_contratado": "Gasfitería",
      "total_pagado": 78,
      "nombre_consumidor": "Max Collazos Collazos",
      "email_consumidor": "max.collazosm@gmail.com"
    },
    {
      "nombre_negocio_proveedor": "Digitox's",
      "nombre_proveedor": "Digito Proveedor",
      "tipo_documento_proveedor": "DNI",
      "numero_documento_proveedor": "77889244",
      "fecha_servicio": "2021-12-18",
      "fecha_inicio_servicio": "",
      "hora_inicio_servicio": "",
      "fecha_servicio_completado": "",
      "hora_servicio_completado": "",
      "fecha_cancelacion": "2021-12-18",
      "hora_cancelacion": "06:49:45 pm",
      "lugar_servicio": "Av. José Carlos Mariátegui 2445, El Agustino 15006, Peru",
      "ciudad_servicio": "Provincia de Lima, El Agustino",
      "servicio_contratado": "Reparación de electrodomésticos",
      "total_pagado": 30,
      "nombre_consumidor": "Max Collazos Collazos",
      "email_consumidor": "max.collazosm@gmail.com"
    },
    {
      "nombre_negocio_proveedor": "Digitox's",
      "nombre_proveedor": "Digito Proveedor",
      "tipo_documento_proveedor": "DNI",
      "numero_documento_proveedor": "77889244",
      "fecha_servicio": "2021-12-18",
      "fecha_inicio_servicio": "",
      "hora_inicio_servicio": "",
      "fecha_servicio_completado": "",
      "hora_servicio_completado": "",
      "fecha_cancelacion": "2021-12-18",
      "hora_cancelacion": "06:56:46 pm",
      "lugar_servicio": "Av. José Carlos Mariátegui 2445, El Agustino 15006, Peru",
      "ciudad_servicio": "Provincia de Lima, El Agustino",
      "servicio_contratado": "Gasfitería",
      "total_pagado": 18,
      "nombre_consumidor": "Max Collazos Collazos",
      "email_consumidor": "max.collazosm@gmail.com"
    },
    {
      "nombre_negocio_proveedor": "Provider Test",
      "nombre_proveedor": "Provider Test",
      "tipo_documento_proveedor": "DNI",
      "numero_documento_proveedor": "78945612",
      "fecha_servicio": "2021-12-18",
      "fecha_inicio_servicio": "",
      "hora_inicio_servicio": "",
      "fecha_servicio_completado": "",
      "hora_servicio_completado": "",
      "fecha_cancelacion": "2021-12-18",
      "hora_cancelacion": "07:00:16 pm",
      "lugar_servicio": "Av. José Carlos Mariátegui 2445, El Agustino 15006, Peru",
      "ciudad_servicio": "Provincia de Lima, El Agustino",
      "servicio_contratado": "Gasfitería",
      "total_pagado": 13,
      "nombre_consumidor": "Max Collazos Collazos",
      "email_consumidor": "max.collazosm@gmail.com"
    },
    {
      "nombre_negocio_proveedor": "Provider Test",
      "nombre_proveedor": "Provider Test",
      "tipo_documento_proveedor": "DNI",
      "numero_documento_proveedor": "78945612",
      "fecha_servicio": "2021-12-18",
      "fecha_inicio_servicio": "",
      "hora_inicio_servicio": "",
      "fecha_servicio_completado": "",
      "hora_servicio_completado": "",
      "fecha_cancelacion": "2021-12-18",
      "hora_cancelacion": "07:08:05 pm",
      "lugar_servicio": "Av. José Carlos Mariátegui 2445, El Agustino 15006, Peru",
      "ciudad_servicio": "Provincia de Lima, El Agustino",
      "servicio_contratado": "Gasfitería",
      "total_pagado": 38,
      "nombre_consumidor": "Max Collazos Collazos",
      "email_consumidor": "max.collazosm@gmail.com"
    },
    {
      "nombre_negocio_proveedor": "Provider Test",
      "nombre_proveedor": "Provider Test",
      "tipo_documento_proveedor": "DNI",
      "numero_documento_proveedor": "78945612",
      "fecha_servicio": "2021-12-18",
      "fecha_inicio_servicio": "",
      "hora_inicio_servicio": "",
      "fecha_servicio_completado": "",
      "hora_servicio_completado": "",
      "fecha_cancelacion": "2021-12-18",
      "hora_cancelacion": "07:10:50 pm",
      "lugar_servicio": "Av. José Carlos Mariátegui 2445, El Agustino 15006, Peru",
      "ciudad_servicio": "Provincia de Lima, El Agustino",
      "servicio_contratado": "Gasfitería",
      "total_pagado": 39,
      "nombre_consumidor": "Max Collazos Collazos",
      "email_consumidor": "max.collazosm@gmail.com"
    },
    {
      "nombre_negocio_proveedor": "Provider Test",
      "nombre_proveedor": "Provider Test",
      "tipo_documento_proveedor": "DNI",
      "numero_documento_proveedor": "78945612",
      "fecha_servicio": "2021-12-18",
      "fecha_inicio_servicio": "",
      "hora_inicio_servicio": "",
      "fecha_servicio_completado": "",
      "hora_servicio_completado": "",
      "fecha_cancelacion": "2021-12-18",
      "hora_cancelacion": "07:13:04 pm",
      "lugar_servicio": "Av. José Carlos Mariátegui 2445, El Agustino 15006, Peru",
      "ciudad_servicio": "Provincia de Lima, El Agustino",
      "servicio_contratado": "Gasfitería",
      "total_pagado": 51,
      "nombre_consumidor": "Max Collazos Collazos",
      "email_consumidor": "max.collazosm@gmail.com"
    },
    {
      "nombre_negocio_proveedor": "Provider Test",
      "nombre_proveedor": "Provider Test",
      "tipo_documento_proveedor": "DNI",
      "numero_documento_proveedor": "78945612",
      "fecha_servicio": "2021-12-18",
      "fecha_inicio_servicio": "",
      "hora_inicio_servicio": "",
      "fecha_servicio_completado": "",
      "hora_servicio_completado": "",
      "fecha_cancelacion": "2021-12-18",
      "hora_cancelacion": "07:16:19 pm",
      "lugar_servicio": "Av. José Carlos Mariátegui 2445, El Agustino 15006, Peru",
      "ciudad_servicio": "Provincia de Lima, El Agustino",
      "servicio_contratado": "Gasfitería",
      "total_pagado": 38,
      "nombre_consumidor": "Max Collazos Collazos",
      "email_consumidor": "max.collazosm@gmail.com"
    },
    {
      "nombre_negocio_proveedor": "Provider Test",
      "nombre_proveedor": "Provider Test",
      "tipo_documento_proveedor": "DNI",
      "numero_documento_proveedor": "78945612",
      "fecha_servicio": "2021-12-18",
      "fecha_inicio_servicio": "",
      "hora_inicio_servicio": "",
      "fecha_servicio_completado": "",
      "hora_servicio_completado": "",
      "fecha_cancelacion": "2021-12-18",
      "hora_cancelacion": "07:22:16 pm",
      "lugar_servicio": "Av. José Carlos Mariátegui 2445, El Agustino 15006, Peru",
      "ciudad_servicio": "Provincia de Lima, El Agustino",
      "servicio_contratado": "Gasfitería",
      "total_pagado": 51,
      "nombre_consumidor": "Max Collazos Collazos",
      "email_consumidor": "max.collazosm@gmail.com"
    },
    {
      "nombre_negocio_proveedor": "Provider Test",
      "nombre_proveedor": "Provider Test",
      "tipo_documento_proveedor": "DNI",
      "numero_documento_proveedor": "78945612",
      "fecha_servicio": "2021-12-18",
      "fecha_inicio_servicio": "",
      "hora_inicio_servicio": "",
      "fecha_servicio_completado": "",
      "hora_servicio_completado": "",
      "fecha_cancelacion": "2021-12-18",
      "hora_cancelacion": "09:15:32 pm",
      "lugar_servicio": "Av. José Carlos Mariátegui 2445, El Agustino 15006, Peru",
      "ciudad_servicio": "Provincia de Lima, El Agustino",
      "servicio_contratado": "Gasfitería",
      "total_pagado": 26,
      "nombre_consumidor": "Max Collazos Collazos",
      "email_consumidor": "max.collazosm@gmail.com"
    },
    {
      "nombre_negocio_proveedor": "Provider Test",
      "nombre_proveedor": "Provider Test",
      "tipo_documento_proveedor": "DNI",
      "numero_documento_proveedor": "78945612",
      "fecha_servicio": "2021-12-18",
      "fecha_inicio_servicio": "",
      "hora_inicio_servicio": "",
      "fecha_servicio_completado": "",
      "hora_servicio_completado": "",
      "fecha_cancelacion": "2021-12-18",
      "hora_cancelacion": "09:31:50 pm",
      "lugar_servicio": "Av. José Carlos Mariátegui 2445, El Agustino 15006, Peru",
      "ciudad_servicio": "Provincia de Lima, El Agustino",
      "servicio_contratado": "Gasfitería",
      "total_pagado": 93,
      "nombre_consumidor": "Max Collazos Collazos",
      "email_consumidor": "max.collazosm@gmail.com"
    },
    {
      "nombre_negocio_proveedor": "Provider Test",
      "nombre_proveedor": "Provider Test",
      "tipo_documento_proveedor": "DNI",
      "numero_documento_proveedor": "78945612",
      "fecha_servicio": "2021-12-18",
      "fecha_inicio_servicio": "",
      "hora_inicio_servicio": "",
      "fecha_servicio_completado": "",
      "hora_servicio_completado": "",
      "fecha_cancelacion": "2021-12-18",
      "hora_cancelacion": "09:36:19 pm",
      "lugar_servicio": "Av. José Carlos Mariátegui 2445, El Agustino 15006, Peru",
      "ciudad_servicio": "Provincia de Lima, El Agustino",
      "servicio_contratado": "Gasfitería",
      "total_pagado": 39,
      "nombre_consumidor": "Max Collazos Collazos",
      "email_consumidor": "max.collazosm@gmail.com"
    },
    {
      "nombre_negocio_proveedor": "Provider Test",
      "nombre_proveedor": "Provider Test",
      "tipo_documento_proveedor": "DNI",
      "numero_documento_proveedor": "78945612",
      "fecha_servicio": "2021-12-18",
      "fecha_inicio_servicio": "",
      "hora_inicio_servicio": "",
      "fecha_servicio_completado": "",
      "hora_servicio_completado": "",
      "fecha_cancelacion": "2021-12-18",
      "hora_cancelacion": "10:33:34 pm",
      "lugar_servicio": "Av. José Carlos Mariátegui 2445, El Agustino 15006, Peru",
      "ciudad_servicio": "Provincia de Lima, El Agustino",
      "servicio_contratado": "Gasfitería",
      "total_pagado": 52,
      "nombre_consumidor": "Max Collazos Collazos",
      "email_consumidor": "max.collazosm@gmail.com"
    },
    {
      "nombre_negocio_proveedor": "Provider Test",
      "nombre_proveedor": "Provider Test",
      "tipo_documento_proveedor": "DNI",
      "numero_documento_proveedor": "78945612",
      "fecha_servicio": "2021-12-18",
      "fecha_inicio_servicio": "",
      "hora_inicio_servicio": "",
      "fecha_servicio_completado": "",
      "hora_servicio_completado": "",
      "fecha_cancelacion": "2021-12-18",
      "hora_cancelacion": "10:37:51 pm",
      "lugar_servicio": "Av. José Carlos Mariátegui 2445, El Agustino 15006, Peru",
      "ciudad_servicio": "Provincia de Lima, El Agustino",
      "servicio_contratado": "Electricidad",
      "total_pagado": 69,
      "nombre_consumidor": "Max Collazos Collazos",
      "email_consumidor": "max.collazosm@gmail.com"
    },
    {
      "nombre_negocio_proveedor": "Provider Test",
      "nombre_proveedor": "Provider Test",
      "tipo_documento_proveedor": "DNI",
      "numero_documento_proveedor": "78945612",
      "fecha_servicio": "2021-12-18",
      "fecha_inicio_servicio": "",
      "hora_inicio_servicio": "",
      "fecha_servicio_completado": "",
      "hora_servicio_completado": "",
      "fecha_cancelacion": "2021-12-18",
      "hora_cancelacion": "10:51:38 pm",
      "lugar_servicio": "Av. José Carlos Mariátegui 2445, El Agustino 15006, Peru",
      "ciudad_servicio": "Provincia de Lima, El Agustino",
      "servicio_contratado": "Gasfitería",
      "total_pagado": 18,
      "nombre_consumidor": "Max Collazos Collazos",
      "email_consumidor": "max.collazosm@gmail.com"
    },
    {
      "nombre_negocio_proveedor": "Provider Test",
      "nombre_proveedor": "Provider Test",
      "tipo_documento_proveedor": "DNI",
      "numero_documento_proveedor": "78945612",
      "fecha_servicio": "2021-12-18",
      "fecha_inicio_servicio": "",
      "hora_inicio_servicio": "",
      "fecha_servicio_completado": "",
      "hora_servicio_completado": "",
      "fecha_cancelacion": "2021-12-18",
      "hora_cancelacion": "10:52:56 pm",
      "lugar_servicio": "Av. José Carlos Mariátegui 2445, El Agustino 15006, Peru",
      "ciudad_servicio": "Provincia de Lima, El Agustino",
      "servicio_contratado": "Electricidad",
      "total_pagado": 18,
      "nombre_consumidor": "Max Collazos Collazos",
      "email_consumidor": "max.collazosm@gmail.com"
    },
    {
      "nombre_negocio_proveedor": "Disney",
      "nombre_proveedor": "Juan Perez",
      "tipo_documento_proveedor": "DNI",
      "numero_documento_proveedor": "77889945",
      "fecha_servicio": "2021-12-20",
      "fecha_inicio_servicio": "",
      "hora_inicio_servicio": "",
      "fecha_servicio_completado": "",
      "hora_servicio_completado": "",
      "fecha_cancelacion": "2021-12-20",
      "hora_cancelacion": "05:55:49 pm",
      "lugar_servicio": "Mercurio 7575, Cercado de Lima 15302, Perú",
      "ciudad_servicio": "Provincia de Lima, Cercado de Lima",
      "servicio_contratado": "Electricidad",
      "total_pagado": 12,
      "nombre_consumidor": "angel velazquez Velazquez",
      "email_consumidor": "teodrum64@gmail.com"
    },
    {
      "nombre_negocio_proveedor": "ENB COMPANY",
      "nombre_proveedor": "Mauricio Duran",
      "tipo_documento_proveedor": "RUC",
      "numero_documento_proveedor": "20606789468",
      "fecha_cancelacion": "2021-12-20",
      "hora_cancelacion": "06:54:17 pm",
      "lugar_servicio": "Mercurio 7575, Cercado de Lima 15302, Perú",
      "ciudad_servicio": "Provincia de Lima, Cercado de Lima",
      "servicio_contratado": "Limpieza",
      "total_pagado": 13,
      "nombre_consumidor": "angel velazquez Velazquez",
      "email_consumidor": "teodrum64@gmail.com"
    },
    {
      "nombre_negocio_proveedor": "Angel Velazquez Rey",
      "nombre_proveedor": "Angel Velazquez Rey",
      "tipo_documento_proveedor": "DNI",
      "numero_documento_proveedor": "74077477",
      "fecha_servicio": "2021-12-21",
      "fecha_inicio_servicio": "",
      "hora_inicio_servicio": "",
      "fecha_servicio_completado": "",
      "hora_servicio_completado": "",
      "fecha_cancelacion": "2021-12-21",
      "hora_cancelacion": "04:52:18 pm",
      "lugar_servicio": "Mercurio 7575, Cercado de Lima 15302, Perú",
      "ciudad_servicio": "Provincia de Lima, Cercado de Lima",
      "servicio_contratado": "Gasfitería",
      "total_pagado": 15,
      "nombre_consumidor": "angel velazquez Velazquez",
      "email_consumidor": "teodrum64@gmail.com"
    },
    {
      "nombre_negocio_proveedor": "ENB COMPANY",
      "nombre_proveedor": "Mauricio Duran",
      "tipo_documento_proveedor": "RUC",
      "numero_documento_proveedor": "20606789468",
      "fecha_servicio": "2021-12-21",
      "fecha_inicio_servicio": "",
      "hora_inicio_servicio": "",
      "fecha_servicio_completado": "",
      "hora_servicio_completado": "",
      "fecha_cancelacion": "2021-12-21",
      "hora_cancelacion": "07:29:40 pm",
      "lugar_servicio": "Mercurio 7575, Cercado de Lima 15302, Perú",
      "ciudad_servicio": "Provincia de Lima, Cercado de Lima",
      "servicio_contratado": "Limpieza",
      "total_pagado": 13,
      "nombre_consumidor": "angel velazquez Velazquez",
      "email_consumidor": "teodrum64@gmail.com"
    },
    {
      "nombre_negocio_proveedor": "ENB COMPANY",
      "nombre_proveedor": "Mauricio Duran",
      "tipo_documento_proveedor": "RUC",
      "numero_documento_proveedor": "20606789468",
      "fecha_servicio": "2021-12-21",
      "fecha_inicio_servicio": "",
      "hora_inicio_servicio": "",
      "fecha_servicio_completado": "",
      "hora_servicio_completado": "",
      "fecha_cancelacion": "2021-12-21",
      "hora_cancelacion": "07:39:27 pm",
      "lugar_servicio": "Mercurio 7575, Cercado de Lima 15302, Perú",
      "ciudad_servicio": "Provincia de Lima, Cercado de Lima",
      "servicio_contratado": "Limpieza",
      "total_pagado": 12,
      "nombre_consumidor": "angel velazquez Velazquez",
      "email_consumidor": "teodrum64@gmail.com"
    },
    {
      "nombre_negocio_proveedor": "Angel Velazquez Rey",
      "nombre_proveedor": "Angel Velazquez Rey",
      "tipo_documento_proveedor": "DNI",
      "numero_documento_proveedor": "74077477",
      "fecha_servicio": "2021-12-21",
      "fecha_inicio_servicio": "",
      "hora_inicio_servicio": "",
      "fecha_servicio_completado": "",
      "hora_servicio_completado": "",
      "fecha_cancelacion": "2021-12-21",
      "hora_cancelacion": "07:41:14 pm",
      "lugar_servicio": "Mercurio 7575, Cercado de Lima 15302, Perú",
      "ciudad_servicio": "Provincia de Lima, Cercado de Lima",
      "servicio_contratado": "Electricidad",
      "total_pagado": 12,
      "nombre_consumidor": "angel velazquez Velazquez",
      "email_consumidor": "teodrum64@gmail.com"
    },
    {
      "nombre_negocio_proveedor": "Angel Velazquez Rey",
      "nombre_proveedor": "Angel Velazquez Rey",
      "tipo_documento_proveedor": "DNI",
      "numero_documento_proveedor": "74077477",
      "fecha_servicio": "2021-12-21",
      "fecha_inicio_servicio": "",
      "hora_inicio_servicio": "",
      "fecha_servicio_completado": "",
      "hora_servicio_completado": "",
      "fecha_cancelacion": "2021-12-21",
      "hora_cancelacion": "07:42:49 pm",
      "lugar_servicio": "Mercurio 7575, Cercado de Lima 15302, Perú",
      "ciudad_servicio": "Provincia de Lima, Cercado de Lima",
      "servicio_contratado": "Gasfitería",
      "total_pagado": 12,
      "nombre_consumidor": "angel velazquez Velazquez",
      "email_consumidor": "teodrum64@gmail.com"
    },
    {
      "nombre_negocio_proveedor": "ENB COMPANY",
      "nombre_proveedor": "Mauricio Duran",
      "tipo_documento_proveedor": "RUC",
      "numero_documento_proveedor": "20606789468",
      "fecha_servicio": "2021-12-21",
      "fecha_inicio_servicio": "",
      "hora_inicio_servicio": "",
      "fecha_servicio_completado": "",
      "hora_servicio_completado": "",
      "fecha_cancelacion": "2021-12-22",
      "hora_cancelacion": "11:21:23 am",
      "lugar_servicio": "Mercurio 7575, Cercado de Lima 15302, Perú",
      "ciudad_servicio": "Provincia de Lima, Cercado de Lima",
      "servicio_contratado": "Electricidad",
      "total_pagado": 13,
      "nombre_consumidor": "angel velazquez Velazquez",
      "email_consumidor": "teodrum64@gmail.com"
    },
    {
      "nombre_negocio_proveedor": "Disney",
      "nombre_proveedor": "Juan Perez",
      "tipo_documento_proveedor": "DNI",
      "numero_documento_proveedor": "77889945",
      "fecha_servicio": "2022-01-10",
      "fecha_inicio_servicio": "",
      "hora_inicio_servicio": "",
      "fecha_servicio_completado": "",
      "hora_servicio_completado": "",
      "fecha_cancelacion": "2022-01-10",
      "hora_cancelacion": "09:43:15 am",
      "lugar_servicio": "Avenida Canta Callao S/N, San Martín de Porres 15112, Peru",
      "ciudad_servicio": "Provincia de Lima, San Martín de Porres",
      "servicio_contratado": "Fumigación",
      "total_pagado": 12,
      "nombre_consumidor": "Alexis  Arecochea",
      "email_consumidor": "arecocheaflores@gmail.com",
      "puntaje_trabajador": 5
    },
    {
      "nombre_negocio_proveedor": "Disney",
      "nombre_proveedor": "Juan Perez",
      "tipo_documento_proveedor": "DNI",
      "numero_documento_proveedor": "77889945",
      "fecha_servicio": "2021-12-22",
      "fecha_inicio_servicio": "",
      "hora_inicio_servicio": "",
      "fecha_servicio_completado": "",
      "hora_servicio_completado": "",
      "fecha_cancelacion": "2021-12-22",
      "hora_cancelacion": "12:04:12 pm",
      "lugar_servicio": "Avenida Canta Callao S/N, San Martín de Porres 15112, Peru",
      "ciudad_servicio": "Provincia de Lima, San Martín de Porres",
      "servicio_contratado": "Limpieza",
      "total_pagado": 12,
      "nombre_consumidor": "Alexis  Arecochea",
      "email_consumidor": "arecocheaflores@gmail.com"
    }
  ]
}
