module gitlab.com/baroprime/led-app/redis

go 1.12

require (
	github.com/go-redis/redis v6.15.2+incompatible
	github.com/gorilla/mux v1.7.1
	github.com/onsi/ginkgo v1.8.0 // indirect
	github.com/onsi/gomega v1.5.0 // indirect
)
