[0] MPI startup(): Intel(R) MPI Library, Version 2021.10  Build 20230619 (id: c2e19c2f3e)
[0] MPI startup(): Copyright (C) 2003-2023 Intel Corporation.  All rights reserved.
[0] MPI startup(): library kind: release
[0] MPI startup(): libfabric version: 1.18.0-impi
compute12:rank1 PSM3_IDENTIFY PSM3 v3.0-oneapi-ze built for IEFS OFA DELTA 11_5_0_0_172
compute12:rank1 PSM3_IDENTIFY location /usr/lib64/libfabric/libpsm3-fi.so
compute12:rank1 PSM3_IDENTIFY build date 2023-05-15T09:53:40
compute12:rank1 PSM3_IDENTIFY src checksum 2c3eb379fd92530cd927d9f8b08506d7387c1d59
compute12:rank1 PSM3_IDENTIFY git checksum 97fdceb01fc41231a0a29e1df3f0f8ba760facd7
compute12:rank1 PSM3_IDENTIFY HAL: verbs (RDMA Verbs (oneapi-ze)) built against rv interface v1.4 gpu v1.3 oneapi-ze
compute12:rank1 PSM3_IDENTIFY Global Rank 1 (16 total) Local Rank 1 (16 total)
compute12:rank1 PSM3_IDENTIFY CPU Core 7 NUMA 0 PID 136945
compute12:rank3 PSM3_IDENTIFY PSM3 v3.0-oneapi-ze built for IEFS OFA DELTA 11_5_0_0_172
compute12:rank3 PSM3_IDENTIFY location /usr/lib64/libfabric/libpsm3-fi.so
compute12:rank3 PSM3_IDENTIFY build date 2023-05-15T09:53:40
compute12:rank3 PSM3_IDENTIFY src checksum 2c3eb379fd92530cd927d9f8b08506d7387c1d59
compute12:rank3 PSM3_IDENTIFY git checksum 97fdceb01fc41231a0a29e1df3f0f8ba760facd7
compute12:rank3 PSM3_IDENTIFY HAL: verbs (RDMA Verbs (oneapi-ze)) built against rv interface v1.4 gpu v1.3 oneapi-ze
compute12:rank3 PSM3_IDENTIFY Global Rank 3 (16 total) Local Rank 3 (16 total)
compute12:rank3 PSM3_IDENTIFY CPU Core 133 NUMA 0 PID 136947
compute12:rank7 PSM3_IDENTIFY PSM3 v3.0-oneapi-ze built for IEFS OFA DELTA 11_5_0_0_172
compute12:rank7 PSM3_IDENTIFY location /usr/lib64/libfabric/libpsm3-fi.so
compute12:rank7 PSM3_IDENTIFY build date 2023-05-15T09:53:40
compute12:rank7 PSM3_IDENTIFY src checksum 2c3eb379fd92530cd927d9f8b08506d7387c1d59
compute12:rank7 PSM3_IDENTIFY git checksum 97fdceb01fc41231a0a29e1df3f0f8ba760facd7
compute12:rank7 PSM3_IDENTIFY HAL: verbs (RDMA Verbs (oneapi-ze)) built against rv interface v1.4 gpu v1.3 oneapi-ze
compute12:rank7 PSM3_IDENTIFY Global Rank 7 (16 total) Local Rank 7 (16 total)
compute12:rank7 PSM3_IDENTIFY CPU Core 49 NUMA 0 PID 136951
compute12:rank5 PSM3_IDENTIFY PSM3 v3.0-oneapi-ze built for IEFS OFA DELTA 11_5_0_0_172
compute12:rank5 PSM3_IDENTIFY location /usr/lib64/libfabric/libpsm3-fi.so
compute12:rank5 PSM3_IDENTIFY build date 2023-05-15T09:53:40
compute12:rank5 PSM3_IDENTIFY src checksum 2c3eb379fd92530cd927d9f8b08506d7387c1d59
compute12:rank5 PSM3_IDENTIFY git checksum 97fdceb01fc41231a0a29e1df3f0f8ba760facd7
compute12:rank5 PSM3_IDENTIFY HAL: verbs (RDMA Verbs (oneapi-ze)) built against rv interface v1.4 gpu v1.3 oneapi-ze
compute12:rank5 PSM3_IDENTIFY Global Rank 5 (16 total) Local Rank 5 (16 total)
compute12:rank5 PSM3_IDENTIFY CPU Core 147 NUMA 0 PID 136949
[0] MPI startup(): libfabric provider: psm3
compute12:rank0 PSM3_IDENTIFY PSM3 v3.0-oneapi-ze built for IEFS OFA DELTA 11_5_0_0_172
compute12:rank0 PSM3_IDENTIFY location /usr/lib64/libfabric/libpsm3-fi.so
compute12:rank0 PSM3_IDENTIFY build date 2023-05-15T09:53:40
compute12:rank0 PSM3_IDENTIFY src checksum 2c3eb379fd92530cd927d9f8b08506d7387c1d59
compute12:rank0 PSM3_IDENTIFY git checksum 97fdceb01fc41231a0a29e1df3f0f8ba760facd7
compute12:rank0 PSM3_IDENTIFY HAL: verbs (RDMA Verbs (oneapi-ze)) built against rv interface v1.4 gpu v1.3 oneapi-ze
compute12:rank0 PSM3_IDENTIFY Global Rank 0 (16 total) Local Rank 0 (16 total)
compute12:rank0 PSM3_IDENTIFY CPU Core 1 NUMA 0 PID 136944
compute12:rank15 PSM3_IDENTIFY PSM3 v3.0-oneapi-ze built for IEFS OFA DELTA 11_5_0_0_172
compute12:rank15 PSM3_IDENTIFY location /usr/lib64/libfabric/libpsm3-fi.so
compute12:rank15 PSM3_IDENTIFY build date 2023-05-15T09:53:40
compute12:rank15 PSM3_IDENTIFY src checksum 2c3eb379fd92530cd927d9f8b08506d7387c1d59
compute12:rank15 PSM3_IDENTIFY git checksum 97fdceb01fc41231a0a29e1df3f0f8ba760facd7
compute12:rank15 PSM3_IDENTIFY HAL: verbs (RDMA Verbs (oneapi-ze)) built against rv interface v1.4 gpu v1.3 oneapi-ze
compute12:rank15 PSM3_IDENTIFY Global Rank 15 (16 total) Local Rank 15 (16 total)
compute12:rank15 PSM3_IDENTIFY CPU Core 223 NUMA 1 PID 136959
compute12:rank13 PSM3_IDENTIFY PSM3 v3.0-oneapi-ze built for IEFS OFA DELTA 11_5_0_0_172
compute12:rank13 PSM3_IDENTIFY location /usr/lib64/libfabric/libpsm3-fi.so
compute12:rank13 PSM3_IDENTIFY build date 2023-05-15T09:53:40
compute12:rank13 PSM3_IDENTIFY src checksum 2c3eb379fd92530cd927d9f8b08506d7387c1d59
compute12:rank13 PSM3_IDENTIFY git checksum 97fdceb01fc41231a0a29e1df3f0f8ba760facd7
compute12:rank13 PSM3_IDENTIFY HAL: verbs (RDMA Verbs (oneapi-ze)) built against rv interface v1.4 gpu v1.3 oneapi-ze
compute12:rank13 PSM3_IDENTIFY Global Rank 13 (16 total) Local Rank 13 (16 total)
compute12:rank13 PSM3_IDENTIFY CPU Core 203 NUMA 1 PID 136957
compute12:rank10 PSM3_IDENTIFY PSM3 v3.0-oneapi-ze built for IEFS OFA DELTA 11_5_0_0_172
compute12:rank10 PSM3_IDENTIFY location /usr/lib64/libfabric/libpsm3-fi.so
compute12:rank10 PSM3_IDENTIFY build date 2023-05-15T09:53:40
compute12:rank10 PSM3_IDENTIFY src checksum 2c3eb379fd92530cd927d9f8b08506d7387c1d59
compute12:rank10 PSM3_IDENTIFY git checksum 97fdceb01fc41231a0a29e1df3f0f8ba760facd7
compute12:rank10 PSM3_IDENTIFY HAL: verbs (RDMA Verbs (oneapi-ze)) built against rv interface v1.4 gpu v1.3 oneapi-ze
compute12:rank10 PSM3_IDENTIFY Global Rank 10 (16 total) Local Rank 10 (16 total)
compute12:rank10 PSM3_IDENTIFY CPU Core 70 NUMA 1 PID 136954
compute12:rank11 PSM3_IDENTIFY PSM3 v3.0-oneapi-ze built for IEFS OFA DELTA 11_5_0_0_172
compute12:rank11 PSM3_IDENTIFY location /usr/lib64/libfabric/libpsm3-fi.so
compute12:rank11 PSM3_IDENTIFY build date 2023-05-15T09:53:40
compute12:rank11 PSM3_IDENTIFY src checksum 2c3eb379fd92530cd927d9f8b08506d7387c1d59
compute12:rank11 PSM3_IDENTIFY git checksum 97fdceb01fc41231a0a29e1df3f0f8ba760facd7
compute12:rank11 PSM3_IDENTIFY HAL: verbs (RDMA Verbs (oneapi-ze)) built against rv interface v1.4 gpu v1.3 oneapi-ze
compute12:rank11 PSM3_IDENTIFY Global Rank 11 (16 total) Local Rank 11 (16 total)
compute12:rank11 PSM3_IDENTIFY CPU Core 189 NUMA 1 PID 136955
compute12:rank12 PSM3_IDENTIFY PSM3 v3.0-oneapi-ze built for IEFS OFA DELTA 11_5_0_0_172
compute12:rank12 PSM3_IDENTIFY location /usr/lib64/libfabric/libpsm3-fi.so
compute12:rank12 PSM3_IDENTIFY build date 2023-05-15T09:53:40
compute12:rank12 PSM3_IDENTIFY src checksum 2c3eb379fd92530cd927d9f8b08506d7387c1d59
compute12:rank12 PSM3_IDENTIFY git checksum 97fdceb01fc41231a0a29e1df3f0f8ba760facd7
compute12:rank12 PSM3_IDENTIFY HAL: verbs (RDMA Verbs (oneapi-ze)) built against rv interface v1.4 gpu v1.3 oneapi-ze
compute12:rank12 PSM3_IDENTIFY Global Rank 12 (16 total) Local Rank 12 (16 total)
compute12:rank12 PSM3_IDENTIFY CPU Core 84 NUMA 1 PID 136956
compute12:rank14 PSM3_IDENTIFY PSM3 v3.0-oneapi-ze built for IEFS OFA DELTA 11_5_0_0_172
compute12:rank14 PSM3_IDENTIFY location /usr/lib64/libfabric/libpsm3-fi.so
compute12:rank14 PSM3_IDENTIFY build date 2023-05-15T09:53:40
compute12:rank14 PSM3_IDENTIFY src checksum 2c3eb379fd92530cd927d9f8b08506d7387c1d59
compute12:rank14 PSM3_IDENTIFY git checksum 97fdceb01fc41231a0a29e1df3f0f8ba760facd7
compute12:rank14 PSM3_IDENTIFY HAL: verbs (RDMA Verbs (oneapi-ze)) built against rv interface v1.4 gpu v1.3 oneapi-ze
compute12:rank14 PSM3_IDENTIFY Global Rank 14 (16 total) Local Rank 14 (16 total)
compute12:rank14 PSM3_IDENTIFY CPU Core 210 NUMA 1 PID 136958
compute12:rank2 PSM3_IDENTIFY PSM3 v3.0-oneapi-ze built for IEFS OFA DELTA 11_5_0_0_172
compute12:rank2 PSM3_IDENTIFY location /usr/lib64/libfabric/libpsm3-fi.so
compute12:rank2 PSM3_IDENTIFY build date 2023-05-15T09:53:40
compute12:rank2 PSM3_IDENTIFY src checksum 2c3eb379fd92530cd927d9f8b08506d7387c1d59
compute12:rank2 PSM3_IDENTIFY git checksum 97fdceb01fc41231a0a29e1df3f0f8ba760facd7
compute12:rank2 PSM3_IDENTIFY HAL: verbs (RDMA Verbs (oneapi-ze)) built against rv interface v1.4 gpu v1.3 oneapi-ze
compute12:rank2 PSM3_IDENTIFY Global Rank 2 (16 total) Local Rank 2 (16 total)
compute12:rank2 PSM3_IDENTIFY CPU Core 14 NUMA 0 PID 136946
compute12:rank4 PSM3_IDENTIFY PSM3 v3.0-oneapi-ze built for IEFS OFA DELTA 11_5_0_0_172
compute12:rank4 PSM3_IDENTIFY location /usr/lib64/libfabric/libpsm3-fi.so
compute12:rank4 PSM3_IDENTIFY build date 2023-05-15T09:53:40
compute12:rank4 PSM3_IDENTIFY src checksum 2c3eb379fd92530cd927d9f8b08506d7387c1d59
compute12:rank4 PSM3_IDENTIFY git checksum 97fdceb01fc41231a0a29e1df3f0f8ba760facd7
compute12:rank4 PSM3_IDENTIFY HAL: verbs (RDMA Verbs (oneapi-ze)) built against rv interface v1.4 gpu v1.3 oneapi-ze
compute12:rank4 PSM3_IDENTIFY Global Rank 4 (16 total) Local Rank 4 (16 total)
compute12:rank4 PSM3_IDENTIFY CPU Core 28 NUMA 0 PID 136948
compute12:rank6 PSM3_IDENTIFY PSM3 v3.0-oneapi-ze built for IEFS OFA DELTA 11_5_0_0_172
compute12:rank6 PSM3_IDENTIFY location /usr/lib64/libfabric/libpsm3-fi.so
compute12:rank6 PSM3_IDENTIFY build date 2023-05-15T09:53:40
compute12:rank6 PSM3_IDENTIFY src checksum 2c3eb379fd92530cd927d9f8b08506d7387c1d59
compute12:rank6 PSM3_IDENTIFY git checksum 97fdceb01fc41231a0a29e1df3f0f8ba760facd7
compute12:rank6 PSM3_IDENTIFY HAL: verbs (RDMA Verbs (oneapi-ze)) built against rv interface v1.4 gpu v1.3 oneapi-ze
compute12:rank6 PSM3_IDENTIFY Global Rank 6 (16 total) Local Rank 6 (16 total)
compute12:rank6 PSM3_IDENTIFY CPU Core 42 NUMA 0 PID 136950
compute12:rank9 PSM3_IDENTIFY PSM3 v3.0-oneapi-ze built for IEFS OFA DELTA 11_5_0_0_172
compute12:rank9 PSM3_IDENTIFY location /usr/lib64/libfabric/libpsm3-fi.so
compute12:rank9 PSM3_IDENTIFY build date 2023-05-15T09:53:40
compute12:rank9 PSM3_IDENTIFY src checksum 2c3eb379fd92530cd927d9f8b08506d7387c1d59
compute12:rank9 PSM3_IDENTIFY git checksum 97fdceb01fc41231a0a29e1df3f0f8ba760facd7
compute12:rank9 PSM3_IDENTIFY HAL: verbs (RDMA Verbs (oneapi-ze)) built against rv interface v1.4 gpu v1.3 oneapi-ze
compute12:rank9 PSM3_IDENTIFY Global Rank 9 (16 total) Local Rank 9 (16 total)
compute12:rank9 PSM3_IDENTIFY CPU Core 63 NUMA 1 PID 136953
compute12:rank8 PSM3_IDENTIFY PSM3 v3.0-oneapi-ze built for IEFS OFA DELTA 11_5_0_0_172
compute12:rank8 PSM3_IDENTIFY location /usr/lib64/libfabric/libpsm3-fi.so
compute12:rank8 PSM3_IDENTIFY build date 2023-05-15T09:53:40
compute12:rank8 PSM3_IDENTIFY src checksum 2c3eb379fd92530cd927d9f8b08506d7387c1d59
compute12:rank8 PSM3_IDENTIFY git checksum 97fdceb01fc41231a0a29e1df3f0f8ba760facd7
compute12:rank8 PSM3_IDENTIFY HAL: verbs (RDMA Verbs (oneapi-ze)) built against rv interface v1.4 gpu v1.3 oneapi-ze
compute12:rank8 PSM3_IDENTIFY Global Rank 8 (16 total) Local Rank 8 (16 total)
compute12:rank8 PSM3_IDENTIFY CPU Core 56 NUMA 1 PID 136952
compute12:rank1 PSM3_IDENTIFY run-time rv interface v1.4 user_mr gpu v1.3 oneapi-ze
compute12:rank1 PSM3_IDENTIFY NIC 0 (mlx5_0) Port 1 200000 Mbps NUMA 0 LID=16 GID=0xfe80000000000000:b83fd20300478496 QP=61682
compute12:rank3 PSM3_IDENTIFY run-time rv interface v1.4 user_mr gpu v1.3 oneapi-ze
compute12:rank2 PSM3_IDENTIFY run-time rv interface v1.4 user_mr gpu v1.3 oneapi-ze
compute12:rank5 PSM3_IDENTIFY run-time rv interface v1.4 user_mr gpu v1.3 oneapi-ze
compute12:rank7 PSM3_IDENTIFY run-time rv interface v1.4 user_mr gpu v1.3 oneapi-ze
compute12:rank4 PSM3_IDENTIFY run-time rv interface v1.4 user_mr gpu v1.3 oneapi-ze
compute12:rank13 PSM3_IDENTIFY run-time rv interface v1.4 user_mr gpu v1.3 oneapi-ze
compute12:rank6 PSM3_IDENTIFY run-time rv interface v1.4 user_mr gpu v1.3 oneapi-ze
compute12:rank15 PSM3_IDENTIFY run-time rv interface v1.4 user_mr gpu v1.3 oneapi-ze
compute12:rank0 PSM3_IDENTIFY run-time rv interface v1.4 user_mr gpu v1.3 oneapi-ze
compute12:rank10 PSM3_IDENTIFY run-time rv interface v1.4 user_mr gpu v1.3 oneapi-ze
compute12:rank11 PSM3_IDENTIFY run-time rv interface v1.4 user_mr gpu v1.3 oneapi-ze
compute12:rank12 PSM3_IDENTIFY run-time rv interface v1.4 user_mr gpu v1.3 oneapi-ze
compute12:rank3 PSM3_IDENTIFY NIC 0 (mlx5_0) Port 1 200000 Mbps NUMA 0 LID=16 GID=0xfe80000000000000:b83fd20300478496 QP=61683
compute12:rank2 PSM3_IDENTIFY NIC 0 (mlx5_0) Port 1 200000 Mbps NUMA 0 LID=16 GID=0xfe80000000000000:b83fd20300478496 QP=61684
compute12:rank5 PSM3_IDENTIFY NIC 0 (mlx5_0) Port 1 200000 Mbps NUMA 0 LID=16 GID=0xfe80000000000000:b83fd20300478496 QP=61685
compute12:rank7 PSM3_IDENTIFY NIC 0 (mlx5_0) Port 1 200000 Mbps NUMA 0 LID=16 GID=0xfe80000000000000:b83fd20300478496 QP=61686
compute12:rank4 PSM3_IDENTIFY NIC 0 (mlx5_0) Port 1 200000 Mbps NUMA 0 LID=16 GID=0xfe80000000000000:b83fd20300478496 QP=61687
compute12:rank13 PSM3_IDENTIFY NIC 1 (mlx5_1) Port 1 200000 Mbps NUMA 1 LID=9 GID=0xfe80000000000000:b83fd20300478766 QP=61374
compute12:rank14 PSM3_IDENTIFY run-time rv interface v1.4 user_mr gpu v1.3 oneapi-ze
compute12:rank6 PSM3_IDENTIFY NIC 0 (mlx5_0) Port 1 200000 Mbps NUMA 0 LID=16 GID=0xfe80000000000000:b83fd20300478496 QP=61688
compute12:rank8 PSM3_IDENTIFY run-time rv interface v1.4 user_mr gpu v1.3 oneapi-ze
compute12:rank15 PSM3_IDENTIFY NIC 1 (mlx5_1) Port 1 200000 Mbps NUMA 1 LID=9 GID=0xfe80000000000000:b83fd20300478766 QP=61375
compute12:rank0 PSM3_IDENTIFY NIC 0 (mlx5_0) Port 1 200000 Mbps NUMA 0 LID=16 GID=0xfe80000000000000:b83fd20300478496 QP=61689
compute12:rank9 PSM3_IDENTIFY run-time rv interface v1.4 user_mr gpu v1.3 oneapi-ze
compute12:rank10 PSM3_IDENTIFY NIC 1 (mlx5_1) Port 1 200000 Mbps NUMA 1 LID=9 GID=0xfe80000000000000:b83fd20300478766 QP=61376
compute12:rank11 PSM3_IDENTIFY NIC 1 (mlx5_1) Port 1 200000 Mbps NUMA 1 LID=9 GID=0xfe80000000000000:b83fd20300478766 QP=61377
compute12:rank12 PSM3_IDENTIFY NIC 1 (mlx5_1) Port 1 200000 Mbps NUMA 1 LID=9 GID=0xfe80000000000000:b83fd20300478766 QP=61378
compute12:rank14 PSM3_IDENTIFY NIC 1 (mlx5_1) Port 1 200000 Mbps NUMA 1 LID=9 GID=0xfe80000000000000:b83fd20300478766 QP=61379
compute12:rank8 PSM3_IDENTIFY NIC 1 (mlx5_1) Port 1 200000 Mbps NUMA 1 LID=9 GID=0xfe80000000000000:b83fd20300478766 QP=61380
compute12:rank9 PSM3_IDENTIFY NIC 1 (mlx5_1) Port 1 200000 Mbps NUMA 1 LID=9 GID=0xfe80000000000000:b83fd20300478766 QP=61381
[0] MPI startup(): File "/install/software/oneAPI/2023.2/mpi/2021.10.0/etc/tuning_spr_shm-ofi_psm3.dat" not found
[0] MPI startup(): Load tuning file: "/install/software/oneAPI/2023.2/mpi/2021.10.0/etc/tuning_spr_shm-ofi.dat"
[0] MPI startup(): Rank    Pid      Node name  Pin cpu
[0] MPI startup(): 0       136944   compute12  {0,1,2,3,4,5,6,112,113,114,115,116,117,118}
[0] MPI startup(): 1       136945   compute12  {7,8,9,10,11,12,13,119,120,121,122,123,124,125}
[0] MPI startup(): 2       136946   compute12  {14,15,16,17,18,19,20,126,127,128,129,130,131,132}
[0] MPI startup(): 3       136947   compute12  {21,22,23,24,25,26,27,133,134,135,136,137,138,139}
[0] MPI startup(): 4       136948   compute12  {28,29,30,31,32,33,34,140,141,142,143,144,145,146}
[0] MPI startup(): 5       136949   compute12  {35,36,37,38,39,40,41,147,148,149,150,151,152,153}
[0] MPI startup(): 6       136950   compute12  {42,43,44,45,46,47,48,154,155,156,157,158,159,160}
[0] MPI startup(): 7       136951   compute12  {49,50,51,52,53,54,55,161,162,163,164,165,166,167}
[0] MPI startup(): 8       136952   compute12  {56,57,58,59,60,61,62,168,169,170,171,172,173,174}
[0] MPI startup(): 9       136953   compute12  {63,64,65,66,67,68,69,175,176,177,178,179,180,181}
[0] MPI startup(): 10      136954   compute12  {70,71,72,73,74,75,76,182,183,184,185,186,187,188}
[0] MPI startup(): 11      136955   compute12  {77,78,79,80,81,82,83,189,190,191,192,193,194,195}
[0] MPI startup(): 12      136956   compute12  {84,85,86,87,88,89,90,196,197,198,199,200,201,202}
[0] MPI startup(): 13      136957   compute12  {91,92,93,94,95,96,97,203,204,205,206,207,208,209}
[0] MPI startup(): 14      136958   compute12  {98,99,100,101,102,103,104,210,211,212,213,214,215,216}
[0] MPI startup(): 15      136959   compute12  {105,106,107,108,109,110,111,217,218,219,220,221,222,223}
---
 Reference Paper             : The Journal of Chemical Physics 137, 134108 (2012)
 Version Number              : PSolver 1.9
 Timestamp of this run       : 2023-10-31 08:12:07.771
 Root process Hostname       : compute12
 Poisson Kernel Creation:
   Boundary Conditions       : Periodic
   Memory Requirements per MPI task:
     Density (MB)            :  6.75
     Kernel (MB)             :  0.90
     Full Grid Arrays (MB)   :  6.75
 Orbital repartition:
 -  [ 8,  8,  8,  8,  8,  8,  8,  8,  8,  8,  8,  8,  8,  8,  8,  8]
  #Exact exchange calculation:7%; Time (s): Elapsed=0.6682, Remaining=8.9
  #Exact exchange calculation:18%; Time (s): Elapsed=1.8292, Remaining=8.3
  #Exact exchange calculation:30%; Time (s): Elapsed=3.0987, Remaining=7.2
  #Exact exchange calculation:42%; Time (s): Elapsed=4.5246, Remaining=6.2
  #Exact exchange calculation:53%; Time (s): Elapsed=5.8217, Remaining=5.2
  #Exact exchange calculation:65%; Time (s): Elapsed=7.1645, Remaining=3.9
  #Exact exchange calculation:77%; Time (s): Elapsed=8.4550, Remaining=2.5
  #Exact exchange calculation:88%; Time (s): Elapsed=9.7811, Remaining=1.3
  #Exact exchange calculation:100%; Time (s): Elapsed=11.0679, Remaining=0.0
 Exact Exchange Energy       :  2.58716368342E+16
 Expected Exchange Energy    :  3.07548491532E+04
 Memory Consumption Report:
   Tot. No. of Allocations             :  4994
   Tot. No. of Deallocations           :  4994
   Remaining Memory (B)                :  0
   Memory occupation:
     Peak Value (MB)                   :  408.497
     for the array                     : zt
     in the routine                    : null
     Memory Peak of process            : 1004.404 MB
 Walltime since initialization         :  00:00:12.552958673
 Max No. of dictionaries used          :  583 #( 241 still in use)
 Number of dictionary folders allocated:  1
