---

ecutwfc: 19 Ry

alat:    5.30896   4.59769  86.69492

a_vec:  |
   1.000000  0.000000  0.000000
  -0.500000  1.000000  0.000000
   0.000000  0.000000  1.000000

n_sp_pol:   1
n_spinor:   1
nsym:       1

nqibz:     2
nqbz:      2
nkibz:     2
nkbz:      2

nbnd:     100
nbnd_occ:   4

ng_vec:  23863
wf_ncx:   1739
wf_ng:    2729
X_ng:      500
X_nfreq:     2

syms :  |
  1.000000  0.000000  0.000000  0.000000  1.000000  0.000000  0.000000  0.000000  1.000000
  1.000000  0.000000  0.000000  0.000000 -1.000000  0.000000  0.000000  0.000000 -1.000000
 -0.500000  0.866025  0.000000 -0.866025 -0.500000  0.000000  0.000000  0.000000  1.000000
 -0.500000  0.866025  0.000000  0.866025  0.500000  0.000000  0.000000  0.000000 -1.000000
 -0.500000 -0.866025  0.000000  0.866025 -0.500000  0.000000  0.000000  0.000000  1.000000
 -0.500000 -0.866025  0.000000 -0.866025  0.500000  0.000000  0.000000  0.000000 -1.000000
 -1.000000  0.000000  0.000000  0.000000 -1.000000  0.000000  0.000000  0.000000 -1.000000
 -1.000000  0.000000  0.000000  0.000000  1.000000  0.000000  0.000000  0.000000  1.000000
  0.500000 -0.866025  0.000000  0.866025  0.500000  0.000000  0.000000  0.000000 -1.000000
  0.500000 -0.866025  0.000000 -0.866025 -0.500000  0.000000  0.000000  0.000000  1.000000
  0.500000  0.866025  0.000000 -0.866025  0.500000  0.000000  0.000000  0.000000 -1.000000
  0.500000  0.866025  0.000000  0.866025 -0.500000  0.000000  0.000000  0.000000  1.000000


kpoints :  |
  0.000000  0.000000  0.000000
  0.125000  0.062500  0.000000
  0.250000  0.125000  0.000000
  0.375000  0.187500  0.000000
  0.500000  0.250000  0.000000
  0.125000  0.187500  0.000000
  0.250000  0.250000  0.000000
  0.375000  0.312500  0.000000
  0.250000  0.375000  0.000000
  0.375000  0.437500  0.000000


qpoints :  |
  0.000000  0.000000  0.000000
  0.125000  0.062500  0.000000
  0.250000  0.125000  0.000000
  0.375000  0.187500  0.000000
  0.500000  0.250000  0.000000
  0.125000  0.187500  0.000000
  0.250000  0.250000  0.000000
  0.375000  0.312500  0.000000
  0.250000  0.375000  0.000000
  0.375000  0.437500  0.000000

