[0] MPI startup(): Intel(R) MPI Library, Version 2021.10  Build 20230619 (id: c2e19c2f3e)
[0] MPI startup(): Copyright (C) 2003-2023 Intel Corporation.  All rights reserved.
[0] MPI startup(): library kind: release
[0] MPI startup(): libfabric version: 1.18.0-impi
compute14:rank1 PSM3_IDENTIFY PSM3 v3.0-oneapi-ze built for IEFS OFA DELTA 11_5_0_0_172
compute14:rank1 PSM3_IDENTIFY location /usr/lib64/libfabric/libpsm3-fi.so
compute14:rank1 PSM3_IDENTIFY build date 2023-05-15T09:53:40
compute14:rank1 PSM3_IDENTIFY src checksum 2c3eb379fd92530cd927d9f8b08506d7387c1d59
compute14:rank1 PSM3_IDENTIFY git checksum 97fdceb01fc41231a0a29e1df3f0f8ba760facd7
compute14:rank1 PSM3_IDENTIFY HAL: verbs (RDMA Verbs (oneapi-ze)) built against rv interface v1.4 gpu v1.3 oneapi-ze
compute14:rank1 PSM3_IDENTIFY Global Rank 1 (16 total) Local Rank 1 (16 total)
compute14:rank1 PSM3_IDENTIFY CPU Core 7 NUMA 0 PID 37799
compute14:rank2 PSM3_IDENTIFY PSM3 v3.0-oneapi-ze built for IEFS OFA DELTA 11_5_0_0_172
compute14:rank2 PSM3_IDENTIFY location /usr/lib64/libfabric/libpsm3-fi.so
compute14:rank2 PSM3_IDENTIFY build date 2023-05-15T09:53:40
compute14:rank2 PSM3_IDENTIFY src checksum 2c3eb379fd92530cd927d9f8b08506d7387c1d59
compute14:rank2 PSM3_IDENTIFY git checksum 97fdceb01fc41231a0a29e1df3f0f8ba760facd7
compute14:rank2 PSM3_IDENTIFY HAL: verbs (RDMA Verbs (oneapi-ze)) built against rv interface v1.4 gpu v1.3 oneapi-ze
compute14:rank2 PSM3_IDENTIFY Global Rank 2 (16 total) Local Rank 2 (16 total)
compute14:rank2 PSM3_IDENTIFY CPU Core 15 NUMA 0 PID 37800
compute14:rank4 PSM3_IDENTIFY PSM3 v3.0-oneapi-ze built for IEFS OFA DELTA 11_5_0_0_172
compute14:rank4 PSM3_IDENTIFY location /usr/lib64/libfabric/libpsm3-fi.so
compute14:rank4 PSM3_IDENTIFY build date 2023-05-15T09:53:40
compute14:rank4 PSM3_IDENTIFY src checksum 2c3eb379fd92530cd927d9f8b08506d7387c1d59
compute14:rank4 PSM3_IDENTIFY git checksum 97fdceb01fc41231a0a29e1df3f0f8ba760facd7
compute14:rank4 PSM3_IDENTIFY HAL: verbs (RDMA Verbs (oneapi-ze)) built against rv interface v1.4 gpu v1.3 oneapi-ze
compute14:rank4 PSM3_IDENTIFY Global Rank 4 (16 total) Local Rank 4 (16 total)
compute14:rank4 PSM3_IDENTIFY CPU Core 141 NUMA 0 PID 37802
compute14:rank6 PSM3_IDENTIFY PSM3 v3.0-oneapi-ze built for IEFS OFA DELTA 11_5_0_0_172
compute14:rank6 PSM3_IDENTIFY location /usr/lib64/libfabric/libpsm3-fi.so
compute14:rank6 PSM3_IDENTIFY build date 2023-05-15T09:53:40
compute14:rank6 PSM3_IDENTIFY src checksum 2c3eb379fd92530cd927d9f8b08506d7387c1d59
compute14:rank6 PSM3_IDENTIFY git checksum 97fdceb01fc41231a0a29e1df3f0f8ba760facd7
compute14:rank6 PSM3_IDENTIFY HAL: verbs (RDMA Verbs (oneapi-ze)) built against rv interface v1.4 gpu v1.3 oneapi-ze
compute14:rank6 PSM3_IDENTIFY Global Rank 6 (16 total) Local Rank 6 (16 total)
compute14:rank6 PSM3_IDENTIFY CPU Core 43 NUMA 0 PID 37804
compute14:rank13 PSM3_IDENTIFY PSM3 v3.0-oneapi-ze built for IEFS OFA DELTA 11_5_0_0_172
compute14:rank13 PSM3_IDENTIFY location /usr/lib64/libfabric/libpsm3-fi.so
compute14:rank13 PSM3_IDENTIFY build date 2023-05-15T09:53:40
compute14:rank13 PSM3_IDENTIFY src checksum 2c3eb379fd92530cd927d9f8b08506d7387c1d59
compute14:rank13 PSM3_IDENTIFY git checksum 97fdceb01fc41231a0a29e1df3f0f8ba760facd7
compute14:rank13 PSM3_IDENTIFY HAL: verbs (RDMA Verbs (oneapi-ze)) built against rv interface v1.4 gpu v1.3 oneapi-ze
compute14:rank13 PSM3_IDENTIFY Global Rank 13 (16 total) Local Rank 13 (16 total)
compute14:rank13 PSM3_IDENTIFY CPU Core 203 NUMA 1 PID 37811
compute14:rank12 PSM3_IDENTIFY PSM3 v3.0-oneapi-ze built for IEFS OFA DELTA 11_5_0_0_172
compute14:rank12 PSM3_IDENTIFY location /usr/lib64/libfabric/libpsm3-fi.so
compute14:rank12 PSM3_IDENTIFY build date 2023-05-15T09:53:40
compute14:rank12 PSM3_IDENTIFY src checksum 2c3eb379fd92530cd927d9f8b08506d7387c1d59
compute14:rank12 PSM3_IDENTIFY git checksum 97fdceb01fc41231a0a29e1df3f0f8ba760facd7
compute14:rank12 PSM3_IDENTIFY HAL: verbs (RDMA Verbs (oneapi-ze)) built against rv interface v1.4 gpu v1.3 oneapi-ze
compute14:rank12 PSM3_IDENTIFY Global Rank 12 (16 total) Local Rank 12 (16 total)
compute14:rank12 PSM3_IDENTIFY CPU Core 84 NUMA 1 PID 37810
compute14:rank9 PSM3_IDENTIFY PSM3 v3.0-oneapi-ze built for IEFS OFA DELTA 11_5_0_0_172
compute14:rank9 PSM3_IDENTIFY location /usr/lib64/libfabric/libpsm3-fi.so
compute14:rank9 PSM3_IDENTIFY build date 2023-05-15T09:53:40
compute14:rank9 PSM3_IDENTIFY src checksum 2c3eb379fd92530cd927d9f8b08506d7387c1d59
compute14:rank9 PSM3_IDENTIFY git checksum 97fdceb01fc41231a0a29e1df3f0f8ba760facd7
compute14:rank9 PSM3_IDENTIFY HAL: verbs (RDMA Verbs (oneapi-ze)) built against rv interface v1.4 gpu v1.3 oneapi-ze
compute14:rank9 PSM3_IDENTIFY Global Rank 9 (16 total) Local Rank 9 (16 total)
compute14:rank9 PSM3_IDENTIFY CPU Core 175 NUMA 1 PID 37807
compute14:rank14 PSM3_IDENTIFY PSM3 v3.0-oneapi-ze built for IEFS OFA DELTA 11_5_0_0_172
compute14:rank14 PSM3_IDENTIFY location /usr/lib64/libfabric/libpsm3-fi.so
compute14:rank14 PSM3_IDENTIFY build date 2023-05-15T09:53:40
compute14:rank14 PSM3_IDENTIFY src checksum 2c3eb379fd92530cd927d9f8b08506d7387c1d59
compute14:rank14 PSM3_IDENTIFY git checksum 97fdceb01fc41231a0a29e1df3f0f8ba760facd7
compute14:rank14 PSM3_IDENTIFY HAL: verbs (RDMA Verbs (oneapi-ze)) built against rv interface v1.4 gpu v1.3 oneapi-ze
compute14:rank14 PSM3_IDENTIFY Global Rank 14 (16 total) Local Rank 14 (16 total)
compute14:rank14 PSM3_IDENTIFY CPU Core 98 NUMA 1 PID 37812
compute14:rank15 PSM3_IDENTIFY PSM3 v3.0-oneapi-ze built for IEFS OFA DELTA 11_5_0_0_172
compute14:rank15 PSM3_IDENTIFY location /usr/lib64/libfabric/libpsm3-fi.so
compute14:rank15 PSM3_IDENTIFY build date 2023-05-15T09:53:40
compute14:rank15 PSM3_IDENTIFY src checksum 2c3eb379fd92530cd927d9f8b08506d7387c1d59
compute14:rank15 PSM3_IDENTIFY git checksum 97fdceb01fc41231a0a29e1df3f0f8ba760facd7
compute14:rank15 PSM3_IDENTIFY HAL: verbs (RDMA Verbs (oneapi-ze)) built against rv interface v1.4 gpu v1.3 oneapi-ze
compute14:rank15 PSM3_IDENTIFY Global Rank 15 (16 total) Local Rank 15 (16 total)
compute14:rank15 PSM3_IDENTIFY CPU Core 217 NUMA 1 PID 37813
compute14:rank5 PSM3_IDENTIFY PSM3 v3.0-oneapi-ze built for IEFS OFA DELTA 11_5_0_0_172
compute14:rank5 PSM3_IDENTIFY location /usr/lib64/libfabric/libpsm3-fi.so
compute14:rank5 PSM3_IDENTIFY build date 2023-05-15T09:53:40
compute14:rank5 PSM3_IDENTIFY src checksum 2c3eb379fd92530cd927d9f8b08506d7387c1d59
compute14:rank5 PSM3_IDENTIFY git checksum 97fdceb01fc41231a0a29e1df3f0f8ba760facd7
compute14:rank5 PSM3_IDENTIFY HAL: verbs (RDMA Verbs (oneapi-ze)) built against rv interface v1.4 gpu v1.3 oneapi-ze
compute14:rank5 PSM3_IDENTIFY Global Rank 5 (16 total) Local Rank 5 (16 total)
compute14:rank5 PSM3_IDENTIFY CPU Core 147 NUMA 0 PID 37803
compute14:rank10 PSM3_IDENTIFY PSM3 v3.0-oneapi-ze built for IEFS OFA DELTA 11_5_0_0_172
compute14:rank10 PSM3_IDENTIFY location /usr/lib64/libfabric/libpsm3-fi.so
compute14:rank10 PSM3_IDENTIFY build date 2023-05-15T09:53:40
compute14:rank10 PSM3_IDENTIFY src checksum 2c3eb379fd92530cd927d9f8b08506d7387c1d59
compute14:rank10 PSM3_IDENTIFY git checksum 97fdceb01fc41231a0a29e1df3f0f8ba760facd7
compute14:rank10 PSM3_IDENTIFY HAL: verbs (RDMA Verbs (oneapi-ze)) built against rv interface v1.4 gpu v1.3 oneapi-ze
compute14:rank10 PSM3_IDENTIFY Global Rank 10 (16 total) Local Rank 10 (16 total)
compute14:rank10 PSM3_IDENTIFY CPU Core 71 NUMA 1 PID 37808
compute14:rank8 PSM3_IDENTIFY PSM3 v3.0-oneapi-ze built for IEFS OFA DELTA 11_5_0_0_172
compute14:rank8 PSM3_IDENTIFY location /usr/lib64/libfabric/libpsm3-fi.so
compute14:rank8 PSM3_IDENTIFY build date 2023-05-15T09:53:40
compute14:rank8 PSM3_IDENTIFY src checksum 2c3eb379fd92530cd927d9f8b08506d7387c1d59
compute14:rank8 PSM3_IDENTIFY git checksum 97fdceb01fc41231a0a29e1df3f0f8ba760facd7
compute14:rank8 PSM3_IDENTIFY HAL: verbs (RDMA Verbs (oneapi-ze)) built against rv interface v1.4 gpu v1.3 oneapi-ze
compute14:rank8 PSM3_IDENTIFY Global Rank 8 (16 total) Local Rank 8 (16 total)
compute14:rank8 PSM3_IDENTIFY CPU Core 56 NUMA 1 PID 37806
compute14:rank11 PSM3_IDENTIFY PSM3 v3.0-oneapi-ze built for IEFS OFA DELTA 11_5_0_0_172
compute14:rank11 PSM3_IDENTIFY location /usr/lib64/libfabric/libpsm3-fi.so
compute14:rank11 PSM3_IDENTIFY build date 2023-05-15T09:53:40
compute14:rank11 PSM3_IDENTIFY src checksum 2c3eb379fd92530cd927d9f8b08506d7387c1d59
compute14:rank11 PSM3_IDENTIFY git checksum 97fdceb01fc41231a0a29e1df3f0f8ba760facd7
compute14:rank11 PSM3_IDENTIFY HAL: verbs (RDMA Verbs (oneapi-ze)) built against rv interface v1.4 gpu v1.3 oneapi-ze
compute14:rank11 PSM3_IDENTIFY Global Rank 11 (16 total) Local Rank 11 (16 total)
compute14:rank11 PSM3_IDENTIFY CPU Core 189 NUMA 1 PID 37809
compute14:rank7 PSM3_IDENTIFY PSM3 v3.0-oneapi-ze built for IEFS OFA DELTA 11_5_0_0_172
compute14:rank7 PSM3_IDENTIFY location /usr/lib64/libfabric/libpsm3-fi.so
compute14:rank7 PSM3_IDENTIFY build date 2023-05-15T09:53:40
compute14:rank7 PSM3_IDENTIFY src checksum 2c3eb379fd92530cd927d9f8b08506d7387c1d59
compute14:rank7 PSM3_IDENTIFY git checksum 97fdceb01fc41231a0a29e1df3f0f8ba760facd7
compute14:rank7 PSM3_IDENTIFY HAL: verbs (RDMA Verbs (oneapi-ze)) built against rv interface v1.4 gpu v1.3 oneapi-ze
compute14:rank7 PSM3_IDENTIFY Global Rank 7 (16 total) Local Rank 7 (16 total)
compute14:rank7 PSM3_IDENTIFY CPU Core 161 NUMA 0 PID 37805
[0] MPI startup(): libfabric provider: psm3
compute14:rank0 PSM3_IDENTIFY PSM3 v3.0-oneapi-ze built for IEFS OFA DELTA 11_5_0_0_172
compute14:rank0 PSM3_IDENTIFY location /usr/lib64/libfabric/libpsm3-fi.so
compute14:rank0 PSM3_IDENTIFY build date 2023-05-15T09:53:40
compute14:rank0 PSM3_IDENTIFY src checksum 2c3eb379fd92530cd927d9f8b08506d7387c1d59
compute14:rank0 PSM3_IDENTIFY git checksum 97fdceb01fc41231a0a29e1df3f0f8ba760facd7
compute14:rank0 PSM3_IDENTIFY HAL: verbs (RDMA Verbs (oneapi-ze)) built against rv interface v1.4 gpu v1.3 oneapi-ze
compute14:rank0 PSM3_IDENTIFY Global Rank 0 (16 total) Local Rank 0 (16 total)
compute14:rank0 PSM3_IDENTIFY CPU Core 0 NUMA 0 PID 37798
compute14:rank3 PSM3_IDENTIFY PSM3 v3.0-oneapi-ze built for IEFS OFA DELTA 11_5_0_0_172
compute14:rank3 PSM3_IDENTIFY location /usr/lib64/libfabric/libpsm3-fi.so
compute14:rank3 PSM3_IDENTIFY build date 2023-05-15T09:53:40
compute14:rank3 PSM3_IDENTIFY src checksum 2c3eb379fd92530cd927d9f8b08506d7387c1d59
compute14:rank3 PSM3_IDENTIFY git checksum 97fdceb01fc41231a0a29e1df3f0f8ba760facd7
compute14:rank3 PSM3_IDENTIFY HAL: verbs (RDMA Verbs (oneapi-ze)) built against rv interface v1.4 gpu v1.3 oneapi-ze
compute14:rank3 PSM3_IDENTIFY Global Rank 3 (16 total) Local Rank 3 (16 total)
compute14:rank3 PSM3_IDENTIFY CPU Core 21 NUMA 0 PID 37801
compute14:rank5 PSM3_IDENTIFY run-time rv interface v1.4 user_mr gpu v1.3 oneapi-ze
compute14:rank12 PSM3_IDENTIFY run-time rv interface v1.4 user_mr gpu v1.3 oneapi-ze
compute14:rank9 PSM3_IDENTIFY run-time rv interface v1.4 user_mr gpu v1.3 oneapi-ze
compute14:rank13 PSM3_IDENTIFY run-time rv interface v1.4 user_mr gpu v1.3 oneapi-ze
compute14:rank14 PSM3_IDENTIFY run-time rv interface v1.4 user_mr gpu v1.3 oneapi-ze
compute14:rank15 PSM3_IDENTIFY run-time rv interface v1.4 user_mr gpu v1.3 oneapi-ze
compute14:rank8 PSM3_IDENTIFY run-time rv interface v1.4 user_mr gpu v1.3 oneapi-ze
compute14:rank10 PSM3_IDENTIFY run-time rv interface v1.4 user_mr gpu v1.3 oneapi-ze
compute14:rank7 PSM3_IDENTIFY run-time rv interface v1.4 user_mr gpu v1.3 oneapi-ze
compute14:rank0 PSM3_IDENTIFY run-time rv interface v1.4 user_mr gpu v1.3 oneapi-ze
compute14:rank2 PSM3_IDENTIFY run-time rv interface v1.4 user_mr gpu v1.3 oneapi-ze
compute14:rank5 PSM3_IDENTIFY NIC 0 (mlx5_0) Port 1 200000 Mbps NUMA 0 LID=13 GID=0xfe80000000000000:1070fd03005db094 QP=36105
compute14:rank12 PSM3_IDENTIFY NIC 1 (mlx5_1) Port 1 200000 Mbps NUMA 1 LID=7 GID=0xfe80000000000000:1070fd03005db118 QP=36105
compute14:rank4 PSM3_IDENTIFY run-time rv interface v1.4 user_mr gpu v1.3 oneapi-ze
compute14:rank9 PSM3_IDENTIFY NIC 1 (mlx5_1) Port 1 200000 Mbps NUMA 1 LID=7 GID=0xfe80000000000000:1070fd03005db118 QP=36106
compute14:rank11 PSM3_IDENTIFY run-time rv interface v1.4 user_mr gpu v1.3 oneapi-ze
compute14:rank1 PSM3_IDENTIFY run-time rv interface v1.4 user_mr gpu v1.3 oneapi-ze
compute14:rank13 PSM3_IDENTIFY NIC 1 (mlx5_1) Port 1 200000 Mbps NUMA 1 LID=7 GID=0xfe80000000000000:1070fd03005db118 QP=36107
compute14:rank14 PSM3_IDENTIFY NIC 1 (mlx5_1) Port 1 200000 Mbps NUMA 1 LID=7 GID=0xfe80000000000000:1070fd03005db118 QP=36108
compute14:rank3 PSM3_IDENTIFY run-time rv interface v1.4 user_mr gpu v1.3 oneapi-ze
compute14:rank6 PSM3_IDENTIFY run-time rv interface v1.4 user_mr gpu v1.3 oneapi-ze
compute14:rank15 PSM3_IDENTIFY NIC 1 (mlx5_1) Port 1 200000 Mbps NUMA 1 LID=7 GID=0xfe80000000000000:1070fd03005db118 QP=36109
compute14:rank8 PSM3_IDENTIFY NIC 1 (mlx5_1) Port 1 200000 Mbps NUMA 1 LID=7 GID=0xfe80000000000000:1070fd03005db118 QP=36110
compute14:rank10 PSM3_IDENTIFY NIC 1 (mlx5_1) Port 1 200000 Mbps NUMA 1 LID=7 GID=0xfe80000000000000:1070fd03005db118 QP=36111
compute14:rank7 PSM3_IDENTIFY NIC 0 (mlx5_0) Port 1 200000 Mbps NUMA 0 LID=13 GID=0xfe80000000000000:1070fd03005db094 QP=36106
compute14:rank0 PSM3_IDENTIFY NIC 0 (mlx5_0) Port 1 200000 Mbps NUMA 0 LID=13 GID=0xfe80000000000000:1070fd03005db094 QP=36107
compute14:rank2 PSM3_IDENTIFY NIC 0 (mlx5_0) Port 1 200000 Mbps NUMA 0 LID=13 GID=0xfe80000000000000:1070fd03005db094 QP=36108
compute14:rank11 PSM3_IDENTIFY NIC 1 (mlx5_1) Port 1 200000 Mbps NUMA 1 LID=7 GID=0xfe80000000000000:1070fd03005db118 QP=36112
compute14:rank4 PSM3_IDENTIFY NIC 0 (mlx5_0) Port 1 200000 Mbps NUMA 0 LID=13 GID=0xfe80000000000000:1070fd03005db094 QP=36109
compute14:rank1 PSM3_IDENTIFY NIC 0 (mlx5_0) Port 1 200000 Mbps NUMA 0 LID=13 GID=0xfe80000000000000:1070fd03005db094 QP=36110
compute14:rank6 PSM3_IDENTIFY NIC 0 (mlx5_0) Port 1 200000 Mbps NUMA 0 LID=13 GID=0xfe80000000000000:1070fd03005db094 QP=36112
compute14:rank3 PSM3_IDENTIFY NIC 0 (mlx5_0) Port 1 200000 Mbps NUMA 0 LID=13 GID=0xfe80000000000000:1070fd03005db094 QP=36111
[0] MPI startup(): File "/install/software/oneAPI/2023.2/mpi/2021.10.0/etc/tuning_spr_shm-ofi_psm3.dat" not found
[0] MPI startup(): Load tuning file: "/install/software/oneAPI/2023.2/mpi/2021.10.0/etc/tuning_spr_shm-ofi.dat"
[0] MPI startup(): Rank    Pid      Node name  Pin cpu
[0] MPI startup(): 0       37798    compute14  {0,1,2,3,4,5,6,112,113,114,115,116,117,118}
[0] MPI startup(): 1       37799    compute14  {7,8,9,10,11,12,13,119,120,121,122,123,124,125}
[0] MPI startup(): 2       37800    compute14  {14,15,16,17,18,19,20,126,127,128,129,130,131,132}
[0] MPI startup(): 3       37801    compute14  {21,22,23,24,25,26,27,133,134,135,136,137,138,139}
[0] MPI startup(): 4       37802    compute14  {28,29,30,31,32,33,34,140,141,142,143,144,145,146}
[0] MPI startup(): 5       37803    compute14  {35,36,37,38,39,40,41,147,148,149,150,151,152,153}
[0] MPI startup(): 6       37804    compute14  {42,43,44,45,46,47,48,154,155,156,157,158,159,160}
[0] MPI startup(): 7       37805    compute14  {49,50,51,52,53,54,55,161,162,163,164,165,166,167}
[0] MPI startup(): 8       37806    compute14  {56,57,58,59,60,61,62,168,169,170,171,172,173,174}
[0] MPI startup(): 9       37807    compute14  {63,64,65,66,67,68,69,175,176,177,178,179,180,181}
[0] MPI startup(): 10      37808    compute14  {70,71,72,73,74,75,76,182,183,184,185,186,187,188}
[0] MPI startup(): 11      37809    compute14  {77,78,79,80,81,82,83,189,190,191,192,193,194,195}
[0] MPI startup(): 12      37810    compute14  {84,85,86,87,88,89,90,196,197,198,199,200,201,202}
[0] MPI startup(): 13      37811    compute14  {91,92,93,94,95,96,97,203,204,205,206,207,208,209}
[0] MPI startup(): 14      37812    compute14  {98,99,100,101,102,103,104,210,211,212,213,214,215,216}
[0] MPI startup(): 15      37813    compute14  {105,106,107,108,109,110,111,217,218,219,220,221,222,223}
---
 Reference Paper             : The Journal of Chemical Physics 137, 134108 (2012)
 Version Number              : PSolver 1.9
 Timestamp of this run       : 2023-10-31 08:09:56.777
 Root process Hostname       : compute14
 Poisson Kernel Creation:
   Boundary Conditions       : Free
   Memory Requirements per MPI task:
     Density (MB)            :  128.00
     Kernel (MB)             :  129.51
     Full Grid Arrays (MB)   :  128.00
 Orbital repartition:
 -  [ 4,  4,  4,  4,  4,  4,  4,  4,  4,  4,  4,  4,  4,  4,  4,  4]
  #Exact exchange calculation:7%; Time (s): Elapsed=11.8420, Remaining=1.57E+02
  #Exact exchange calculation:19%; Time (s): Elapsed=30.9543, Remaining=1.32E+02
  #Exact exchange calculation:30%; Time (s): Elapsed=50.1323, Remaining=1.17E+02
  #Exact exchange calculation:42%; Time (s): Elapsed=69.3734, Remaining=96.
  #Exact exchange calculation:54%; Time (s): Elapsed=88.5751, Remaining=75.
  #Exact exchange calculation:65%; Time (s): Elapsed=107.7112, Remaining=58.
  #Exact exchange calculation:77%; Time (s): Elapsed=127.2925, Remaining=38.
  #Exact exchange calculation:88%; Time (s): Elapsed=146.5194, Remaining=20.
  #Exact exchange calculation:100%; Time (s): Elapsed=166.5478, Remaining=0.0
 Exact Exchange Energy       :  1.31115852415E+09
 Expected Exchange Energy    :  3.98942280401E-01
 Memory Consumption Report:
   Tot. No. of Allocations             :  1717
   Tot. No. of Deallocations           :  1717
   Remaining Memory (B)                :  0
   Memory occupation:
     Peak Value (MB)                   :  4640.215
     for the array                     : zt
     in the routine                    : null
     Memory Peak of process            : 5076.288 MB
 Walltime since initialization         :  00:02:50.643199059
 Max No. of dictionaries used          :  583 #( 241 still in use)
 Number of dictionary folders allocated:  1
