%YAML 1.1
%TAG !u! tag:unity3d.com,2011:
--- !u!114 &11400000
MonoBehaviour:
  m_ObjectHideFlags: 0
  m_CorrespondingSourceObject: {fileID: 0}
  m_PrefabInstance: {fileID: 0}
  m_PrefabAsset: {fileID: 0}
  m_GameObject: {fileID: 0}
  m_Enabled: 1
  m_EditorHideFlags: 0
  m_Script: {fileID: 11500000, guid: 979fe101ae35d9d43b6a4f5f3ed9e180, type: 3}
  m_Name: LockerIce
  m_EditorClassIdentifier: 
  points: 12
  sprite: {fileID: 21300000, guid: 128ec87572e0337419a8883a1dd771da, type: 3}
