%YAML 1.1
%TAG !u! tag:unity3d.com,2011:
--- !u!114 &11400000
MonoBehaviour:
  m_ObjectHideFlags: 0
  m_CorrespondingSourceObject: {fileID: 0}
  m_PrefabInstance: {fileID: 0}
  m_PrefabAsset: {fileID: 0}
  m_GameObject: {fileID: 0}
  m_Enabled: 1
  m_EditorHideFlags: 0
  m_Script: {fileID: 11500000, guid: 979fe101ae35d9d43b6a4f5f3ed9e180, type: 3}
  m_Name: LockerEarth
  m_EditorClassIdentifier: 
  points: 15
  sprite: {fileID: 21300000, guid: b534d7fe9900dc949868e685ca44a819, type: 3}
