{
  "props": {
    "columns": {
      "type": { "name": "arrayOf", "description": "Array&lt;object&gt;" },
      "required": true
    },
    "rows": {
      "type": { "name": "arrayOf", "description": "Array&lt;object&gt;" },
      "required": true
    },
    "aggregationFunctions": {
      "type": { "name": "object" },
      "default": "GRID_AGGREGATION_FUNCTIONS"
    },
    "aggregationModel": { "type": { "name": "object" } },
    "aggregationRowsScope": {
      "type": { "name": "enum", "description": "'all'<br>&#124;&nbsp;'filtered'" },
      "default": "\"filtered\""
    },
    "apiRef": { "type": { "name": "shape", "description": "{ current: object }" } },
    "aria-label": { "type": { "name": "string" } },
    "aria-labelledby": { "type": { "name": "string" } },
    "autoHeight": { "type": { "name": "bool" } },
    "autoPageSize": { "type": { "name": "bool" } },
    "cellModesModel": { "type": { "name": "object" } },
    "checkboxSelection": { "type": { "name": "bool" } },
    "checkboxSelectionVisibleOnly": {
      "type": { "name": "custom", "description": "bool" },
      "default": "false"
    },
    "classes": { "type": { "name": "object" } },
    "columnBuffer": { "type": { "name": "number" }, "default": "3" },
    "columnHeaderHeight": { "type": { "name": "number" }, "default": "56" },
    "columnThreshold": { "type": { "name": "number" }, "default": "3" },
    "columnVisibilityModel": { "type": { "name": "object" } },
    "components": {
      "type": { "name": "object" },
      "deprecated": true,
      "deprecationInfo": "Use the <code>slots</code> prop instead."
    },
    "componentsProps": {
      "type": { "name": "object" },
      "deprecated": true,
      "deprecationInfo": "Use the <code>slotProps</code> prop instead."
    },
    "defaultGroupingExpansionDepth": { "type": { "name": "number" }, "default": "0" },
    "density": {
      "type": {
        "name": "enum",
        "description": "'comfortable'<br>&#124;&nbsp;'compact'<br>&#124;&nbsp;'standard'"
      },
      "default": "\"standard\""
    },
    "detailPanelExpandedRowIds": {
      "type": { "name": "arrayOf", "description": "Array&lt;number<br>&#124;&nbsp;string&gt;" }
    },
    "disableAggregation": { "type": { "name": "bool" } },
    "disableChildrenFiltering": { "type": { "name": "bool" } },
    "disableChildrenSorting": { "type": { "name": "bool" } },
    "disableColumnFilter": { "type": { "name": "bool" } },
    "disableColumnMenu": { "type": { "name": "bool" } },
    "disableColumnPinning": { "type": { "name": "bool" } },
    "disableColumnReorder": { "type": { "name": "bool" } },
    "disableColumnResize": { "type": { "name": "bool" } },
    "disableColumnSelector": { "type": { "name": "bool" } },
    "disableDensitySelector": { "type": { "name": "bool" } },
    "disableMultipleColumnsFiltering": { "type": { "name": "bool" } },
    "disableMultipleColumnsSorting": { "type": { "name": "bool" } },
    "disableMultipleRowSelection": { "type": { "name": "bool" } },
    "disableRowGrouping": { "type": { "name": "bool" } },
    "disableRowSelectionOnClick": { "type": { "name": "bool" } },
    "disableVirtualization": { "type": { "name": "bool" } },
    "editMode": {
      "type": { "name": "enum", "description": "'cell'<br>&#124;&nbsp;'row'" },
      "default": "\"cell\""
    },
    "experimentalFeatures": {
      "type": {
        "name": "shape",
        "description": "{ columnGrouping?: bool, lazyLoading?: bool, rowPinning?: bool, warnIfFocusStateIsNotSynced?: bool }"
      }
    },
    "filterMode": {
      "type": { "name": "custom", "description": "'client'<br>&#124;&nbsp;'server'" },
      "default": "\"client\""
    },
    "filterModel": {
      "type": {
        "name": "shape",
        "description": "{ items: Array&lt;{ field: string, id?: number<br>&#124;&nbsp;string, operator: string, value?: any }&gt;, logicOperator?: 'and'<br>&#124;&nbsp;'or', quickFilterLogicOperator?: 'and'<br>&#124;&nbsp;'or', quickFilterValues?: array }"
      }
    },
    "getAggregationPosition": {
      "type": { "name": "func" },
      "default": "`(groupNode) => groupNode == null ? 'footer' : 'inline'`"
    },
    "getCellClassName": { "type": { "name": "func" } },
    "getDetailPanelContent": { "type": { "name": "func" } },
    "getDetailPanelHeight": { "type": { "name": "func" }, "default": "\"() => 500\"" },
    "getEstimatedRowHeight": { "type": { "name": "func" } },
    "getRowClassName": { "type": { "name": "func" } },
    "getRowHeight": { "type": { "name": "func" } },
    "getRowId": { "type": { "name": "func" } },
    "getRowSpacing": { "type": { "name": "func" } },
    "getTreeDataPath": { "type": { "name": "func" } },
    "groupingColDef": { "type": { "name": "union", "description": "func<br>&#124;&nbsp;object" } },
    "hideFooter": { "type": { "name": "bool" } },
    "hideFooterPagination": { "type": { "name": "bool" } },
    "hideFooterRowCount": {
      "type": { "name": "custom", "description": "bool" },
      "default": "false"
    },
    "hideFooterSelectedRowCount": { "type": { "name": "bool" } },
    "initialState": { "type": { "name": "object" } },
    "isCellEditable": { "type": { "name": "func" } },
    "isGroupExpandedByDefault": { "type": { "name": "func" } },
    "isRowSelectable": { "type": { "name": "func" } },
    "keepColumnPositionIfDraggedOutside": { "type": { "name": "bool" } },
    "keepNonExistentRowsSelected": { "type": { "name": "bool" } },
    "loading": { "type": { "name": "bool" } },
    "localeText": { "type": { "name": "object" } },
    "logger": {
      "type": {
        "name": "shape",
        "description": "{ debug: func, error: func, info: func, warn: func }"
      },
      "default": "console"
    },
    "logLevel": {
      "type": {
        "name": "enum",
        "description": "'debug'<br>&#124;&nbsp;'error'<br>&#124;&nbsp;'info'<br>&#124;&nbsp;'warn'<br>&#124;&nbsp;false"
      },
      "default": "\"error\" (\"warn\" in dev mode)"
    },
    "nonce": { "type": { "name": "string" } },
    "onAggregationModelChange": { "type": { "name": "func" } },
    "onCellClick": { "type": { "name": "func" } },
    "onCellDoubleClick": { "type": { "name": "func" } },
    "onCellEditStart": { "type": { "name": "func" } },
    "onCellEditStop": { "type": { "name": "func" } },
    "onCellKeyDown": { "type": { "name": "func" } },
    "onCellModesModelChange": { "type": { "name": "func" } },
    "onColumnHeaderClick": { "type": { "name": "func" } },
    "onColumnHeaderDoubleClick": { "type": { "name": "func" } },
    "onColumnHeaderEnter": { "type": { "name": "func" } },
    "onColumnHeaderLeave": { "type": { "name": "func" } },
    "onColumnHeaderOut": { "type": { "name": "func" } },
    "onColumnHeaderOver": { "type": { "name": "func" } },
    "onColumnOrderChange": { "type": { "name": "func" } },
    "onColumnResize": { "type": { "name": "func" } },
    "onColumnVisibilityModelChange": { "type": { "name": "func" } },
    "onColumnWidthChange": { "type": { "name": "func" } },
    "onDetailPanelExpandedRowIdsChange": { "type": { "name": "func" } },
    "onFetchRows": { "type": { "name": "func" } },
    "onFilterModelChange": { "type": { "name": "func" } },
    "onMenuClose": { "type": { "name": "func" } },
    "onMenuOpen": { "type": { "name": "func" } },
    "onPaginationModelChange": { "type": { "name": "func" } },
    "onPinnedColumnsChange": { "type": { "name": "func" } },
    "onPreferencePanelClose": { "type": { "name": "func" } },
    "onPreferencePanelOpen": { "type": { "name": "func" } },
    "onProcessRowUpdateError": { "type": { "name": "func" } },
    "onResize": { "type": { "name": "func" } },
    "onRowClick": { "type": { "name": "func" } },
    "onRowDoubleClick": { "type": { "name": "func" } },
    "onRowEditCommit": { "type": { "name": "func" } },
    "onRowEditStart": { "type": { "name": "func" } },
    "onRowEditStop": { "type": { "name": "func" } },
    "onRowGroupingModelChange": { "type": { "name": "func" } },
    "onRowModesModelChange": { "type": { "name": "func" } },
    "onRowOrderChange": { "type": { "name": "func" } },
    "onRowSelectionModelChange": { "type": { "name": "func" } },
    "onRowsScrollEnd": { "type": { "name": "func" } },
    "onSortModelChange": { "type": { "name": "func" } },
    "pageSizeOptions": {
      "type": { "name": "arrayOf", "description": "Array&lt;number&gt;" },
      "default": "[25, 50, 100]"
    },
    "pagination": { "type": { "name": "bool" } },
    "paginationMode": {
      "type": { "name": "enum", "description": "'client'<br>&#124;&nbsp;'server'" },
      "default": "\"client\""
    },
    "paginationModel": {
      "type": { "name": "shape", "description": "{ page: number, pageSize: number }" }
    },
    "pinnedColumns": {
      "type": {
        "name": "shape",
        "description": "{ left?: Array&lt;string&gt;, right?: Array&lt;string&gt; }"
      }
    },
    "pinnedRows": {
      "type": {
        "name": "shape",
        "description": "{ bottom?: Array&lt;object&gt;, top?: Array&lt;object&gt; }"
      }
    },
    "processRowUpdate": { "type": { "name": "func" } },
    "rowBuffer": { "type": { "name": "number" }, "default": "3" },
    "rowCount": { "type": { "name": "number" } },
    "rowGroupingColumnMode": {
      "type": { "name": "enum", "description": "'multiple'<br>&#124;&nbsp;'single'" },
      "default": "'single'"
    },
    "rowGroupingModel": { "type": { "name": "arrayOf", "description": "Array&lt;string&gt;" } },
    "rowHeight": { "type": { "name": "number" }, "default": "52" },
    "rowModesModel": { "type": { "name": "object" } },
    "rowReordering": { "type": { "name": "bool" } },
    "rowSelection": { "type": { "name": "bool" }, "default": "true" },
    "rowSelectionModel": {
      "type": {
        "name": "union",
        "description": "Array&lt;number<br>&#124;&nbsp;string&gt;<br>&#124;&nbsp;number<br>&#124;&nbsp;string"
      }
    },
    "rowsLoadingMode": {
      "type": { "name": "enum", "description": "'client'<br>&#124;&nbsp;'server'" }
    },
    "rowSpacingType": {
      "type": { "name": "enum", "description": "'border'<br>&#124;&nbsp;'margin'" },
      "default": "\"margin\""
    },
    "rowThreshold": { "type": { "name": "number" }, "default": "3" },
    "scrollbarSize": { "type": { "name": "number" } },
    "scrollEndThreshold": { "type": { "name": "number" }, "default": "80" },
    "showCellVerticalBorder": { "type": { "name": "bool" } },
    "showColumnVerticalBorder": { "type": { "name": "bool" } },
    "slotProps": { "type": { "name": "object" } },
    "slots": { "type": { "name": "object" } },
    "sortingMode": {
      "type": { "name": "enum", "description": "'client'<br>&#124;&nbsp;'server'" },
      "default": "\"client\""
    },
    "sortingOrder": {
      "type": { "name": "arrayOf", "description": "Array&lt;'asc'<br>&#124;&nbsp;'desc'&gt;" },
      "default": "['asc', 'desc', null]"
    },
    "sortModel": {
      "type": {
        "name": "arrayOf",
        "description": "Array&lt;{ field: string, sort?: 'asc'<br>&#124;&nbsp;'desc' }&gt;"
      }
    },
    "sx": {
      "type": {
        "name": "union",
        "description": "Array&lt;func<br>&#124;&nbsp;object<br>&#124;&nbsp;bool&gt;<br>&#124;&nbsp;func<br>&#124;&nbsp;object"
      }
    },
    "throttleRowsMs": { "type": { "name": "number" }, "default": "0" },
    "treeData": { "type": { "name": "bool" } },
    "unstable_cellSelection": { "type": { "name": "bool" } },
    "unstable_cellSelectionModel": { "type": { "name": "object" } },
    "unstable_onCellSelectionModelChange": { "type": { "name": "func" } }
  },
  "slots": {
    "baseButton": { "default": "Button", "type": { "name": "elementType" } },
    "baseCheckbox": { "default": "Checkbox", "type": { "name": "elementType" } },
    "baseFormControl": { "default": "FormControl", "type": { "name": "elementType" } },
    "baseIconButton": { "default": "IconButton", "type": { "name": "elementType" } },
    "basePopper": { "default": "Popper", "type": { "name": "elementType" } },
    "baseSelect": { "default": "Select", "type": { "name": "elementType" } },
    "baseSwitch": { "default": "Switch", "type": { "name": "elementType" } },
    "baseTextField": { "default": "TextField", "type": { "name": "elementType" } },
    "baseTooltip": { "default": "Tooltip", "type": { "name": "elementType" } },
    "booleanCellFalseIcon": { "default": "GridCloseIcon", "type": { "name": "elementType" } },
    "booleanCellTrueIcon": { "default": "GridCheckIcon", "type": { "name": "elementType" } },
    "cell": { "default": "GridCell", "type": { "name": "elementType" } },
    "columnFilteredIcon": { "default": "GridFilterAltIcon", "type": { "name": "elementType" } },
    "columnHeaderFilterIconButton": {
      "default": "GridColumnHeaderFilterIconButton",
      "type": { "name": "elementType" }
    },
    "columnMenu": { "default": "GridColumnMenu", "type": { "name": "elementType" } },
    "columnMenuAggregationIcon": {
      "default": "GridFunctionsIcon",
      "type": { "name": "elementType" }
    },
    "columnMenuClearIcon": { "default": "GridClearIcon", "type": { "name": "elementType" } },
    "columnMenuFilterIcon": { "default": "GridFilterAltIcon", "type": { "name": "elementType" } },
    "columnMenuGroupIcon": { "default": "GridGroupWorkIcon", "type": { "name": "elementType" } },
    "columnMenuHideIcon": { "default": "GridVisibilityOffIcon", "type": { "name": "elementType" } },
    "columnMenuIcon": {
      "default": "GridTripleDotsVerticalIcon",
      "type": { "name": "elementType" }
    },
    "columnMenuManageColumnsIcon": {
      "default": "GridViewColumnIcon",
      "type": { "name": "elementType" }
    },
    "columnMenuPinLeftIcon": {
      "default": "GridPushPinLeftIcon",
      "type": { "name": "elementType" }
    },
    "columnMenuPinRightIcon": {
      "default": "GridPushPinRightIcon",
      "type": { "name": "elementType" }
    },
    "columnMenuSortAscendingIcon": {
      "default": "GridArrowUpwardIcon",
      "type": { "name": "elementType" }
    },
    "columnMenuSortDescendingIcon": {
      "default": "GridArrowDownwardIcon",
      "type": { "name": "elementType" }
    },
    "columnMenuUngroupIcon": { "default": "GridWorkspacesIcon", "type": { "name": "elementType" } },
    "columnResizeIcon": { "default": "GridSeparatorIcon", "type": { "name": "elementType" } },
    "columnSelectorIcon": { "default": "GridColumnIcon", "type": { "name": "elementType" } },
    "columnSortedAscendingIcon": {
      "default": "GridArrowUpwardIcon",
      "type": { "name": "elementType | null" }
    },
    "columnSortedDescendingIcon": {
      "default": "GridArrowDownwardIcon",
      "type": { "name": "elementType | null" }
    },
    "columnsPanel": { "default": "GridColumnsPanel", "type": { "name": "elementType" } },
    "columnUnsortedIcon": {
      "default": "GridColumnUnsortedIcon",
      "type": { "name": "elementType | null" }
    },
    "densityComfortableIcon": {
      "default": "GridViewStreamIcon",
      "type": { "name": "elementType" }
    },
    "densityCompactIcon": { "default": "GridViewHeadlineIcon", "type": { "name": "elementType" } },
    "densityStandardIcon": { "default": "GridTableRowsIcon", "type": { "name": "elementType" } },
    "detailPanelCollapseIcon": { "default": "GridRemoveIcon", "type": { "name": "elementType" } },
    "detailPanelExpandIcon": { "default": "GridAddIcon", "type": { "name": "elementType" } },
    "exportIcon": { "default": "GridSaveAltIcon", "type": { "name": "elementType" } },
    "filterPanel": { "default": "GridFilterPanel", "type": { "name": "elementType" } },
    "filterPanelDeleteIcon": { "default": "GridCloseIcon", "type": { "name": "elementType" } },
    "footer": { "default": "GridFooter", "type": { "name": "elementType" } },
    "groupingCriteriaCollapseIcon": {
      "default": "GridExpandMoreIcon",
      "type": { "name": "elementType" }
    },
    "groupingCriteriaExpandIcon": {
      "default": "GridKeyboardArrowRight",
      "type": { "name": "elementType" }
    },
    "loadingOverlay": { "default": "GridLoadingOverlay", "type": { "name": "elementType" } },
    "moreActionsIcon": { "default": "GridMoreVertIcon", "type": { "name": "elementType" } },
    "noResultsOverlay": { "default": "GridNoResultsOverlay", "type": { "name": "elementType" } },
    "noRowsOverlay": { "default": "GridNoRowsOverlay", "type": { "name": "elementType" } },
    "openFilterButtonIcon": { "default": "GridFilterListIcon", "type": { "name": "elementType" } },
    "pagination": { "default": "Pagination", "type": { "name": "elementType | null" } },
    "panel": { "default": "GridPanel", "type": { "name": "elementType" } },
    "preferencesPanel": { "default": "GridPreferencesPanel", "type": { "name": "elementType" } },
    "quickFilterClearIcon": { "default": "GridCloseIcon", "type": { "name": "elementType" } },
    "quickFilterIcon": { "default": "GridSearchIcon", "type": { "name": "elementType" } },
    "row": { "default": "GridRow", "type": { "name": "elementType" } },
    "rowReorderIcon": { "default": "GridDragIcon", "type": { "name": "elementType" } },
    "skeletonCell": { "default": "GridSkeletonCell", "type": { "name": "elementType" } },
    "toolbar": { "default": "null", "type": { "name": "elementType | null" } },
    "treeDataCollapseIcon": { "default": "GridExpandMoreIcon", "type": { "name": "elementType" } },
    "treeDataExpandIcon": { "default": "GridKeyboardArrowRight", "type": { "name": "elementType" } }
  },
  "name": "DataGridPremium",
  "styles": {
    "classes": [
      "actionsCell",
      "aggregationColumnHeader",
      "aggregationColumnHeader--alignLeft",
      "aggregationColumnHeader--alignCenter",
      "aggregationColumnHeader--alignRight",
      "aggregationColumnHeaderLabel",
      "autoHeight",
      "booleanCell",
      "cell--editable",
      "cell--editing",
      "cell--textCenter",
      "cell--textLeft",
      "cell--textRight",
      "cell--withRenderer",
      "cell--rangeTop",
      "cell--rangeBottom",
      "cell--rangeLeft",
      "cell--rangeRight",
      "cell",
      "cellContent",
      "cellCheckbox",
      "cellSkeleton",
      "checkboxInput",
      "columnHeader--alignCenter",
      "columnHeader--alignLeft",
      "columnHeader--alignRight",
      "columnHeader--dragging",
      "columnHeader--moving",
      "columnHeader--numeric",
      "columnHeader--sortable",
      "columnHeader--sorted",
      "columnHeader--filtered",
      "columnHeader",
      "columnGroupHeader",
      "columnHeaderCheckbox",
      "columnHeaderDraggableContainer",
      "rowReorderCellPlaceholder",
      "columnHeaderDropZone",
      "columnHeaderTitle",
      "columnHeaderTitleContainer",
      "columnHeaderTitleContainerContent",
      "columnHeader--filledGroup",
      "columnHeader--emptyGroup",
      "columnHeader--showColumnBorder",
      "columnHeaders",
      "columnHeadersInner",
      "columnHeadersInner--scrollable",
      "columnSeparator--resizable",
      "columnSeparator--resizing",
      "columnSeparator--sideLeft",
      "columnSeparator--sideRight",
      "columnSeparator",
      "columnsPanel",
      "columnsPanelRow",
      "detailPanel",
      "detailPanels",
      "detailPanelToggleCell",
      "detailPanelToggleCell--expanded",
      "footerCell",
      "panel",
      "panelHeader",
      "panelWrapper",
      "panelContent",
      "panelFooter",
      "paper",
      "editBooleanCell",
      "filterForm",
      "filterFormDeleteIcon",
      "filterFormLogicOperatorInput",
      "filterFormColumnInput",
      "filterFormOperatorInput",
      "filterFormValueInput",
      "editInputCell",
      "filterIcon",
      "footerContainer",
      "iconButtonContainer",
      "iconSeparator",
      "main",
      "menu",
      "menuIcon",
      "menuIconButton",
      "menuOpen",
      "menuList",
      "overlayWrapper",
      "overlayWrapperInner",
      "overlay",
      "virtualScroller",
      "virtualScrollerContent",
      "virtualScrollerContent--overflowed",
      "virtualScrollerRenderZone",
      "pinnedColumns",
      "pinnedColumns--left",
      "pinnedColumns--right",
      "pinnedColumnHeaders",
      "pinnedColumnHeaders--left",
      "pinnedColumnHeaders--right",
      "root",
      "root--densityStandard",
      "root--densityComfortable",
      "root--densityCompact",
      "root--disableUserSelection",
      "row--editable",
      "row--editing",
      "row--dragging",
      "row--lastVisible",
      "row--dynamicHeight",
      "row--detailPanelExpanded",
      "row",
      "rowCount",
      "rowReorderCellContainer",
      "rowReorderCell",
      "rowReorderCell--draggable",
      "scrollArea",
      "scrollArea--left",
      "scrollArea--right",
      "selectedRowCount",
      "sortIcon",
      "toolbarContainer",
      "toolbarFilterList",
      "withBorderColor",
      "cell--withRightBorder",
      "columnHeader--withRightBorder",
      "treeDataGroupingCell",
      "treeDataGroupingCellToggle",
      "groupingCriteriaCell",
      "groupingCriteriaCellToggle",
      "pinnedRows",
      "pinnedRows--top",
      "pinnedRows--bottom",
      "pinnedRowsRenderZone"
    ],
    "globalClasses": {},
    "name": "MuiDataGrid"
  },
  "forwardsRefTo": "GridRoot",
  "filename": "/packages/grid/x-data-grid-premium/src/DataGridPremium/DataGridPremium.tsx",
  "demos": "<ul><li><a href=\"/x/react-data-grid/#commercial-version\">DataGridPremium</a></li></ul>",
  "packages": [{ "packageName": "@mui/x-data-grid-premium", "componentName": "DataGridPremium" }]
}
