module mymodule

go 1.17

require (
	github.com/bxcodec/faker/v3 v3.7.0
	github.com/go-pg/migrations/v8 v8.1.0
	github.com/go-pg/pg v8.0.7+incompatible
	github.com/go-pg/pg/v10 v10.10.6
	github.com/go-resty/resty/v2 v2.7.0
	github.com/google/uuid v1.3.0
	github.com/labstack/echo/v4 v4.6.1
	github.com/lib/pq v1.10.4
	github.com/rs/zerolog v1.26.1
	github.com/tylerb/graceful v1.2.15
	github.com/xuri/excelize/v2 v2.5.0
	golang.org/x/crypto v0.0.0-20220214200702-86341886e292
	gopkg.in/yaml.v2 v2.4.0
)

require (
	github.com/go-pg/zerochecker v0.2.0 // indirect
	github.com/golang-jwt/jwt v3.2.2+incompatible // indirect
	github.com/jinzhu/inflection v1.0.0 // indirect
	github.com/labstack/gommon v0.3.0 // indirect
	github.com/mattn/go-colorable v0.1.8 // indirect
	github.com/mattn/go-isatty v0.0.14 // indirect
	github.com/mohae/deepcopy v0.0.0-20170929034955-c48cc78d4826 // indirect
	github.com/richardlehane/mscfb v1.0.3 // indirect
	github.com/richardlehane/msoleps v1.0.1 // indirect
	github.com/tmthrgd/go-hex v0.0.0-20190904060850-447a3041c3bc // indirect
	github.com/valyala/bytebufferpool v1.0.0 // indirect
	github.com/valyala/fasttemplate v1.2.1 // indirect
	github.com/vmihailenco/bufpool v0.1.11 // indirect
	github.com/vmihailenco/msgpack/v5 v5.3.4 // indirect
	github.com/vmihailenco/tagparser v0.1.2 // indirect
	github.com/vmihailenco/tagparser/v2 v2.0.0 // indirect
	github.com/xuri/efp v0.0.0-20210322160811-ab561f5b45e3 // indirect
	golang.org/x/net v0.0.0-20211112202133-69e39bad7dc2 // indirect
	golang.org/x/sys v0.0.0-20210923061019-b8560ed6a9b7 // indirect
	golang.org/x/text v0.3.7 // indirect
	golang.org/x/time v0.0.0-20201208040808-7e3f01d25324 // indirect
	mellium.im/sasl v0.2.1 // indirect
)
