[
{
    "fuente": "400",
    "motherboard": "Generica",
    "procesador": "Intel Atom",
    "ram": "4",
    "disco_duro": "500",
    "teclado": "kb",
    "mouse": "ms"
},
{
    "fuente": "1200",
    "motherboard": "ASUS",
    "procesador": "Intel Core i9",
    "ram": "32",
    "disco_duro": "2000",
    "teclado": "kb",
    "mouse": "ms"
},
{
    "fuente": "800",
    "motherboard": "HP",
    "procesador": "Intel Core i5",
    "ram": "8",
    "disco_duro": "500",
    "teclado": "kb",
    "mouse": "ms"
},
{
    "fuente": "500",
    "motherboard": "HP",
    "procesador": "Intel Core i3",
    "ram": "16",
    "disco_duro": "512",
    "teclado": "kb",
    "mouse": "ms"
},
{
    "fuente": "500",
    "motherboard": "MSI",
    "procesador": "AMD Ryzen",
    "ram": "16",
    "disco_duro": "1024",
    "teclado": "kb",
    "mouse": "ms"
}
]