\relax 
\providecommand\hyper@newdestlabel[2]{}
\providecommand*{\memsetcounter}[2]{}
\providecommand\babel@aux[2]{}
\@nameuse{bbl@beforestart}
\catcode `"\active 
\catcode `-\active 
\providecommand\HyperFirstAtBeginDocument{\AtBeginDocument}
\HyperFirstAtBeginDocument{\ifx\hyper@anchor\@undefined
\global\let\oldcontentsline\contentsline
\gdef\contentsline#1#2#3#4{\oldcontentsline{#1}{#2}{#3}}
\global\let\oldnewlabel\newlabel
\gdef\newlabel#1#2{\newlabelxx{#1}#2}
\gdef\newlabelxx#1#2#3#4#5#6{\oldnewlabel{#1}{{#2}{#3}}}
\AtEndDocument{\ifx\hyper@anchor\@undefined
\let\contentsline\oldcontentsline
\let\newlabel\oldnewlabel
\fi}
\fi}
\global\let\hyper@last\relax 
\gdef\HyperFirstAtBeginDocument#1{#1}
\providecommand*\HyPL@Entry[1]{}
\HyPL@Entry{0<</S/D>>}
\@writefile{toc}{\changetocdepth  {3}}
\providecommand\@newglossary[4]{}
\@newglossary{main}{glg}{gls}{glo}
\@newglossary{acronym}{alg}{acr}{acn}
\providecommand\@glsorder[1]{}
\providecommand\@istfilename[1]{}
\@istfilename{DP_Prochazka_Matyas_2022.ist}
\@glsorder{word}
\babel@aux{czech}{}
\babel@aux{czech}{}
\HyPL@Entry{2<</S/r>>}
\babel@aux{english}{}
\babel@aux{czech}{}
\babel@aux{english}{}
\babel@aux{czech}{}
\HyPL@Entry{16<</S/D>>}
\@writefile{lof}{\addvspace {10pt}}
\@writefile{lot}{\addvspace {10pt}}
\@writefile{toc}{\contentsline {chapter}{{\' U}vod}{1}{chapter*.8}\protected@file@percent }
\@writefile{lof}{\addvspace {10pt}}
\@writefile{lot}{\addvspace {10pt}}
\@writefile{toc}{\contentsline {chapter}{\chapternumberline {1}Cíl práce}{3}{chapter.1}\protected@file@percent }
\citation{find_my}
\citation{apple}
\citation{zachranka}
\citation{walksafe}
\citation{personal_safety_android}
\citation{one_scream}
\citation{walksafe_ios}
\citation{walksafe}
\citation{personal_safety_android}
\@writefile{lof}{\addvspace {10pt}}
\@writefile{lot}{\addvspace {10pt}}
\@writefile{toc}{\contentsline {chapter}{\chapternumberline {2}Analýza požadavků}{5}{chapter.2}\protected@file@percent }
\@writefile{toc}{\contentsline {section}{\numberline {2.1}Existující řešení}{5}{section.2.1}\protected@file@percent }
\@writefile{toc}{\contentsline {subsection}{\numberline {2.1.1}Mobilní aplikace}{5}{subsection.2.1.1}\protected@file@percent }
\@writefile{toc}{\contentsline {subsubsection}{\numberline {2.1.1.1}WalkSafe}{5}{subsubsection.2.1.1.1}\protected@file@percent }
\citation{one_scream}
\citation{strut_safe}
\@writefile{toc}{\contentsline {subsubsection}{\numberline {2.1.1.2}Personal Safety}{6}{subsubsection.2.1.1.2}\protected@file@percent }
\@writefile{toc}{\contentsline {subsubsection}{\numberline {2.1.1.3}One Scream - Personal Safety}{6}{subsubsection.2.1.1.3}\protected@file@percent }
\@writefile{toc}{\contentsline {subsubsection}{\numberline {2.1.1.4}Další mobilní aplikace}{6}{subsubsection.2.1.1.4}\protected@file@percent }
\@writefile{toc}{\contentsline {subsection}{\numberline {2.1.2}Volání blízkým a infolinky}{6}{subsection.2.1.2}\protected@file@percent }
\@writefile{toc}{\contentsline {subsection}{\numberline {2.1.3}Shrnutí}{6}{subsection.2.1.3}\protected@file@percent }
\@writefile{toc}{\contentsline {section}{\numberline {2.2}Funkční požadavky}{7}{section.2.2}\protected@file@percent }
\newlabel{chap:functional_requirements}{{\M@TitleReference {2.2}{Funkční požadavky}}{7}{Funkční požadavky}{section.2.2}{}}
\@writefile{toc}{\contentsline {subsection}{\numberline {2.2.1}Profil uživatele}{7}{subsection.2.2.1}\protected@file@percent }
\@writefile{toc}{\contentsline {subsection}{\numberline {2.2.2}Nouzové kontakty}{7}{subsection.2.2.2}\protected@file@percent }
\@writefile{toc}{\contentsline {subsection}{\numberline {2.2.3}Oblíbené destinace}{7}{subsection.2.2.3}\protected@file@percent }
\@writefile{toc}{\contentsline {subsection}{\numberline {2.2.4}Sledování polohy}{7}{subsection.2.2.4}\protected@file@percent }
\@writefile{toc}{\contentsline {subsection}{\numberline {2.2.5}Módy interakce}{7}{subsection.2.2.5}\protected@file@percent }
\@writefile{toc}{\contentsline {subsubsection}{\numberline {2.2.5.1}Pravidelné reagování}{7}{subsubsection.2.2.5.1}\protected@file@percent }
\@writefile{toc}{\contentsline {subsubsection}{\numberline {2.2.5.2}Simulace hovoru}{7}{subsubsection.2.2.5.2}\protected@file@percent }
\@writefile{toc}{\contentsline {subsection}{\numberline {2.2.6}Stav baterie}{7}{subsection.2.2.6}\protected@file@percent }
\@writefile{toc}{\contentsline {subsection}{\numberline {2.2.7}Bezpečnost proti kompromitaci útočníkem}{8}{subsection.2.2.7}\protected@file@percent }
\@writefile{toc}{\contentsline {section}{\numberline {2.3}Nefunkční požadavky}{8}{section.2.3}\protected@file@percent }
\bibstyle{other/csn690.bst}
\bibdata{other/bibliography}
\@writefile{lof}{\addvspace {10pt}}
\@writefile{lot}{\addvspace {10pt}}
\@writefile{toc}{\contentsline {chapter}{Z{\' a}v{\v e}r}{9}{chapter*.9}\protected@file@percent }
\bibcite{find_my}{1}
\bibcite{walksafe_ios}{2}
\bibcite{walksafe}{3}
\bibcite{personal_safety_android}{4}
\@writefile{toc}{\contentsline {chapter}{Literatura}{11}{chapter*.10}\protected@file@percent }
\newlabel{tab:was:used:in:doc}{{\M@TitleReference {2.3}{Nefunkční požadavky}}{11}{Nefunkční požadavky}{chapter*.10}{}}
\memsetcounter{lastsheet}{27}
\memsetcounter{lastpage}{11}
\gdef \@abspage@last{27}
